siren,nic,siret,statutDiffusionEtablissement,dateCreationEtablissement,trancheEffectifsEtablissement,anneeEffectifsEtablissement,activitePrincipaleRegistreMetiersEtablissement,dateDernierTraitementEtablissement,etablissementSiege,nombrePeriodesEtablissement,complementAdresseEtablissement,numeroVoieEtablissement,indiceRepetitionEtablissement,typeVoieEtablissement,libelleVoieEtablissement,codePostalEtablissement,libelleCommuneEtablissement,libelleCommuneEtrangerEtablissement,distributionSpecialeEtablissement,codeCommuneEtablissement,codeCedexEtablissement,libelleCedexEtablissement,codePaysEtrangerEtablissement,libellePaysEtrangerEtablissement,complementAdresse2Etablissement,numeroVoie2Etablissement,indiceRepetition2Etablissement,typeVoie2Etablissement,libelleVoie2Etablissement,codePostal2Etablissement,libelleCommune2Etablissement,libelleCommuneEtranger2Etablissement,distributionSpeciale2Etablissement,codeCommune2Etablissement,codeCedex2Etablissement,libelleCedex2Etablissement,codePaysEtranger2Etablissement,libellePaysEtranger2Etablissement,dateDebut,etatAdministratifEtablissement,enseigne1Etablissement,enseigne2Etablissement,enseigne3Etablissement,denominationUsuelleEtablissement,activitePrincipaleEtablissement,nomenclatureActivitePrincipaleEtablissement,caractereEmployeurEtablissement,longitude,latitude,geo_score,geo_type,geo_adresse,geo_id,geo_ligne,geo_l4,geo_l5
213601883,00019,21360188300019,O,1983-03-01,02,2020,,2022-08-29T09:07:00,true,4,,,,RTE,DE CHATILLON,36700,SAINT-CYRAN-DU-JAMBOT,,,36188,,,,,,,,,,,,,,,,,,,2008-01-01,A,MAIRIE,,,,84.11Z,NAFRev2,O,1.139978,47.017698,0.83,street,Route de Chatillon 36700 Saint-Cyran-du-Jambot,36188_0005,G,ROUTE DE CHATILLON,
213601883,00035,21360188300035,O,1997-01-01,NN,,,2019-11-14T14:00:35,false,4,MAIRIE,,,,,36700,SAINT-CYRAN-DU-JAMBOT,,,36188,,,,,,,,,,,,,,,,,,,2012-12-25,F,SERVICE RAMASSAGE ORDURES MENAGERES,,,,38.11Z,NAFRev2,N,1.138769,47.017158,0.37,street,Place du 8 Mai et du 11 Novembre 36700 Saint-Cyran-du-Jambot,36188_l53pae,D,PLACE DU 8 MAI ET DU 11 NOVEMBRE,
263601056,00017,26360105600017,O,1992-01-01,NN,,,2019-11-14T14:00:35,true,3,MAIRIE,6,,RTE,DE CHATILLON,36700,SAINT-CYRAN-DU-JAMBOT,,,36188,,,,,,,,,,,,,,,,,,,2008-01-01,A,CCAS,,,,88.99B,NAFRev2,N,1.139774,47.017399,0.84,housenumber,6 Route de Chatillon 36700 Saint-Cyran-du-Jambot,36188_0005_00006,G,6 ROUTE DE CHATILLON,
300119120,00016,30011912000016,O,1900-01-01,NN,,,2022-03-22T03:54:03,true,4,,,,,LA GARENNE,36700,SAINT-CYRAN-DU-JAMBOT,,,36188,,,,,,,,,,,,,,,,,,,2020-12-31,F,,,,,68.20B,NAFRev2,N,2.8927434,43.2852275,0.9,poi.park,La Garenne (Parc) Mirepeisset,https://osm.org/way/236460923,G,,
302821541,00018,30282154100018,O,,,,,2019-11-14T14:00:35,true,1,,,,,,36700,SAINT-CYRAN-DU-JAMBOT,,,36188,,,,,,,,,,,,,,,,,,,1984-12-25,F,,,,,67.12,NAP,N,,,0,,,,,,
305198970,00017,30519897000017,O,1900-01-01,,,,2019-11-14T14:00:35,false,4,,,,,,36700,SAINT-CYRAN-DU-JAMBOT,,,36188,,,,,,,,,,,,,,,,,,,1993-03-01,F,,,,,50.2Z,NAF1993,N,,,0,,,,,,
305198970,00025,30519897000025,O,1993-03-01,NN,,,2019-11-14T14:00:35,true,6,,10,,RUE,ST ELOI,36700,SAINT-CYRAN-DU-JAMBOT,,,36188,,,,,,,,,,,,,,,,,,,2017-12-31,F,,,,,45.20A,NAFRev2,O,1.138482,47.016765,0.82,housenumber,10 Rue Saint-Eloi 36700 Saint-Cyran-du-Jambot,36188_0050_00010,G,10 RUE SAINT ELOI,
311464549,00014,31146454900014,O,,,,,2019-11-14T14:00:35,true,1,,,,,LE BOURG,36700,SAINT-CYRAN-DU-JAMBOT,,,36188,,,,,,,,,,,,,,,,,,,1984-12-25,F,,,,,67.05,NAP,N,1.174402,47.015685,0.6,street,Le Bouquineau 36700 Saint-Cyran-du-Jambot,36188_7lwe9a,G,LE BOUQUINEAU,
313802902,00012,31380290200012,O,,NN,,,2019-11-14T14:00:35,true,1,,,,,CHAUDENAY,36700,SAINT-CYRAN-DU-JAMBOT,,,36188,,,,,,,,,,,,,,,,,,,1996-12-16,F,,,,,01.3Z,NAF1993,O,4.800217,46.923882,0.9,poi.castle,(Château) Chaudenay,https://osm.org/way/225943925,G,,
320861412,00049,32086141200049,O,2000-04-01,NN,,,2019-11-14T14:00:35,true,3,,,,,LE CHEROU,36700,SAINT-CYRAN-DU-JAMBOT,,,36188,,,,,,,,,,,,,,,,,,,2008-01-01,A,,,,,68.20B,NAFRev2,N,1.139978,47.017698,0.38,street,Route de Chatillon 36700 Saint-Cyran-du-Jambot,36188_0005,G,ROUTE DE CHATILLON,
324867241,00014,32486724100014,O,,NN,,,2019-11-14T14:00:35,true,1,,,,,LE BOURG,36700,SAINT-CYRAN-DU-JAMBOT,,,36188,,,,,,,,,,,,,,,,,,,,F,,,,,62.11,NAP,N,1.174402,47.015685,0.6,street,Le Bouquineau 36700 Saint-Cyran-du-Jambot,36188_7lwe9a,G,LE BOUQUINEAU,
325322899,00015,32532289900015,O,,,,,2019-11-14T14:00:35,true,1,,,,LD,RAZERAY,36700,SAINT-CYRAN-DU-JAMBOT,,,36188,,,,,,,,,,,,,,,,,,,1997-08-31,F,,,,,01.1A,NAF1993,N,1.1289099,47.019512,0.88,poi.track,Chemin Rural de Razeray Saint-Cyran-du-Jambot,https://osm.org/way/207390205,G,,
325908036,00016,32590803600016,O,1982-09-22,NN,,,2019-11-14T14:00:35,false,3,,,,,LA MOTTE BLANCHE,36700,SAINT-CYRAN-DU-JAMBOT,,,36188,,,,,,,,,,,,,,,,,,,2003-11-25,F,,,,,01.4A,NAFRev1,N,1.182094,47.028784,0.93,locality,La Motte Blanche 36700 Saint-Cyran-du-Jambot,36188_B038,G,LA MOTTE BLANCHE,
326387313,00017,32638731300017,O,1983-01-01,NN,,,2019-11-14T14:00:35,true,3,,,,,LA TOUCHE,36700,SAINT-CYRAN-DU-JAMBOT,,,36188,,,,,,,,,,,,,,,,,,,2008-01-01,A,,,,,01.42Z,NAFRev2,N,1.182094,47.028784,0.46,locality,La Motte Blanche 36700 Saint-Cyran-du-Jambot,36188_B038,G,LA MOTTE BLANCHE,
328690243,00048,32869024300048,O,1991-07-10,NN,,,2019-11-14T14:00:35,false,4,,7,,RUE,SAINT ELOI,36700,SAINT-CYRAN-DU-JAMBOT,,,36188,,,,,,,,,,,,,,,,,,,2003-05-31,F,,,,,51.1R,NAFRev1,N,1.139049,47.016363,0.94,housenumber,7 Rue Saint-Eloi 36700 Saint-Cyran-du-Jambot,36188_0050_00007,G,7 RUE SAINT ELOI,
333086916,00017,33308691600017,O,,,,,2019-11-14T14:00:35,true,1,,,,LD,SIMONETIERE,36700,SAINT-CYRAN-DU-JAMBOT,,,36188,,,,,,,,,,,,,,,,,,,1986-12-31,F,,,,,01.80,NAP,N,1.169968,47.006056,0.32,street,La Rigaudiere 36700 Saint-Cyran-du-Jambot,36188_1ucyem,G,LA RIGAUDIERE,
333248169,00018,33324816900018,O,,NN,,,2019-11-14T14:00:35,true,1,,,,,LE BOURG,36700,SAINT-CYRAN-DU-JAMBOT,,,36188,,,,,,,,,,,,,,,,,,,1988-05-31,F,,,,,67.01,NAP,N,1.174402,47.015685,0.6,street,Le Bouquineau 36700 Saint-Cyran-du-Jambot,36188_7lwe9a,G,LE BOUQUINEAU,
338253131,10240,33825313110240,O,2007-01-01,02,2020,,2022-08-29T09:24:54,false,2,LYCEE AGRICOLE PRIVE ST CYRAN,1,,RTE,DE CHATILLON,36700,SAINT-CYRAN-DU-JAMBOT,,,36188,,,,,,,,,,,,,,,,,,,2008-01-01,A,,,,,56.29B,NAFRev2,O,1.137895,47.017597,0.84,housenumber,1 Route de Chatillon 36700 Saint-Cyran-du-Jambot,36188_0005_00001,G,1 ROUTE DE CHATILLON,
345196232,00010,34519623200010,O,1983-04-05,NN,,,2022-03-22T03:54:03,true,4,,,,,LA GARENNE,36700,SAINT-CYRAN-DU-JAMBOT,,,36188,,,,,,,,,,,,,,,,,,,2020-12-31,F,,,,,68.20B,NAFRev2,N,2.8927434,43.2852275,0.9,poi.park,La Garenne (Parc) Mirepeisset,https://osm.org/way/236460923,G,,
345196422,00017,34519642200017,O,1983-04-05,NN,,,2022-03-22T03:54:02,true,4,,,,,LA GARENNE,36700,SAINT-CYRAN-DU-JAMBOT,,,36188,,,,,,,,,,,,,,,,,,,2020-12-31,F,,,,,68.20B,NAFRev2,N,2.8927434,43.2852275,0.9,poi.park,La Garenne (Parc) Mirepeisset,https://osm.org/way/236460923,G,,
345196463,00011,34519646300011,O,1983-04-05,NN,,,2019-11-14T14:00:35,true,4,,,,,LA GARENNE,36700,SAINT-CYRAN-DU-JAMBOT,,,36188,,,,,,,,,,,,,,,,,,,2012-12-25,F,,,,,68.20B,NAFRev2,N,2.8927434,43.2852275,0.9,poi.park,La Garenne (Parc) Mirepeisset,https://osm.org/way/236460923,G,,
345197222,00010,34519722200010,O,1983-04-05,NN,,,2022-03-22T03:54:03,true,4,,,,,LA GARENNE,36700,SAINT-CYRAN-DU-JAMBOT,,,36188,,,,,,,,,,,,,,,,,,,2020-12-31,F,,,,,68.20B,NAFRev2,N,2.8927434,43.2852275,0.9,poi.park,La Garenne (Parc) Mirepeisset,https://osm.org/way/236460923,G,,
345372668,00011,34537266800011,O,,,,,2019-11-14T14:00:35,true,1,,,,,LE BOURG,36700,SAINT-CYRAN-DU-JAMBOT,,,36188,,,,,,,,,,,,,,,,,,,1990-06-30,F,,,,,67.07,NAP,N,1.174402,47.015685,0.6,street,Le Bouquineau 36700 Saint-Cyran-du-Jambot,36188_7lwe9a,G,LE BOUQUINEAU,
347565178,00014,34756517800014,O,1988-05-30,00,2020,9529ZD,2022-08-29T09:29:55,true,5,,,,,LA GARENNE,36700,SAINT-CYRAN-DU-JAMBOT,,,36188,,,,,,,,,,,,,,,,,,,2021-06-30,F,,,,,25.40Z,NAFRev2,O,2.8927434,43.2852275,0.9,poi.park,La Garenne (Parc) Mirepeisset,https://osm.org/way/236460923,G,,
348073040,00050,34807304000050,O,2020-08-24,,,,2021-02-23T11:00:54,true,1,,6,,ALL,DE MIGNY,36700,SAINT-CYRAN-DU-JAMBOT,,,36188,,,,,,,,,,,,,,,,,,,2020-08-24,A,,,,LES JARDINS DE NATHALIE,47.89Z,NAFRev2,N,1.139588,47.015508,0.82,housenumber,6 Allée de Migny 36700 Saint-Cyran-du-Jambot,36188_0030_00006,G,6 ALLEE DE MIGNY,
379390321,00014,37939032100014,O,1990-09-05,NN,,,2019-11-14T14:00:35,true,4,,,,,LE BOURG,36700,SAINT-CYRAN-DU-JAMBOT,,,36188,,,,,,,,,,,,,,,,,,,2012-12-31,F,,,,,56.10A,NAFRev2,N,1.174402,47.015685,0.6,street,Le Bouquineau 36700 Saint-Cyran-du-Jambot,36188_7lwe9a,G,LE BOUQUINEAU,
382252518,00016,38225251800016,O,1991-05-30,NN,,,2019-11-14T14:00:35,false,3,LYCEE AGRICOLE,4,,RTE,DE CHATILLON,36700,SAINT-CYRAN-DU-JAMBOT,,,36188,,,,,,,,,,,,,,,,,,,1992-07-01,F,CENTRE EQUESTRE,,,,92.6C,NAF1993,N,1.138841,47.017205,0.84,housenumber,4 Route de Chatillon 36700 Saint-Cyran-du-Jambot,36188_0005_00004,G,4 ROUTE DE CHATILLON,
382817757,00018,38281775700018,O,1991-08-10,NN,,,2019-11-14T14:00:35,true,3,,,,,CHAUDENAY,36700,SAINT-CYRAN-DU-JAMBOT,,,36188,,,,,,,,,,,,,,,,,,,2008-01-01,A,,,,,02.20Z,NAFRev2,N,4.800217,46.923882,0.9,poi.castle,(Château) Chaudenay,https://osm.org/way/225943925,G,,
389313198,00019,38931319800019,O,1992-05-06,NN,,,2019-11-14T14:00:35,true,3,LYCEE AGRICOLE,,,RTE,DE CHATILLON,36700,SAINT-CYRAN-DU-JAMBOT,,,36188,,,,,,,,,,,,,,,,,,,2008-01-01,A,,,,,85.51Z,NAFRev2,N,1.139978,47.017698,0.83,street,Route de Chatillon 36700 Saint-Cyran-du-Jambot,36188_0005,G,ROUTE DE CHATILLON,
391837630,00014,39183763000014,O,1993-07-01,NN,,,2019-11-14T14:00:35,true,3,,,,LD,LA MOTTE BLANCHE,36700,SAINT-CYRAN-DU-JAMBOT,,,36188,,,,,,,,,,,,,,,,,,,2008-01-01,A,,,,,01.11Z,NAFRev2,N,1.182094,47.028784,0.93,locality,La Motte Blanche 36700 Saint-Cyran-du-Jambot,36188_B038,G,LA MOTTE BLANCHE,
394051528,00013,39405152800013,O,1993-09-19,,,,2019-11-14T14:00:35,true,1,,,,,LA FOLIE,36700,SAINT-CYRAN-DU-JAMBOT,,,36188,,,,,,,,,,,,,,,,,,,1997-08-31,F,,,,,01.1A,NAF1993,N,1.169968,47.006056,0.31,street,La Rigaudiere 36700 Saint-Cyran-du-Jambot,36188_1ucyem,G,LA RIGAUDIERE,
405280546,00012,40528054600012,O,1981-01-01,NN,,,2019-11-14T14:00:35,true,1,,,,,,36700,SAINT-CYRAN-DU-JAMBOT,,,36188,,,,,,,,,,,,,,,,,,,2000-09-30,F,,,,,01.3Z,NAF1993,N,,,0,,,,,,
405280553,00018,40528055300018,O,1981-01-01,NN,,,2019-11-14T14:00:35,true,4,LA MOTTE BLANCHE,,,,,36700,SAINT-CYRAN-DU-JAMBOT,,,36188,,,,,,,,,,,,,,,,,,,1997-12-31,F,,,,,01.1A,NAF1993,N,1.182094,47.028784,0.93,locality,La Motte Blanche 36700 Saint-Cyran-du-Jambot,36188_B038,D,LA MOTTE BLANCHE,
409879244,00013,40987924400013,O,1900-01-01,NN,,,2019-11-14T14:00:35,false,3,,,,,VAL DU MOULIN,36700,SAINT-CYRAN-DU-JAMBOT,,,36188,,,,,,,,,,,,,,,,,,,1996-12-25,F,,,,,51.1T,NAF1993,N,1.129954,47.018361,0.94,street,Val du Moulin 36700 Saint-Cyran-du-Jambot,36188_B072,G,VAL DU MOULIN,
410260657,00011,41026065700011,O,1996-12-16,01,2019,,2021-10-27T08:33:42,true,3,,,,,CHAUDENAY,36700,SAINT-CYRAN-DU-JAMBOT,,,36188,,,,,,,,,,,,,,,,,,,2008-01-01,A,,,,,01.11Z,NAFRev2,N,4.800217,46.923882,0.9,poi.castle,(Château) Chaudenay,https://osm.org/way/225943925,G,,
413418328,00014,41341832800014,O,1997-07-01,01,2020,,2022-08-29T09:29:55,true,4,,,,LD,LA MOTTE BLANCHE,36700,SAINT-CYRAN-DU-JAMBOT,,,36188,,,,,,,,,,,,,,,,,,,2012-12-31,A,,,,,01.50Z,NAFRev2,O,1.182094,47.028784,0.93,locality,La Motte Blanche 36700 Saint-Cyran-du-Jambot,36188_B038,G,LA MOTTE BLANCHE,
430878199,00016,43087819900016,O,1979-01-01,NN,,,2019-11-14T14:00:35,true,3,,,,,LE CHAT HUANT,36700,SAINT-CYRAN-DU-JAMBOT,,,36188,,,,,,,,,,,,,,,,,,,2008-01-01,A,,,,,01.42Z,NAFRev2,N,2.3467577,48.8519708,0.89,poi.jewelry,Le Chat Huant (Bijouterie) Paris,https://osm.org/node/3350340194,G,,
431964345,00018,43196434500018,O,2000-07-05,NN,,4322AZ,2019-11-14T14:00:35,true,5,,10,,,VAL DU MOULIN,36700,SAINT-CYRAN-DU-JAMBOT,,,36188,,,,,,,,,,,,,,,,,,,2015-12-31,F,,,,,43.22A,NAFRev2,O,1.129166,47.018525,0.94,housenumber,10 Val du Moulin 36700 Saint-Cyran-du-Jambot,36188_b072_00010,G,10 VAL DU MOULIN,
433511250,00014,43351125000014,O,2000-10-03,NN,,,2019-11-14T14:00:35,true,4,,3,,RTE,DE FLERE,36700,SAINT-CYRAN-DU-JAMBOT,,,36188,,,,,,,,,,,,,,,,,,,2003-09-30,F,,,,,93.0N,NAFRev1,N,1.137127,47.017114,0.82,housenumber,3 Route de Fléré 36700 Saint-Cyran-du-Jambot,36188_0020_00003,G,3 ROUTE DE FLERE,
433805686,00014,43380568600014,O,2000-11-01,NN,,,2019-11-14T14:00:35,false,3,,5,,RUE,DES CHEVRES,36700,SAINT-CYRAN-DU-JAMBOT,,,36188,,,,,,,,,,,,,,,,,,,2003-10-01,F,C.B.I,,,,45.2J,NAFRev1,O,1.140108,47.016545,0.94,housenumber,5 Rue des Chèvres 36700 Saint-Cyran-du-Jambot,36188_0010_00005,G,5 RUE DES CHEVRES,
435157854,00017,43515785400017,O,2001-01-01,NN,,,2019-11-14T14:00:35,true,1,,5,,RUE,DES CHEVRES,36700,SAINT-CYRAN-DU-JAMBOT,,,36188,,,,,,,,,,,,,,,,,,,2001-01-01,F,,,,,74.1J,NAF1993,N,1.140108,47.016545,0.94,housenumber,5 Rue des Chèvres 36700 Saint-Cyran-du-Jambot,36188_0010_00005,G,5 RUE DES CHEVRES,
438818619,00027,43881861900027,O,2009-03-10,,,,2021-02-23T13:19:21,true,1,,1,,,LE VAL AUX BOEUFS,36700,SAINT-CYRAN-DU-JAMBOT,,,36188,,,,,,,,,,,,,,,,,,,2009-03-10,A,,,,,33.12Z,NAFRev2,N,1.120392,47.024033,0.51,locality,Val au Boeuf 36700 Saint-Cyran-du-Jambot,36188_B069,G,VAL AU BOEUF,
439377060,00025,43937706000025,O,2020-06-02,,,5610CQ,2022-10-05T09:39:52,true,3,,11,,RUE,SAINT-ELOI,36700,SAINT-CYRAN-DU-JAMBOT,,,36188,,,,,,,,,,,,,,,,,,,2022-07-31,A,,,,LE PETIT SAINT-CYRAN,56.30Z,NAFRev2,N,1.139297,47.016132,0.94,housenumber,11 Rue Saint-Eloi 36700 Saint-Cyran-du-Jambot,36188_0050_00011,G,11 RUE SAINT ELOI,
444069371,00029,44406937100029,O,2004-11-08,NN,,,2019-11-14T14:00:35,false,3,,,,,LE CHEROU,36700,SAINT-CYRAN-DU-JAMBOT,,,36188,,,,,,,,,,,,,,,,,,,2007-06-12,F,,,,,70.2A,NAFRev1,N,1.139978,47.017698,0.38,street,Route de Chatillon 36700 Saint-Cyran-du-Jambot,36188_0005,G,ROUTE DE CHATILLON,
499073914,00016,49907391400016,O,2007-07-05,,,,2019-11-14T14:00:35,true,2,,,,,LA GARENNE,36700,SAINT-CYRAN-DU-JAMBOT,,,36188,,,,,,,,,,,,,,,,,,,2008-01-01,A,,,,,68.20B,NAFRev2,N,2.8927434,43.2852275,0.9,poi.park,La Garenne (Parc) Mirepeisset,https://osm.org/way/236460923,G,,
501989883,00019,50198988300019,O,2008-01-07,,,,2019-11-14T14:00:35,true,2,,,,,LE BOUQUINEAU,36700,SAINT-CYRAN-DU-JAMBOT,,,36188,,,,,,,,,,,,,,,,,,,2009-08-31,F,JMJ COUVERTURE,,,,43.91B,NAFRev2,N,1.174402,47.015685,0.93,street,Le Bouquineau 36700 Saint-Cyran-du-Jambot,36188_7lwe9a,G,LE BOUQUINEAU,
505026344,00018,50502634400018,O,2008-07-10,,,2370ZZ,2020-01-24T09:06:09,true,3,,1,,,LA FOLIE,36700,SAINT-CYRAN-DU-JAMBOT,,,36188,,,,,,,,,,,,,,,,,,,2019-12-06,A,,,,GUITTON AMELIE,23.70Z,NAFRev2,N,1.170712,47.006999,0.43,housenumber,1 La Rigaudiere 36700 Saint-Cyran-du-Jambot,36188_1ucyem_00001,G,1 LA RIGAUDIERE,
509466231,00016,50946623100016,O,2009-01-05,NN,,,2019-11-14T14:00:35,false,3,,9,,RUE,CHEVRES,36700,SAINT-CYRAN-DU-JAMBOT,,,36188,,,,,,,,,,,,,,,,,,,2016-01-31,F,,,,,81.30Z,NAFRev2,O,1.139908,47.016821,0.87,housenumber,9 Rue des Chèvres 36700 Saint-Cyran-du-Jambot,36188_0010_00009,G,9 RUE DES CHEVRES,
509573465,00010,50957346500010,O,2008-12-01,,,,2021-02-23T15:16:06,true,2,,,,LD,LA TOUCHE,36700,SAINT-CYRAN-DU-JAMBOT,,,36188,,,,,,,,,,,,,,,,,,,2016-04-23,A,,,,,68.20B,NAFRev2,N,1.182094,47.028784,0.46,locality,La Motte Blanche 36700 Saint-Cyran-du-Jambot,36188_B038,G,LA MOTTE BLANCHE,
509735668,00014,50973566800014,O,2008-11-17,,,,2019-11-14T14:00:35,true,3,,1,,RUE,DES CHEVRES,36700,SAINT-CYRAN-DU-JAMBOT,,,36188,,,,,,,,,,,,,,,,,,,2009-09-08,A,,,,,47.99A,NAFRev2,N,1.139929,47.016362,0.94,housenumber,1 Rue des Chèvres 36700 Saint-Cyran-du-Jambot,36188_0010_00001,G,1 RUE DES CHEVRES,
510989510,00019,51098951000019,O,2009-03-01,,,,2019-11-14T14:00:35,true,1,,7,,ALL,DE MIGNY,36700,SAINT-CYRAN-DU-JAMBOT,,,36188,,,,,,,,,,,,,,,,,,,2009-03-01,A,,,,,96.09Z,NAFRev2,N,1.139735,47.015332,0.82,housenumber,7 Allée de Migny 36700 Saint-Cyran-du-Jambot,36188_0030_00007,G,7 ALLEE DE MIGNY,
511024853,00034,51102485300034,O,2017-11-01,,,,2021-02-23T15:19:00,true,2,LES ECURIES DE ST CYRAN,,,LD,MIGNY,36700,SAINT-CYRAN-DU-JAMBOT,,,36188,,,,,,,,,,,,,,,,,,,2017-11-01,A,,,,,01.43Z,NAFRev2,N,1.139883,47.015247,0.91,street,Allée de Migny 36700 Saint-Cyran-du-Jambot,36188_0030,G,ALLEE DE MIGNY,
511653792,00016,51165379200016,O,2009-04-06,,,,2019-11-14T14:00:35,true,2,,,,,VAL AUX BOEUFS,36700,SAINT-CYRAN-DU-JAMBOT,,,36188,,,,,,,,,,,,,,,,,,,2014-12-19,F,,,,,82.99Z,NAFRev2,N,1.120392,47.024033,0.64,locality,Val au Boeuf 36700 Saint-Cyran-du-Jambot,36188_B069,G,VAL AU BOEUF,
520340464,00012,52034046400012,O,2010-01-01,NN,,4312AZ,2020-08-25T10:34:33,true,3,,,,,LA MOTTE BLANCHE,36700,SAINT-CYRAN-DU-JAMBOT,,,36188,,,,,,,,,,,,,,,,,,,2018-10-31,F,,,,,43.12A,NAFRev2,O,1.182094,47.028784,0.93,locality,La Motte Blanche 36700 Saint-Cyran-du-Jambot,36188_B038,G,LA MOTTE BLANCHE,
523634913,00017,52363491300017,O,1975-08-29,02,2020,,2022-08-29T09:26:06,true,1,,,,,CHAUDENAY,36700,SAINT-CYRAN-DU-JAMBOT,,,36188,,,,,,,,,,,,,,,,,,,1975-08-29,A,,,,,01.49Z,NAFRev2,N,4.800217,46.923882,0.9,poi.castle,(Château) Chaudenay,https://osm.org/way/225943925,G,,
527703904,00013,52770390400013,O,2007-11-15,,,,2019-11-14T14:00:35,true,1,L.E.A.P,,,,ST CYRAN DU JAMBOT,36700,SAINT-CYRAN-DU-JAMBOT,,,36188,,,,,,,,,,,,,,,,,,,2007-11-15,A,,,,,94.99Z,NAFRev2,N,1.138747,47.016417,0.83,street,Rue Saint-Eloi 36700 Saint-Cyran-du-Jambot,36188_0050,G,RUE SAINT ELOI,
527771539,00022,52777153900022,O,2011-01-21,,,,2022-01-28T03:34:57,true,2,,,,,LA RIGAUDIERE,36700,SAINT-CYRAN-DU-JAMBOT,,,36188,,,,,,,,,,,,,,,,,,,2022-01-26,F,,,,,32.12Z,NAFRev2,N,1.169968,47.006056,0.94,street,La Rigaudiere 36700 Saint-Cyran-du-Jambot,36188_1ucyem,G,LA RIGAUDIERE,
528664915,00014,52866491500014,O,2010-11-01,,,,2019-11-14T14:00:35,true,1,,,,,ROUILLE COUTEAU,36700,SAINT-CYRAN-DU-JAMBOT,,,36188,,,,,,,,,,,,,,,,,,,2010-11-01,A,,,,,68.32A,NAFRev2,N,1.163001,47.029645,0.93,locality,Rouille Couteau 36700 Saint-Cyran-du-Jambot,36188_B062,G,ROUILLE COUTEAU,
530773621,00012,53077362100012,O,2011-01-01,,,,2019-11-14T14:00:35,true,1,,,,LD,ROUILLE COUTEAU,36700,SAINT-CYRAN-DU-JAMBOT,,,36188,,,,,,,,,,,,,,,,,,,2011-01-01,A,,,,,01.43Z,NAFRev2,N,1.163001,47.029645,0.93,locality,Rouille Couteau 36700 Saint-Cyran-du-Jambot,36188_B062,G,ROUILLE COUTEAU,
662032606,11133,66203260611133,O,1989-07-10,,,,2019-11-14T14:00:35,false,4,,,,,,36700,SAINT-CYRAN-DU-JAMBOT,,BP 327,36188,92307,LEVALLOIS PERRET CEDEX,,,,,,,,,,,,,,,,,1992-08-30,F,LYCEE AGRICOLE DE SAINT CYRAN,,,,55.5A,NAF1993,N,,,0,,,,,,
750798506,00010,75079850600010,O,2012-04-04,,,,2019-11-14T14:00:35,true,2,,,,,LA TOUCHE,36700,SAINT-CYRAN-DU-JAMBOT,,,36188,,,,,,,,,,,,,,,,,,,2012-10-22,F,,,,,75.00Z,NAFRev2,N,1.182094,47.028784,0.46,locality,La Motte Blanche 36700 Saint-Cyran-du-Jambot,36188_B038,G,LA MOTTE BLANCHE,
750851255,00018,75085125500018,O,2011-12-27,,,,2019-11-14T14:00:35,true,1,,12,,RUE,DES CHEVRES,36700,SAINT-CYRAN-DU-JAMBOT,,,36188,,,,,,,,,,,,,,,,,,,2011-12-27,A,,,,,68.20B,NAFRev2,N,1.140352,47.016704,0.94,housenumber,12 Rue des Chèvres 36700 Saint-Cyran-du-Jambot,36188_0010_00012,G,12 RUE DES CHEVRES,
752881318,00022,75288131800022,O,2014-02-17,,,,2019-11-14T14:00:35,true,1,,11,,RUE,SAINT ELOI,36700,SAINT-CYRAN-DU-JAMBOT,,,36188,,,,,,,,,,,,,,,,,,,2014-02-17,A,,,,,56.10C,NAFRev2,N,1.139297,47.016132,0.94,housenumber,11 Rue Saint-Eloi 36700 Saint-Cyran-du-Jambot,36188_0050_00011,G,11 RUE SAINT ELOI,
775190713,00039,77519071300039,O,2018-09-01,,,,2021-02-23T16:11:52,false,1,COLLEGE SAINT JOSEPH,1,,RTE,DE CHATILLON,36700,SAINT-CYRAN-DU-JAMBOT,,,36188,,,,,,,,,,,,,,,,,,,2018-09-01,A,,,,,85.31Z,NAFRev2,N,1.137895,47.017597,0.84,housenumber,1 Route de Chatillon 36700 Saint-Cyran-du-Jambot,36188_0005_00001,G,1 ROUTE DE CHATILLON,
775221674,00010,77522167400010,O,,,,,2019-11-14T14:00:35,true,1,,,,,,36700,SAINT-CYRAN-DU-JAMBOT,,,36188,,,,,,,,,,,,,,,,,,,1984-12-25,F,,,,,65.06,NAP,N,,,0,,,,,,
775221682,00013,77522168200013,O,,,,,2019-11-14T14:00:35,true,1,,,,,,36700,SAINT-CYRAN-DU-JAMBOT,,,36188,,,,,,,,,,,,,,,,,,,1984-12-25,F,,,,,55.40,NAP,N,,,0,,,,,,
775221690,00016,77522169000016,O,,,,,2019-11-14T14:00:35,true,1,,,,,LA GARENNE,36700,SAINT-CYRAN-DU-JAMBOT,,,36188,,,,,,,,,,,,,,,,,,,1984-12-25,F,,,,,64.49,NAP,N,2.8927434,43.2852275,0.9,poi.park,La Garenne (Parc) Mirepeisset,https://osm.org/way/236460923,G,,
775221732,00016,77522173200016,O,1900-01-01,21,2020,,2022-08-29T09:44:13,true,4,,,,,,36700,SAINT-CYRAN-DU-JAMBOT,,,36188,,,,,,,,,,,,,,,,,,,2012-12-31,A,,,,,85.32Z,NAFRev2,O,,,0,,,,,,
775221740,00019,77522174000019,O,1900-01-01,NN,,,2019-11-14T14:00:35,true,3,,,,,,36700,SAINT-CYRAN-DU-JAMBOT,,,36188,,,,,,,,,,,,,,,,,,,2008-01-01,A,,,,,94.99Z,NAFRev2,N,,,0,,,,,,
790357479,00019,79035747900019,O,2013-01-02,,,,2019-11-14T14:00:35,true,2,,,,RUE,ST ELOI,36700,SAINT-CYRAN-DU-JAMBOT,,,36188,,,,,,,,,,,,,,,,,,,2013-05-31,F,BAR L'ETRIER,,,L'ETRIER,56.30Z,NAFRev2,N,1.138747,47.016417,0.79,street,Rue Saint-Eloi 36700 Saint-Cyran-du-Jambot,36188_0050,G,RUE SAINT ELOI,
791714074,00014,79171407400014,O,2005-02-02,,,,2020-11-25T10:58:30,false,2,,,,,LA MOTTE BLANCHE,36700,SAINT-CYRAN-DU-JAMBOT,,,36188,,,,,,,,,,,,,,,,,,,2019-03-14,F,,,,,94.11Z,NAFRev2,N,1.182094,47.028784,0.93,locality,La Motte Blanche 36700 Saint-Cyran-du-Jambot,36188_B038,G,LA MOTTE BLANCHE,
793730219,00011,79373021900011,O,2013-06-12,,,,2019-11-14T14:00:35,true,1,,,,,CHAUDENAY,36700,SAINT-CYRAN-DU-JAMBOT,,,36188,,,,,,,,,,,,,,,,,,,2013-06-12,A,,,,,68.20B,NAFRev2,N,4.800217,46.923882,0.9,poi.castle,(Château) Chaudenay,https://osm.org/way/225943925,G,,
794205823,00014,79420582300014,O,2013-07-10,00,2020,4391BZ,2022-08-29T09:51:51,true,4,,,,,ROUILLE COUTEAU,36700,SAINT-CYRAN-DU-JAMBOT,,,36188,,,,,,,,,,,,,,,,,,,2017-09-04,A,EIRL CAILLER CEDRIC,,,,43.91B,NAFRev2,O,1.163001,47.029645,0.93,locality,Rouille Couteau 36700 Saint-Cyran-du-Jambot,36188_B062,G,ROUILLE COUTEAU,
795406073,00010,79540607300010,O,2009-06-29,,,,2019-11-14T14:00:35,true,1,,,,,LA RIGAUDIERE,36700,SAINT-CYRAN-DU-JAMBOT,,,36188,,,,,,,,,,,,,,,,,,,2009-06-29,A,,,,,82.99Z,NAFRev2,N,1.169968,47.006056,0.94,street,La Rigaudiere 36700 Saint-Cyran-du-Jambot,36188_1ucyem,G,LA RIGAUDIERE,
798932794,00018,79893279400018,O,2013-11-12,,,,2019-11-14T14:00:35,true,1,,,,,LA FOLIE,36700,SAINT-CYRAN-DU-JAMBOT,,,36188,,,,,,,,,,,,,,,,,,,2013-11-12,A,,,,,68.20B,NAFRev2,N,1.169968,47.006056,0.31,street,La Rigaudiere 36700 Saint-Cyran-du-Jambot,36188_1ucyem,G,LA RIGAUDIERE,
813830908,00014,81383090800014,O,2011-09-01,,,,2020-02-07T11:37:02,true,2,,,,,LE VAL AU BOEUF,36700,SAINT-CYRAN-DU-JAMBOT,,,36188,,,,,,,,,,,,,,,,,,,2019-06-30,F,,,,,68.20A,NAFRev2,N,1.120392,47.024033,0.78,locality,Val au Boeuf 36700 Saint-Cyran-du-Jambot,36188_B069,G,VAL AU BOEUF,
814687810,00022,81468781000022,O,2016-02-23,NN,,5610CR,2021-01-21T08:50:22,false,3,,,,,ROUILLE-COUTEAU,36700,SAINT-CYRAN-DU-JAMBOT,,,36188,,,,,,,,,,,,,,,,,,,2020-12-10,F,DELICES DES FETES,,,DELICES DES FETES,56.10C,NAFRev2,O,1.163001,47.029645,0.93,locality,Rouille Couteau 36700 Saint-Cyran-du-Jambot,36188_B062,G,ROUILLE COUTEAU,
815912407,00013,81591240700013,O,1959-01-01,NN,,,2019-11-14T14:00:35,true,4,,,,LD,SIMONETIERE,36700,SAINT-CYRAN-DU-JAMBOT,,,36188,,,,,,,,,,,,,,,,,,,2010-08-09,F,,,,,68.20B,NAFRev2,N,1.169968,47.006056,0.32,street,La Rigaudiere 36700 Saint-Cyran-du-Jambot,36188_1ucyem,G,LA RIGAUDIERE,
819905134,00014,81990513400014,O,2016-04-23,,,,2019-11-14T14:00:35,true,1,,,,LD,LA TOUCHE,36700,SAINT-CYRAN-DU-JAMBOT,,,36188,,,,,,,,,,,,,,,,,,,2016-04-23,A,,,,,01.42Z,NAFRev2,N,1.182094,47.028784,0.46,locality,La Motte Blanche 36700 Saint-Cyran-du-Jambot,36188_B038,G,LA MOTTE BLANCHE,
820429751,00010,82042975100010,O,2015-01-01,,,,2019-11-14T14:00:35,true,1,,,,LD,RAZERAY,36700,SAINT-CYRAN-DU-JAMBOT,,,36188,,,,,,,,,,,,,,,,,,,2015-01-01,A,,,,,02.10Z,NAFRev2,N,1.1289099,47.019512,0.88,poi.track,Chemin Rural de Razeray Saint-Cyran-du-Jambot,https://osm.org/way/207390205,G,,