siren,nic,siret,statutDiffusionEtablissement,dateCreationEtablissement,trancheEffectifsEtablissement,anneeEffectifsEtablissement,activitePrincipaleRegistreMetiersEtablissement,dateDernierTraitementEtablissement,etablissementSiege,nombrePeriodesEtablissement,complementAdresseEtablissement,numeroVoieEtablissement,indiceRepetitionEtablissement,typeVoieEtablissement,libelleVoieEtablissement,codePostalEtablissement,libelleCommuneEtablissement,libelleCommuneEtrangerEtablissement,distributionSpecialeEtablissement,codeCommuneEtablissement,codeCedexEtablissement,libelleCedexEtablissement,codePaysEtrangerEtablissement,libellePaysEtrangerEtablissement,complementAdresse2Etablissement,numeroVoie2Etablissement,indiceRepetition2Etablissement,typeVoie2Etablissement,libelleVoie2Etablissement,codePostal2Etablissement,libelleCommune2Etablissement,libelleCommuneEtranger2Etablissement,distributionSpeciale2Etablissement,codeCommune2Etablissement,codeCedex2Etablissement,libelleCedex2Etablissement,codePaysEtranger2Etablissement,libellePaysEtranger2Etablissement,dateDebut,etatAdministratifEtablissement,enseigne1Etablissement,enseigne2Etablissement,enseigne3Etablissement,denominationUsuelleEtablissement,activitePrincipaleEtablissement,nomenclatureActivitePrincipaleEtablissement,caractereEmployeurEtablissement,longitude,latitude,geo_score,geo_type,geo_adresse,geo_id,geo_ligne,geo_l4,geo_l5
200015477,00017,20001547700017,O,2008-04-14,,,,2019-11-14T14:00:45,true,2,MAIRIE,2,,RUE,DE L'ORME,55000,LONGEVILLE-EN-BARROIS,,,55302,,,,,,,,,,,,,,,,,,,2016-05-12,F,,,,,42.99Z,NAFRev2,N,5.210821,48.740428,0.95,housenumber,2 Rue de l’Orme 55000 Longeville-en-Barrois,55302_0086_00002,G,2 RUE DE L ORME,
215503020,00012,21550302000012,O,1983-03-01,11,2020,,2022-08-29T09:07:45,true,4,,2,,RUE,DE L ORME,55000,LONGEVILLE-EN-BARROIS,,,55302,,,,,,,,,,,,,,,,,,,2008-01-01,A,MAIRIE,,,,84.11Z,NAFRev2,O,5.210821,48.740428,0.95,housenumber,2 Rue de l’Orme 55000 Longeville-en-Barrois,55302_0086_00002,G,2 RUE DE L ORME,
215503020,00020,21550302000020,O,1983-12-21,03,2020,,2022-08-29T09:07:45,false,3,,14,,RUE,DES ALLIES,55000,LONGEVILLE-EN-BARROIS,,,55302,,,,,,,,,,,,,,,,,,,2008-01-01,A,ECOLE PRIMAIRE PUBLIQUE,,,,85.20Z,NAFRev2,N,5.211068,48.742169,0.95,housenumber,14 Rue des Alliés 55000 Longeville-en-Barrois,55302_0007_00014,G,14 RUE DES ALLIES,
215503020,00038,21550302000038,O,1983-12-21,NN,,,2019-11-14T14:00:45,false,3,,14,,RUE,DES ALLIES,55000,LONGEVILLE-EN-BARROIS,,,55302,,,,,,,,,,,,,,,,,,,2005-08-31,F,ECOLE MATERNELLE PUBLIQUE,,,,80.1Z,NAFRev1,N,5.211068,48.742169,0.95,housenumber,14 Rue des Alliés 55000 Longeville-en-Barrois,55302_0007_00014,G,14 RUE DES ALLIES,
215503020,00046,21550302000046,O,1995-12-25,NN,,,2019-11-14T14:00:45,false,3,,2,,RUE,ORME,55000,LONGEVILLE-EN-BARROIS,,,55302,,,,,,,,,,,,,,,,,,,2012-12-25,F,SCE ASSAINISSEMENT,,,,37.00Z,NAFRev2,N,5.210821,48.740428,0.86,housenumber,2 Rue de l’Orme 55000 Longeville-en-Barrois,55302_0086_00002,G,2 RUE DE L ORME,
215503020,00053,21550302000053,O,2001-01-01,NN,,,2019-11-14T14:00:45,false,4,,2,,RUE,DE L'ORME,55000,LONGEVILLE-EN-BARROIS,,,55302,,,,,,,,,,,,,,,,,,,2012-12-25,F,LOTISSEMENT,,,,42.99Z,NAFRev2,N,5.210821,48.740428,0.95,housenumber,2 Rue de l’Orme 55000 Longeville-en-Barrois,55302_0086_00002,G,2 RUE DE L ORME,
265501734,00015,26550173400015,O,1992-01-01,NN,,,2019-11-14T14:00:45,true,4,MAIRIE,,,,GRANDE RUE,55000,LONGEVILLE-EN-BARROIS,,,55302,,,,,,,,,,,,,,,,,,,2016-01-01,F,CCAS,,,,88.99B,NAFRev2,N,5.209212,48.740758,0.95,street,Grande Rue 55000 Longeville-en-Barrois,55302_0048,G,GRANDE RUE,
265507921,00012,26550792100012,O,1992-01-01,NN,,,2019-11-14T14:00:45,true,3,MAIRIE,,,,GRANDE RUE,55000,LONGEVILLE-EN-BARROIS,,,55302,,,,,,,,,,,,,,,,,,,2008-01-01,A,CDE,,,,88.99B,NAFRev2,N,5.209212,48.740758,0.95,street,Grande Rue 55000 Longeville-en-Barrois,55302_0048,G,GRANDE RUE,
275501161,00010,27550116100010,O,,,,,2019-11-14T14:00:45,true,1,,,,,,55000,LONGEVILLE-EN-BARROIS,,,55302,,,,,,,,,,,,,,,,,,,1995-12-25,F,,,,,90.0A,NAF1993,N,,,0,,,,,,
300976982,00011,30097698200011,O,1974-01-01,NN,,,2019-11-14T14:00:45,true,1,,,,RUE,SAINT HILAIRE,55000,LONGEVILLE-EN-BARROIS,,,55302,,,,,,,,,,,,,,,,,,,2002-09-30,F,,,,,45.4C,NAF1993,N,5.204403,48.744251,0.95,street,Rue Saint-Hilaire 55000 Longeville-en-Barrois,55302_0109,G,RUE SAINT HILAIRE,
300978384,00026,30097838400026,O,1900-01-01,NN,,9602AA,2019-11-14T14:00:45,true,4,,,,PL,BELLEVUE,55000,LONGEVILLE-EN-BARROIS,,,55302,,,,,,,,,,,,,,,,,,,2015-12-31,F,,,,,96.02A,NAFRev2,N,5.209239,48.742106,0.34,street,Rue de la Ruelle 55000 Longeville-en-Barrois,55302_0102,G,RUE DE LA RUELLE,
300978418,00014,30097841800014,O,1974-01-01,NN,,,2019-11-14T14:00:45,true,4,,,,RUE,SAINT HILAIRE,55000,LONGEVILLE-EN-BARROIS,,,55302,,,,,,,,,,,,,,,,,,,2006-05-31,F,,,,,45.2J,NAFRev1,N,5.204403,48.744251,0.95,street,Rue Saint-Hilaire 55000 Longeville-en-Barrois,55302_0109,G,RUE SAINT HILAIRE,
301462164,00015,30146216400015,O,1974-01-01,NN,,,2019-11-14T14:00:45,true,1,,,,RUE,SAINT HILAIRE,55000,LONGEVILLE-EN-BARROIS,,,55302,,,,,,,,,,,,,,,,,,,2002-09-30,F,,,,,45.4C,NAF1993,N,5.204403,48.744251,0.95,street,Rue Saint-Hilaire 55000 Longeville-en-Barrois,55302_0109,G,RUE SAINT HILAIRE,
302020532,00107,30202053200107,O,1990-01-09,02,2020,,2022-08-29T09:11:26,false,5,,,,,ROUTE DE LIGNY,55000,LONGEVILLE-EN-BARROIS,,,55302,,,,,,,,,,,,,,,,,,,2008-01-01,A,,,,,46.61Z,NAFRev2,O,5.205194,48.753304,0.57,street,Route de Resson 55000 Longeville-en-Barrois,55302_avk0ns,G,ROUTE DE RESSON,
309857217,00033,30985721700033,O,1994-09-01,12,2020,,2022-08-29T09:13:14,false,3,,,,CHE,DE L'USINE UTARD,55000,LONGEVILLE-EN-BARROIS,,,55302,,,,,,,,,,,,,,,,,,,2008-01-01,A,,,,,29.20Z,NAFRev2,O,,,0,,,,,,
310186689,00025,31018668900025,O,,,,,2019-11-14T14:00:45,true,1,,9,,RTE,DE SAVONNIERES,55000,LONGEVILLE-EN-BARROIS,,,55302,,,,,,,,,,,,,,,,,,,1985-12-25,F,,,,,84.12,NAP,N,5.201878,48.742384,0.82,housenumber,9 Rue de Savonnières 55000 Longeville-en-Barrois,55302_0114_00009,G,9 RUE DE SAVONNIERES,
310711635,00022,31071163500022,O,1983-08-16,,,,2019-11-14T14:00:45,true,4,,,,RTE,DE BAR,55000,LONGEVILLE-EN-BARROIS,,,55302,,,,,,,,,,,,,,,,,,,2008-01-01,A,,,,,43.39Z,NAFRev2,N,5.209392,48.74383,0.7,street,Rue de Bar 55000 Longeville-en-Barrois,55302_0013,G,RUE DE BAR,
310952478,00017,31095247800017,O,,NN,,,2019-11-14T14:00:45,true,1,,3,,RUE,FONTAINE,55000,LONGEVILLE-EN-BARROIS,,,55302,,,,,,,,,,,,,,,,,,,1994-12-31,F,,,,,70.2C,NAF1993,N,5.207917,48.741541,0.88,housenumber,3 Rue de la Fontaine 55000 Longeville-en-Barrois,55302_0044_00003,G,3 RUE DE LA FONTAINE,
312087000,00021,31208700000021,O,,NN,,,2019-11-14T14:00:45,true,1,,,,RTE,DE BAR LE DUC,55000,LONGEVILLE-EN-BARROIS,,,55302,,,,,,,,,,,,,,,,,,,1989-01-31,F,,,,,81.21,NAP,N,5.209392,48.74383,0.57,street,Rue de Bar 55000 Longeville-en-Barrois,55302_0013,G,RUE DE BAR,
312616808,00019,31261680800019,O,,NN,,,2019-11-14T14:00:45,true,1,,,,RTE,DE BAR LE DUC,55000,LONGEVILLE-EN-BARROIS,,,55302,,,,,,,,,,,,,,,,,,,,F,,,,,59.08,NAP,N,5.209392,48.74383,0.57,street,Rue de Bar 55000 Longeville-en-Barrois,55302_0013,G,RUE DE BAR,
314844135,00017,31484413500017,O,1900-01-01,,,,2019-11-14T14:00:45,true,4,,1,,RUE,DU PAQUIS,55000,LONGEVILLE-EN-BARROIS,,,55302,,,,,,,,,,,,,,,,,,,1993-02-19,F,,,,,60.2L,NAF1993,N,5.205757,48.742654,0.95,housenumber,1 Rue du Paquis 55000 Longeville-en-Barrois,55302_0092_00001,G,1 RUE DU PAQUIS,
315239756,00010,31523975600010,O,1979-01-01,NN,,,2019-11-14T14:00:45,true,3,,47,,RUE,GRANDE,55000,LONGEVILLE-EN-BARROIS,,,55302,,,,,,,,,,,,,,,,,,,2004-12-06,F,,,,,85.1C,NAFRev1,N,5.209212,48.740758,0.73,street,Grande Rue 55000 Longeville-en-Barrois,55302_0048,G,GRANDE RUE,
316447366,00022,31644736600022,O,,NN,,,2019-11-14T14:00:45,true,1,,7,,RUE,DU PAQUIS,55000,LONGEVILLE-EN-BARROIS,,,55302,,,,,,,,,,,,,,,,,,,1996-12-31,F,,,,,64.1C,NAF1993,O,5.205566,48.743013,0.95,housenumber,7 Rue du Paquis 55000 Longeville-en-Barrois,55302_0092_00007,G,7 RUE DU PAQUIS,
318142692,00017,31814269200017,O,1900-01-01,NN,,,2019-11-14T14:00:45,true,5,,2,,RUE,DE L ABSALE,55000,LONGEVILLE-EN-BARROIS,,,55302,,,,,,,,,,,,,,,,,,,2010-09-20,A,,,,,95.22Z,NAFRev2,N,5.209813,48.744111,0.9,housenumber,2 Rue de l’Absalle 55000 Longeville-en-Barrois,55302_0001_00002,G,2 RUE DE L ABSALLE,
318183522,00024,31818352200024,O,1994-10-01,NN,,,2019-11-14T14:00:45,true,1,,5,,RUE,DE LA RUELLE,55000,LONGEVILLE-EN-BARROIS,,,55302,,,,,,,,,,,,,,,,,,,1999-06-30,F,,,,,15.8C,NAF1993,O,5.208533,48.741586,0.95,housenumber,5 Rue de la Ruelle 55000 Longeville-en-Barrois,55302_0102_00005,G,5 RUE DE LA RUELLE,
319052932,00039,31905293200039,O,,NN,,,2019-11-14T14:00:45,true,1,,,,,RN 135,55000,LONGEVILLE-EN-BARROIS,,,55302,,,,,,,,,,,,,,,,,,,1993-08-10,F,,,,,45.3F,NAF1993,N,,,0,,,,,,
320182413,00015,32018241300015,O,1980-10-01,NN,,,2019-11-14T14:00:45,true,5,,,,CHE,DE L ABSALLE,55000,LONGEVILLE-EN-BARROIS,,,55302,,,,,,,,,,,,,,,,,,,2005-03-15,F,,,,,20.1A,NAFRev1,N,5.210427,48.744508,0.78,street,Rue de l’Absalle 55000 Longeville-en-Barrois,55302_0001,G,RUE DE L ABSALLE,
322045683,00354,32204568300354,O,2021-12-01,,,,2021-12-06T14:13:07,false,1,ZAC DE LA GRANDE TERRE,5,,,AVENUE DES ROMAINS,55000,LONGEVILLE-EN-BARROIS,,,55302,,,,,,,,,,,,,,,,,,,2021-12-01,A,BUT COSY,,,,47.59A,NAFRev2,O,5.19659,48.754907,0.94,street,Avenue des Romains 55000 Longeville-en-Barrois,55302_0101,G,AVENUE DES ROMAINS,
322387028,00010,32238702800010,O,1981-05-11,01,2020,,2022-08-29T09:17:29,false,5,,28,,RUE,MORTEAU,55000,LONGEVILLE-EN-BARROIS,,,55302,,,,,,,,,,,,,,,,,,,2021-12-31,F,,,,,01.50Z,NAFRev2,O,5.205628,48.742323,0.95,housenumber,28 Rue Morteau 55000 Longeville-en-Barrois,55302_0074_00028,G,28 RUE MORTEAU,
322387028,00028,32238702800028,O,2021-12-31,,,,2022-03-07T09:37:35,true,1,,5,,CHE,DE LA CANIERE,55000,LONGEVILLE-EN-BARROIS,,,55302,,,,,,,,,,,,,,,,,,,2021-12-31,A,,,,,01.50Z,NAFRev2,N,5.213262,48.74347,0.54,housenumber,5 Chemin de la Ruelle de l’Orme 55000 Longeville-en-Barrois,55302_0103_00005,G,5 CHEMIN DE LA RUELLE DE L ORME,
323164517,00019,32316451700019,O,,,,,2019-11-14T14:00:45,true,1,,,,LOT,DU MOULIN N1,55000,LONGEVILLE-EN-BARROIS,,,55302,,,,,,,,,,,,,,,,,,,1984-12-25,F,,,,,86.07,NAP,N,5.209279,48.739418,0.72,street,Lotissement du Moulin 55000 Longeville-en-Barrois,55302_0082,G,LOTISSEMENT DU MOULIN,
323509554,00016,32350955400016,O,1982-02-01,NN,,,2019-11-14T14:00:45,false,4,,4,,RUE,DE LA FONTAINE,55000,LONGEVILLE-EN-BARROIS,,,55302,,,,,,,,,,,,,,,,,,,2002-07-01,F,,,,,45.2V,NAF1993,O,5.207802,48.742255,0.95,housenumber,4 Rue de la Fontaine 55000 Longeville-en-Barrois,55302_0044_00004,G,4 RUE DE LA FONTAINE,
323509554,00024,32350955400024,O,2002-07-01,NN,,,2019-11-14T14:00:45,true,4,,11,,RUE,DE LA FONTAINE,55000,LONGEVILLE-EN-BARROIS,,,55302,,,,,,,,,,,,,,,,,,,2011-05-31,F,,,,,43.99C,NAFRev2,O,5.207967,48.742082,0.95,housenumber,11 Rue de la Fontaine 55000 Longeville-en-Barrois,55302_0044_00011,G,11 RUE DE LA FONTAINE,
323515684,00013,32351568400013,O,,,,,2019-11-14T14:00:45,true,1,,4,,RUE,DE LA FONTAINE,55000,LONGEVILLE-EN-BARROIS,,,55302,,,,,,,,,,,,,,,,,,,1989-12-31,F,,,,,55.60,NAP,N,5.207802,48.742255,0.95,housenumber,4 Rue de la Fontaine 55000 Longeville-en-Barrois,55302_0044_00004,G,4 RUE DE LA FONTAINE,
323590521,00015,32359052100015,O,1981-04-01,NN,,,2019-11-14T14:00:45,false,4,CHEZ MR RIES DIDIER,,,,,55000,LONGEVILLE-EN-BARROIS,,,55302,,,,,,,,,,,,,,,,,,,2019-03-15,F,,,,,01.50Z,NAFRev2,N,,,0,,,,,,
323590521,00023,32359052100023,O,2019-03-15,,,,2021-02-23T10:46:58,true,1,,6,,CHE,DE LA RUELLE DE L'ORME,55000,LONGEVILLE-EN-BARROIS,,,55302,,,,,,,,,,,,,,,,,,,2019-03-15,A,,,,,01.50Z,NAFRev2,N,5.213301,48.743333,0.9,housenumber,6 Chemin de la Ruelle de l’Orme 55000 Longeville-en-Barrois,55302_0103_00006,G,6 CHEMIN DE LA RUELLE DE L ORME,
324198613,00014,32419861300014,O,,NN,,,2019-11-14T14:00:45,true,1,,,,,FERME BEAUREGARD,55000,LONGEVILLE-EN-BARROIS,,,55302,,,,,,,,,,,,,,,,,,,,F,,,,,01.00,NAP,N,5.197096,48.729687,0.94,street,Ferme de Beauregard 55000 Longeville-en-Barrois,55302_0014,G,FERME DE BEAUREGARD,
325090355,00018,32509035500018,O,1982-06-28,NN,,,2019-11-14T14:00:45,false,3,,19,,RUE,DES TROIS PRESSOIRS,55000,LONGEVILLE-EN-BARROIS,,,55302,,,,,,,,,,,,,,,,,,,2008-01-01,F,,,,,93.12Z,NAFRev2,N,5.21056,48.739328,0.8,housenumber,19 Rue des 3 Pressoirs 55000 Longeville-en-Barrois,55302_0122_00019,G,19 RUE DES 3 PRESSOIRS,
325090355,00026,32509035500026,O,2008-01-01,,,,2019-11-14T14:00:45,true,1,,14,,RUE,DES CHENEVIERES,55000,LONGEVILLE-EN-BARROIS,,,55302,,,,,,,,,,,,,,,,,,,2008-01-01,A,,,,,93.12Z,NAFRev2,N,5.208958,48.743112,0.95,housenumber,14 Rue des Chenevières 55000 Longeville-en-Barrois,55302_0034_00014,G,14 RUE DES CHENEVIERES,
325117794,00025,32511779400025,O,1998-03-09,NN,,,2019-11-14T14:00:45,false,4,,14,,RUE,DU MOULIN,55000,LONGEVILLE-EN-BARROIS,,,55302,,,,,,,,,,,,,,,,,,,2018-05-13,F,,,,,47.73Z,NAFRev2,O,5.20987,48.740024,0.95,housenumber,14 Rue du Moulin 55000 Longeville-en-Barrois,55302_0079_00014,G,14 RUE DU MOULIN,
325117794,00033,32511779400033,O,2018-05-14,,,,2021-02-23T10:47:45,true,1,,1,,GR,RUE,55000,LONGEVILLE-EN-BARROIS,,,55302,,,,,,,,,,,,,,,,,,,2018-05-14,A,,,,,68.20B,NAFRev2,N,5.209893,48.740186,0.74,housenumber,1 Grande Rue 55000 Longeville-en-Barrois,55302_0048_00001,G,1 GRANDE RUE,
325899896,00030,32589989600030,O,2003-09-01,NN,,,2019-11-14T14:00:45,true,3,,1,,,GRANDE RUE,55000,LONGEVILLE-EN-BARROIS,,,55302,,,,,,,,,,,,,,,,,,,2004-12-31,F,,,,,70.2C,NAFRev1,N,5.209893,48.740186,0.95,housenumber,1 Grande Rue 55000 Longeville-en-Barrois,55302_0048_00001,G,1 GRANDE RUE,
326381084,00028,32638108400028,O,1992-02-01,NN,,,2019-11-14T14:00:45,true,4,,,,RTE,DE BAR LE DUC,55000,LONGEVILLE-EN-BARROIS,,,55302,,,,,,,,,,,,,,,,,,,2009-10-22,F,,,,,47.53Z,NAFRev2,N,5.209392,48.74383,0.57,street,Rue de Bar 55000 Longeville-en-Barrois,55302_0013,G,RUE DE BAR,
327233581,00013,32723358100013,O,1983-04-01,00,2019,,2022-02-17T08:41:49,true,4,,,,,FERME DE BEAUREGARD,55000,LONGEVILLE-EN-BARROIS,,,55302,,,,,,,,,,,,,,,,,,,2014-12-31,A,,,,,01.11Z,NAFRev2,O,5.197096,48.729687,0.94,street,Ferme de Beauregard 55000 Longeville-en-Barrois,55302_0014,G,FERME DE BEAUREGARD,
327233581,00021,32723358100021,O,2017-05-24,,,,2019-11-14T14:00:45,false,1,FERME DE BEAUREGARD,,,,PARCELLES 821 2102,55000,LONGEVILLE-EN-BARROIS,,,55302,,,,,,,,,,,,,,,,,,,2017-05-24,A,EARL DE BEAUREGARD,,,,35.11Z,NAFRev2,N,5.197096,48.729687,0.56,street,Ferme de Beauregard 55000 Longeville-en-Barrois,55302_0014,D,FERME DE BEAUREGARD,
328519624,00030,32851962400030,O,2012-05-01,,,,2019-11-14T14:00:45,true,2,,6,,RUE,DE SAVONNIERES,55000,LONGEVILLE-EN-BARROIS,,,55302,,,,,,,,,,,,,,,,,,,2014-02-01,F,,,,,71.12B,NAFRev2,N,5.203437,48.742544,0.95,housenumber,6 Rue de Savonnières 55000 Longeville-en-Barrois,55302_0114_00006,G,6 RUE DE SAVONNIERES,
332127240,00197,33212724000197,O,2011-03-01,22,2020,,2022-08-29T09:22:27,false,1,,10,,RUE,LYDIE RIES,55000,LONGEVILLE-EN-BARROIS,,,55302,,,,,,,,,,,,,,,,,,,2011-03-01,A,SADAP,,,,49.39A,NAFRev2,O,5.210122,48.745348,0.95,housenumber,10 Rue Lydie Ries 55000 Longeville-en-Barrois,55302_0058_00010,G,10 RUE LYDIE RIES,
332718865,00014,33271886500014,O,,NN,,,2019-11-14T14:00:45,true,1,,4,,RUE,WOISELLE,55000,LONGEVILLE-EN-BARROIS,,,55302,,,,,,,,,,,,,,,,,,,1995-02-28,F,,,,,85.1G,NAF1993,N,5.210847,48.74018,0.77,housenumber,4 Rue Voiselle 55000 Longeville-en-Barrois,55302_0129_00004,G,4 RUE VOISELLE,
333326106,00015,33332610600015,O,,NN,,,2019-11-14T14:00:45,true,1,,2,,RUE,VOISELLE,55000,LONGEVILLE-EN-BARROIS,,,55302,,,,,,,,,,,,,,,,,,,1992-10-16,F,,,,,15.8C,NAF1993,N,5.210848,48.740308,0.95,housenumber,2 Rue Voiselle 55000 Longeville-en-Barrois,55302_0129_00002,G,2 RUE VOISELLE,
333688992,00028,33368899200028,O,1994-01-01,,,2562BZ,2019-11-14T14:00:45,true,5,,,,CHE,DES GREVES,55000,LONGEVILLE-EN-BARROIS,,,55302,,,,,,,,,,,,,,,,,,,2015-11-29,F,,,,,33.12Z,NAFRev2,N,5.215784,48.741929,0.81,street,Chemin des Greves 55000 Longeville-en-Barrois,55302_0049,G,CHEMIN DES GREVES,
333689966,00039,33368996600039,O,2016-05-01,,,,2021-02-23T10:53:03,true,1,,15,,RUE,DE LA CITADELLE,55000,LONGEVILLE-EN-BARROIS,,,55302,,,,,,,,,,,,,,,,,,,2016-05-01,A,,,,,90.03A,NAFRev2,N,5.206479,48.740645,0.95,housenumber,15 Rue de la Citadelle 55000 Longeville-en-Barrois,55302_0036_00015,G,15 RUE DE LA CITADELLE,
334413523,00013,33441352300013,O,1986-01-01,03,2020,1085ZZ,2022-08-29T09:23:47,true,4,,3,,RUE,DE LA FONTAINE,55000,LONGEVILLE-EN-BARROIS,,,55302,,,,,,,,,,,,,,,,,,,2008-01-01,A,,,,,55.10Z,NAFRev2,O,5.207917,48.741541,0.95,housenumber,3 Rue de la Fontaine 55000 Longeville-en-Barrois,55302_0044_00003,G,3 RUE DE LA FONTAINE,
338027402,00019,33802740200019,O,,NN,,,2019-11-14T14:00:45,true,1,,,,RTE,NATIONALE,55000,LONGEVILLE-EN-BARROIS,,,55302,,,,,,,,,,,,,,,,,,,1988-06-03,F,,,,,67.08,NAP,N,1.2279812,49.230352,0.77,poi,Route Nationale (Pont) Saint-Pierre-du-Vauvray,https://osm.org/way/95838375,G,,
339814444,00016,33981444400016,O,1987-01-01,11,2020,,2022-08-29T09:25:53,true,4,,,,RTE,NATIONALE,55000,LONGEVILLE-EN-BARROIS,,,55302,,,,,,,,,,,,,,,,,,,2008-01-01,A,,,,,46.73A,NAFRev2,O,1.2279812,49.230352,0.77,poi,Route Nationale (Pont) Saint-Pierre-du-Vauvray,https://osm.org/way/95838375,G,,
340521251,00017,34052125100017,O,1987-02-11,NN,,,2019-11-14T14:00:45,false,4,,,,RTE,NATIONALE,55000,LONGEVILLE-EN-BARROIS,,,55302,,,,,,,,,,,,,,,,,,,1998-01-01,F,,,,,60.2P,NAF1993,O,1.2279812,49.230352,0.77,poi,Route Nationale (Pont) Saint-Pierre-du-Vauvray,https://osm.org/way/95838375,G,,
340521251,00033,34052125100033,O,1998-01-01,NN,,,2019-11-14T14:00:45,true,4,,54,,RUE,DES ALLIES,55000,LONGEVILLE-EN-BARROIS,,,55302,,,,,,,,,,,,,,,,,,,2008-12-31,F,,,,,49.41C,NAFRev2,O,5.213481,48.74031,0.95,housenumber,54 Rue des Alliés 55000 Longeville-en-Barrois,55302_0007_00054,G,54 RUE DES ALLIES,
341390235,00024,34139023500024,O,1991-12-20,NN,,,2019-11-14T14:00:45,true,4,ZONE INDUSTRIELLE,,,RTE,DE BAR,55000,LONGEVILLE-EN-BARROIS,,,55302,,,,,,,,,,,,,,,,,,,1994-12-25,F,,,,,32.2A,NAF1993,O,5.209392,48.74383,0.7,street,Rue de Bar 55000 Longeville-en-Barrois,55302_0013,G,RUE DE BAR,
341614907,00010,34161490700010,O,1974-01-01,NN,,,2019-11-14T14:00:45,true,1,,15,,RUE,DU GRAND PAQUIS,55000,LONGEVILLE-EN-BARROIS,,,55302,,,,,,,,,,,,,,,,,,,2002-06-30,F,,,,,74.1C,NAF1993,N,5.205219,48.743601,0.7,housenumber,15 Rue du Paquis 55000 Longeville-en-Barrois,55302_0092_00015,G,15 RUE DU PAQUIS,
341709863,00011,34170986300011,O,1987-06-01,NN,,,2019-11-14T14:00:45,false,4,,3,,RUE,DE BAR,55000,LONGEVILLE-EN-BARROIS,,,55302,,,,,,,,,,,,,,,,,,,1998-01-01,F,,,,,70.2A,NAF1993,N,5.210395,48.742948,0.95,housenumber,3 Rue de Bar 55000 Longeville-en-Barrois,55302_0013_00003,G,3 RUE DE BAR,
341709863,00029,34170986300029,O,1998-01-01,NN,,,2021-06-24T08:56:23,true,3,,54,,RUE,DES ALLIES,55000,LONGEVILLE-EN-BARROIS,,,55302,,,,,,,,,,,,,,,,,,,2008-01-01,A,,,,,68.20A,NAFRev2,N,5.213481,48.74031,0.95,housenumber,54 Rue des Alliés 55000 Longeville-en-Barrois,55302_0007_00054,G,54 RUE DES ALLIES,
342395381,00011,34239538100011,O,1987-07-11,NN,,,2019-11-14T14:00:45,false,3,,,,RTE,NATIONALE,55000,LONGEVILLE-EN-BARROIS,,,55302,,,,,,,,,,,,,,,,,,,2004-01-01,F,,,,,05.0A,NAFRev1,N,1.2279812,49.230352,0.77,poi,Route Nationale (Pont) Saint-Pierre-du-Vauvray,https://osm.org/way/95838375,G,,
342520103,00017,34252010300017,O,,,,,2019-11-14T14:00:45,true,1,,5,,RUE,DE LA RUELLE,55000,LONGEVILLE-EN-BARROIS,,,55302,,,,,,,,,,,,,,,,,,,1990-08-31,F,,,,,38.40,NAP,N,5.208533,48.741586,0.95,housenumber,5 Rue de la Ruelle 55000 Longeville-en-Barrois,55302_0102_00005,G,5 RUE DE LA RUELLE,
343204905,00016,34320490500016,O,,NN,,,2019-11-14T14:00:45,true,1,,8,,RUE,ST HILAIRE,55000,LONGEVILLE-EN-BARROIS,,,55302,,,,,,,,,,,,,,,,,,,1990-09-27,F,,,,,49.01,NAP,N,5.204185,48.743911,0.84,housenumber,8 Rue Saint-Hilaire 55000 Longeville-en-Barrois,55302_0109_00008,G,8 RUE SAINT HILAIRE,
343206702,00015,34320670200015,O,,NN,,,2019-11-14T14:00:45,true,1,,,,,,55000,LONGEVILLE-EN-BARROIS,,,55302,,,,,,,,,,,,,,,,,,,1987-11-30,F,,,,,01.07,NAP,N,,,0,,,,,,
343207676,00010,34320767600010,O,1987-12-02,NN,,,2019-11-14T14:00:45,true,4,CHEZ MR GUIOT MICHEL,42,,RUE,DES ALLIES,55000,LONGEVILLE-EN-BARROIS,,,55302,,,,,,,,,,,,,,,,,,,2014-12-31,A,,,,,01.50Z,NAFRev2,O,5.212416,48.740925,0.95,housenumber,42 Rue des Alliés 55000 Longeville-en-Barrois,55302_0007_00042,G,42 RUE DES ALLIES,
343692992,00021,34369299200021,O,2010-04-01,,,,2019-11-14T14:00:45,true,4,,10,,RUE,MESEAUX,55000,LONGEVILLE-EN-BARROIS,,,55302,,,,,,,,,,,,,,,,,,,2015-12-31,F,,,,,47.99B,NAFRev2,N,5.208091,48.741047,0.78,housenumber,10 Rue Mesaux 55000 Longeville-en-Barrois,55302_0062_00010,G,10 RUE MESAUX,
344189287,00016,34418928700016,O,1988-03-14,NN,,,2019-11-14T14:00:45,true,4,,,,,,55000,LONGEVILLE-EN-BARROIS,,,55302,,,,,,,,,,,,,,,,,,,1991-12-25,F,,,,,70.2A,NAF1993,N,,,0,,,,,,
344189451,00018,34418945100018,O,,NN,,,2019-11-14T14:00:45,true,1,,,,,,55000,LONGEVILLE-EN-BARROIS,,,55302,,,,,,,,,,,,,,,,,,,1991-07-26,F,,,,,48.04,NAP,N,,,0,,,,,,
344189576,00012,34418957600012,O,,NN,,,2019-11-14T14:00:45,true,1,,,,,,55000,LONGEVILLE-EN-BARROIS,,,55302,,,,,,,,,,,,,,,,,,,1992-05-19,F,,,,,20.2Z,NAF1993,N,,,0,,,,,,
344775341,00011,34477534100011,O,,NN,,,2019-11-14T14:00:45,true,1,,18,,RUE,DE LA RUELLE,55000,LONGEVILLE-EN-BARROIS,,,55302,,,,,,,,,,,,,,,,,,,1991-03-31,F,,,,,55.73,NAP,N,5.20924,48.741933,0.95,housenumber,18 Rue de la Ruelle 55000 Longeville-en-Barrois,55302_0102_00018,G,18 RUE DE LA RUELLE,
344809504,00014,34480950400014,O,,NN,,,2019-11-14T14:00:45,true,1,,55,,RUE,DE LA RUELLE,55000,LONGEVILLE-EN-BARROIS,,,55302,,,,,,,,,,,,,,,,,,,1991-12-31,F,,,,,64.25,NAP,N,5.20997,48.742612,0.95,housenumber,55 Rue de la Ruelle 55000 Longeville-en-Barrois,55302_0102_00055,G,55 RUE DE LA RUELLE,
345270425,00027,34527042500027,O,1993-06-22,NN,,,2019-11-14T14:00:45,true,3,,10,B,CHE,DE LA GRANDE CHALAIDE,55000,LONGEVILLE-EN-BARROIS,,,55302,,,,,,,,,,,,,,,,,,,2008-01-01,A,,,,,68.20A,NAFRev2,N,5.200784,48.740105,0.81,housenumber,10bis Rue de la Grande Chalaide 55000 Longeville-en-Barrois,55302_mzl9yr_00010_bis,G,10BIS RUE DE LA GRANDE CHALAIDE,
345328702,00021,34532870200021,O,1992-02-01,NN,,,2019-11-14T14:00:45,false,4,,,,RTE,DE BAR LE DUC,55000,LONGEVILLE-EN-BARROIS,,,55302,,,,,,,,,,,,,,,,,,,1994-12-25,F,,,,,74.1G,NAF1993,O,5.209392,48.74383,0.57,street,Rue de Bar 55000 Longeville-en-Barrois,55302_0013,G,RUE DE BAR,
348526500,00015,34852650000015,O,1988-10-31,NN,,,2019-11-14T14:00:45,true,4,,,,CHE,DE LA GRANDE CHALAIDE,55000,LONGEVILLE-EN-BARROIS,,,55302,,,,,,,,,,,,,,,,,,,2010-12-31,F,,,,,68.20A,NAFRev2,N,5.200174,48.740583,0.86,street,Rue de la Grande Chalaide 55000 Longeville-en-Barrois,55302_mzl9yr,G,RUE DE LA GRANDE CHALAIDE,
349207738,00023,34920773800023,O,2014-01-04,,,,2019-11-14T14:00:45,true,2,,6,,RUE,DE LA GRANDE CHALAIDE,55000,LONGEVILLE-EN-BARROIS,,,55302,,,,,,,,,,,,,,,,,,,2017-10-04,F,,,,,47.99A,NAFRev2,N,5.201077,48.740727,0.95,housenumber,6 Rue de la Grande Chalaide 55000 Longeville-en-Barrois,55302_mzl9yr_00006,G,6 RUE DE LA GRANDE CHALAIDE,
349824508,00031,34982450800031,O,1998-05-01,NN,,,2019-11-14T14:00:45,true,1,,,,RTE,N 135,55000,LONGEVILLE-EN-BARROIS,,,55302,,,,,,,,,,,,,,,,,,,1999-08-31,F,,,,,50.1Z,NAF1993,O,,,0,,,,,,
351752902,00012,35175290200012,O,,NN,,,2019-11-14T14:00:45,true,1,,3,,RUE,DE LA FONTAINE,55000,LONGEVILLE-EN-BARROIS,,,55302,,,,,,,,,,,,,,,,,,,1993-09-30,F,,,,,55.1A,NAF1993,N,5.207917,48.741541,0.95,housenumber,3 Rue de la Fontaine 55000 Longeville-en-Barrois,55302_0044_00003,G,3 RUE DE LA FONTAINE,
351756184,00013,35175618400013,O,,,,,2019-11-14T14:00:45,true,1,,3,,RUE,DE LA FONTAINE,55000,LONGEVILLE-EN-BARROIS,,,55302,,,,,,,,,,,,,,,,,,,1993-09-30,F,,,,,55.1A,NAF1993,N,5.207917,48.741541,0.95,housenumber,3 Rue de la Fontaine 55000 Longeville-en-Barrois,55302_0044_00003,G,3 RUE DE LA FONTAINE,