siren,nic,siret,statutDiffusionEtablissement,dateCreationEtablissement,trancheEffectifsEtablissement,anneeEffectifsEtablissement,activitePrincipaleRegistreMetiersEtablissement,dateDernierTraitementEtablissement,etablissementSiege,nombrePeriodesEtablissement,complementAdresseEtablissement,numeroVoieEtablissement,indiceRepetitionEtablissement,typeVoieEtablissement,libelleVoieEtablissement,codePostalEtablissement,libelleCommuneEtablissement,libelleCommuneEtrangerEtablissement,distributionSpecialeEtablissement,codeCommuneEtablissement,codeCedexEtablissement,libelleCedexEtablissement,codePaysEtrangerEtablissement,libellePaysEtrangerEtablissement,complementAdresse2Etablissement,numeroVoie2Etablissement,indiceRepetition2Etablissement,typeVoie2Etablissement,libelleVoie2Etablissement,codePostal2Etablissement,libelleCommune2Etablissement,libelleCommuneEtranger2Etablissement,distributionSpeciale2Etablissement,codeCommune2Etablissement,codeCedex2Etablissement,libelleCedex2Etablissement,codePaysEtranger2Etablissement,libellePaysEtranger2Etablissement,dateDebut,etatAdministratifEtablissement,enseigne1Etablissement,enseigne2Etablissement,enseigne3Etablissement,denominationUsuelleEtablissement,activitePrincipaleEtablissement,nomenclatureActivitePrincipaleEtablissement,caractereEmployeurEtablissement,longitude,latitude,geo_score,geo_type,geo_adresse,geo_id,geo_ligne,geo_l4,geo_l5
215801259,00015,21580125900015,O,1983-03-01,01,2020,,2022-08-29T09:07:54,true,4,,,,,,58230,GIEN-SUR-CURE,,,58125,,,,,,,,,,,,,,,,,,,2008-01-01,A,MAIRIE,,,,84.11Z,NAFRev2,O,,,0,,,,,,
215801259,00023,21580125900023,O,1996-12-25,NN,,,2019-11-14T14:00:46,false,2,MAIRIE,,,,BOURG,58230,GIEN-SUR-CURE,,,58125,,,,,,,,,,,,,,,,,,,2008-01-01,A,SERVICE EAU,,,,36.00Z,NAFRev2,N,4.098516,47.136863,0.92,street,Le Bourg 58230 Gien-sur-Cure,58125_q6r0zn,G,LE BOURG,
265801258,00012,26580125800012,O,1983-03-01,NN,,,2020-12-23T09:27:46,true,4,,,,,MAIRIE,58230,GIEN-SUR-CURE,,,58125,,,,,,,,,,,,,,,,,,,2015-12-16,F,CCAS,,,,88.99B,NAFRev2,N,3.0709671,50.6304695,0.92,poi.townhall,Hôtel de Ville Lille,https://osm.org/way/40917078,G,,
275802429,00017,27580242900017,O,,NN,,,2019-11-14T14:00:46,true,1,,,,,MAIRIE,58230,GIEN-SUR-CURE,,,58125,,,,,,,,,,,,,,,,,,,1995-12-25,F,,,,,41.0Z,NAF1993,N,3.0709671,50.6304695,0.92,poi.townhall,Hôtel de Ville Lille,https://osm.org/way/40917078,G,,
302288220,00015,30228822000015,O,,,,,2019-11-14T14:00:46,true,1,,,,,LA CASSIERE,58230,GIEN-SUR-CURE,,,58125,,,,,,,,,,,,,,,,,,,1984-12-25,F,,,,,,,N,4.09369,47.136369,0.93,street,La Cassiere 58230 Gien-sur-Cure,58125_w1g4ul,G,LA CASSIERE,
309801280,00012,30980128000012,O,,NN,,,2019-11-14T14:00:46,true,1,,,,,LE BOURG,58230,GIEN-SUR-CURE,,,58125,,,,,,,,,,,,,,,,,,,1984-01-11,F,,,,,86.07,NAP,N,4.098516,47.136863,0.94,street,Le Bourg 58230 Gien-sur-Cure,58125_q6r0zn,G,LE BOURG,
314488701,00025,31448870100025,O,1900-01-01,,,,2019-11-14T14:00:46,false,2,,,,,,58230,GIEN-SUR-CURE,,,58125,,,,,,,,,,,,,,,,,,,1987-12-25,F,,,,,55.60,NAP,N,,,0,,,,,,
323926865,00029,32392686500029,O,2013-01-01,,,,2019-11-14T14:00:46,true,1,,,,,,58230,GIEN-SUR-CURE,,,58125,,,,,,,,,,,,,,,,,,,2013-01-01,A,,,,,02.10Z,NAFRev2,N,,,0,,,,,,
323977116,00017,32397711600017,O,,,,,2019-11-14T14:00:46,true,1,,,,,,58230,GIEN-SUR-CURE,,,58125,,,,,,,,,,,,,,,,,,,1984-12-25,F,,,,,67.06,NAP,N,,,0,,,,,,
327435566,00010,32743556600010,O,1983-05-05,NN,,,2019-11-14T14:00:46,false,4,,,,,LE BAS DU GOUSSET,58230,GIEN-SUR-CURE,,,58125,,,,,,,,,,,,,,,,,,,2000-05-30,F,,,,,01.1A,NAF1993,N,4.107207,47.133167,0.38,street,Le Fort de Boussenay 58230 Gien-sur-Cure,58125_B029,G,LE FORT DE BOUSSENAY,
328217013,00015,32821701300015,O,,NN,,,2019-11-14T14:00:46,true,1,,,,,BOURG,58230,GIEN-SUR-CURE,,,58125,,,,,,,,,,,,,,,,,,,1989-11-30,F,,,,,02.20,NAP,N,4.098516,47.136863,0.92,street,Le Bourg 58230 Gien-sur-Cure,58125_q6r0zn,G,LE BOURG,
329869903,00016,32986990300016,O,,,,,2019-11-14T14:00:46,true,1,,,,,,58230,GIEN-SUR-CURE,,,58125,,,,,,,,,,,,,,,,,,,1987-03-31,F,,,,,67.06,NAP,N,,,0,,,,,,
329869911,00019,32986991100019,O,,,,,2019-11-14T14:00:46,true,1,,,,,,58230,GIEN-SUR-CURE,,,58125,,,,,,,,,,,,,,,,,,,1990-12-31,F,,,,,67.06,NAP,N,,,0,,,,,,
337748305,00014,33774830500014,O,1986-05-13,NN,,,2019-11-14T14:00:46,true,1,,,,,LA CASSIERE,58230,GIEN-SUR-CURE,,,58125,,,,,,,,,,,,,,,,,,,1998-04-15,F,,,,,52.6E,NAF1993,N,4.09369,47.136369,0.93,street,La Cassiere 58230 Gien-sur-Cure,58125_w1g4ul,G,LA CASSIERE,
343638714,00018,34363871400018,O,,NN,,,2019-11-14T14:00:46,true,1,,,,,LA COUPE LYONNET,58230,GIEN-SUR-CURE,,,58125,,,,,,,,,,,,,,,,,,,1990-09-10,F,,,,,67.01,NAP,N,4.07331,47.154992,0.93,street,La Coupe Lyonnet 58230 Gien-sur-Cure,58125_B017,G,LA COUPE LYONNET,
348371113,00013,34837111300013,O,1968-01-01,NN,,,2019-11-14T14:00:46,true,4,,,,LD,LE BAS DU GOUSSET,58230,GIEN-SUR-CURE,,,58125,,,,,,,,,,,,,,,,,,,2005-02-01,F,,,,,02.0D,NAFRev1,N,4.107207,47.133167,0.38,street,Le Fort de Boussenay 58230 Gien-sur-Cure,58125_B029,G,LE FORT DE BOUSSENAY,
377492947,00017,37749294700017,O,1988-02-15,NN,,,2019-11-14T14:00:46,true,4,,,,,,58230,GIEN-SUR-CURE,,,58125,,,,,,,,,,,,,,,,,,,2019-06-26,F,,,,,68.20B,NAFRev2,N,,,0,,,,,,
380012872,00012,38001287200012,O,,NN,,,2019-11-14T14:00:46,true,1,,,,,,58230,GIEN-SUR-CURE,,,58125,,,,,,,,,,,,,,,,,,,1992-12-15,F,,,,,92.3H,NAF1993,N,,,0,,,,,,
381913805,00010,38191380500010,O,1900-01-01,NN,,,2019-11-14T14:00:46,false,3,,,,,LA COUPE LYONNET,58230,GIEN-SUR-CURE,,,58125,,,,,,,,,,,,,,,,,,,1993-04-21,F,,,,,55.3A,NAF1993,N,4.07331,47.154992,0.93,street,La Coupe Lyonnet 58230 Gien-sur-Cure,58125_B017,G,LA COUPE LYONNET,
382821502,00012,38282150200012,O,1991-07-01,NN,,,2019-11-14T14:00:46,true,4,,,,,LE BOURG,58230,GIEN-SUR-CURE,,,58125,,,,,,,,,,,,,,,,,,,2005-10-15,F,,,,,55.1A,NAFRev1,O,4.098516,47.136863,0.94,street,Le Bourg 58230 Gien-sur-Cure,58125_q6r0zn,G,LE BOURG,
390458651,00010,39045865100010,O,1993-03-15,NN,,,2019-11-14T14:00:46,true,4,,,,,LES LIGERONS D'EN BAS,58230,GIEN-SUR-CURE,,,58125,,,,,,,,,,,,,,,,,,,1998-07-03,F,,,,,92.3H,NAF1993,O,4.070247,47.161028,0.93,street,Les Ligerons d’En Bas 58230 Gien-sur-Cure,58125_B040,G,LES LIGERONS D EN BAS,
391324498,00016,39132449800016,O,1900-01-01,NN,,,2019-11-14T14:00:46,false,3,,,,,,58230,GIEN-SUR-CURE,,,58125,,,,,,,,,,,,,,,,,,,1992-12-25,F,,,,,92.3H,NAF1993,N,,,0,,,,,,
393706114,00013,39370611400013,O,1987-06-01,NN,,,2019-11-14T14:00:46,true,3,,,,,LA CASSIERE,58230,GIEN-SUR-CURE,,,58125,,,,,,,,,,,,,,,,,,,2003-12-31,A,,,,,01.28Z,NAFRev2,N,4.09369,47.136369,0.93,street,La Cassiere 58230 Gien-sur-Cure,58125_w1g4ul,G,LA CASSIERE,
393706205,00019,39370620500019,O,1977-01-01,NN,,,2019-11-14T14:00:46,true,1,,,,,LES LIGERONS,58230,GIEN-SUR-CURE,,,58125,,,,,,,,,,,,,,,,,,,1999-12-31,F,,,,,01.1A,NAF1993,N,4.074107,47.158368,0.91,street,Les Ligerons d’En Haut 58230 Gien-sur-Cure,58125_B041,G,LES LIGERONS D EN HAUT,
394991376,00010,39499137600010,O,1993-01-01,NN,,,2019-11-14T14:00:46,true,4,,,,,,58230,GIEN-SUR-CURE,,,58125,,,,,,,,,,,,,,,,,,,2008-01-01,F,,,,,02.10Z,NAFRev2,N,,,0,,,,,,
400044830,00018,40004483000018,O,1995-01-01,NN,,,2019-11-14T14:00:46,false,4,,,,,LE RELAIS DES VOYAGEURS,58230,GIEN-SUR-CURE,,,58125,,,,,,,,,,,,,,,,,,,2008-01-01,F,,,,,01.11Z,NAFRev2,N,-1.7749607,46.4961528,0.9,poi.hotel,Le Relais des Voyageurs (Hôtel) Les Sables-d'Olonne,https://osm.org/node/3925292857,G,,
400044830,00026,40004483000026,O,1995-01-01,NN,,,2019-11-14T14:00:46,false,3,LE BOURG,,,,LE RELAIS DES VOYAGEURS,58230,GIEN-SUR-CURE,,,58125,,,,,,,,,,,,,,,,,,,1997-12-31,F,,,,,01.1C,NAF1993,N,-1.7749607,46.4961528,0.9,poi.hotel,Le Relais des Voyageurs (Hôtel) Les Sables-d'Olonne,https://osm.org/node/3925292857,G,,
400436937,00017,40043693700017,O,1995-04-03,NN,,,2019-11-14T14:00:46,false,4,,,,LD,LA COUPE LYONNET,58230,GIEN-SUR-CURE,,,58125,,,,,,,,,,,,,,,,,,,2003-04-01,F,ENTREPRISE TUCEK,,,,45.3E,NAFRev1,N,4.07331,47.154992,0.93,street,La Coupe Lyonnet 58230 Gien-sur-Cure,58125_B017,G,LA COUPE LYONNET,
400451233,00029,40045123300029,O,1996-04-01,NN,,,2019-11-14T14:00:46,true,4,,,,,LA COUPE LYONNET,58230,GIEN-SUR-CURE,,,58125,,,,,,,,,,,,,,,,,,,2012-10-18,F,,,,,47.89Z,NAFRev2,N,4.07331,47.154992,0.93,street,La Coupe Lyonnet 58230 Gien-sur-Cure,58125_B017,G,LA COUPE LYONNET,
410028757,00012,41002875700012,O,1987-12-31,NN,,,2019-11-14T14:00:46,true,4,,,,,LE MONTCEAU,58230,GIEN-SUR-CURE,,,58125,,,,,,,,,,,,,,,,,,,2003-06-19,F,,,,,01.2A,NAFRev1,N,4.112006,47.120304,0.83,street,Le Grand Pre du Montceau 58230 Gien-sur-Cure,58125_B034,G,LE GRAND PRE DU MONTCEAU,
410028765,00015,41002876500015,O,1984-12-31,NN,,,2022-01-14T03:46:23,true,5,,,,,LE BOURG,58230,GIEN-SUR-CURE,,,58125,,,,,,,,,,,,,,,,,,,2021-08-08,F,,,,,01.42Z,NAFRev2,N,4.098516,47.136863,0.94,street,Le Bourg 58230 Gien-sur-Cure,58125_q6r0zn,G,LE BOURG,
410028773,00019,41002877300019,O,1990-04-01,NN,,,2019-11-14T14:00:46,true,3,,,,,,58230,GIEN-SUR-CURE,,,58125,,,,,,,,,,,,,,,,,,,2008-01-01,A,,,,,01.43Z,NAFRev2,N,,,0,,,,,,
410028781,00012,41002878100012,O,1986-12-31,NN,,,2019-11-14T14:00:46,true,3,,,,,LA CROIX DE CHEVRE,58230,GIEN-SUR-CURE,,,58125,,,,,,,,,,,,,,,,,,,2008-01-01,A,,,,,01.11Z,NAFRev2,N,4.099695,47.137886,0.63,street,Champ de la Croix 58230 Gien-sur-Cure,58125_B011,G,CHAMP DE LA CROIX,
410028799,00014,41002879900014,O,1994-11-01,NN,,,2019-11-14T14:00:46,true,4,,,,,LA COUPE LYONNET,58230,GIEN-SUR-CURE,,,58125,,,,,,,,,,,,,,,,,,,2004-12-31,F,,,,,01.2A,NAFRev1,N,4.07331,47.154992,0.93,street,La Coupe Lyonnet 58230 Gien-sur-Cure,58125_B017,G,LA COUPE LYONNET,
412334484,00018,41233448400018,O,1984-12-31,NN,,,2019-11-14T14:00:46,true,1,,,,,LES BRUYERES,58230,GIEN-SUR-CURE,,,58125,,,,,,,,,,,,,,,,,,,2001-12-31,F,,,,,01.1F,NAF1993,N,4.074751,47.155087,0.39,street,Les Peus Bouchon Nord 58230 Gien-sur-Cure,58125_B047,G,LES PEUS BOUCHON NORD,
412334492,00011,41233449200011,O,1984-12-31,NN,,,2019-11-14T14:00:46,true,4,,,,,LES LIGERONS,58230,GIEN-SUR-CURE,,,58125,,,,,,,,,,,,,,,,,,,2008-01-01,F,,,,,01.11Z,NAFRev2,N,4.074107,47.158368,0.91,street,Les Ligerons d’En Haut 58230 Gien-sur-Cure,58125_B041,G,LES LIGERONS D EN HAUT,
421931544,00025,42193154400025,O,2009-09-01,,,,2022-10-20T08:34:19,true,4,BRG,1,,PL,DU 19 MARS 1962,58230,GIEN-SUR-CURE,,,58125,,,,,,,,,,,,,,,,,,,2022-08-18,F,,,,,56.21Z,NAFRev2,N,4.8609546,45.5404078,0.81,poi.park,Place du 19 mars 1962 (Parc) Vienne,https://osm.org/way/188355705,G,,
430486340,00010,43048634000010,O,2000-01-01,NN,,,2019-11-14T14:00:46,true,3,,,,,LES LIGERONS D'EN HAUT,58230,GIEN-SUR-CURE,,,58125,,,,,,,,,,,,,,,,,,,2005-10-06,F,,,,,01.3Z,NAFRev1,N,4.074107,47.158368,0.93,street,Les Ligerons d’En Haut 58230 Gien-sur-Cure,58125_B041,G,LES LIGERONS D EN HAUT,
433577657,00011,43357765700011,O,2000-11-20,NN,,,2019-11-14T14:00:46,true,4,,,,,VILLAGE D'EN HAUT,58230,GIEN-SUR-CURE,,,58125,,,,,,,,,,,,,,,,,,,2019-05-20,F,,,,,71.20B,NAFRev2,N,4.099017,47.140473,0.93,street,Le Village d’En Haut 58230 Gien-sur-Cure,58125_B070,G,LE VILLAGE D EN HAUT,
441530441,00019,44153044100019,O,2002-04-01,NN,,,2021-08-25T08:00:08,true,4,,,,LD,LES BRUYERES,58230,GIEN-SUR-CURE,,,58125,,,,,,,,,,,,,,,,,,,2021-05-27,F,,,,,01.24Z,NAFRev2,N,4.074751,47.155087,0.39,street,Les Peus Bouchon Nord 58230 Gien-sur-Cure,58125_B047,G,LES PEUS BOUCHON NORD,
479198996,00015,47919899600015,O,2004-10-20,,,,2019-11-14T14:00:46,true,3,,,,,,58230,GIEN-SUR-CURE,,,58125,,,,,,,,,,,,,,,,,,,2008-01-01,A,,,,,01.11Z,NAFRev2,N,,,0,,,,,,
479198996,00023,47919899600023,O,2004-10-20,NN,,,2021-04-07T10:01:28,false,4,LA CASSIERE,,,,,58230,GIEN-SUR-CURE,,,58125,,,,,,,,,,,,,,,,,,,2021-02-12,A,,,,,55.20Z,NAFRev2,N,4.09369,47.136369,0.93,street,La Cassiere 58230 Gien-sur-Cure,58125_w1g4ul,D,LA CASSIERE,
480201110,00016,48020111000016,O,1993-11-08,NN,,,2019-11-14T14:00:46,true,3,MAIRIE,,,,,58230,GIEN-SUR-CURE,,,58125,,,,,,,,,,,,,,,,,,,2008-01-01,A,,,,,94.99Z,NAFRev2,N,,,0,,,,,,
485021281,00012,48502128100012,O,2005-10-13,,,,2019-11-14T14:00:46,true,3,LE BOURG,,,,,58230,GIEN-SUR-CURE,,,58125,,,,,,,,,,,,,,,,,,,2008-08-14,F,,,,,55.10Z,NAFRev2,N,4.098516,47.136863,0.94,street,Le Bourg 58230 Gien-sur-Cure,58125_q6r0zn,D,LE BOURG,
488264607,00018,48826460700018,O,2006-01-26,,,4333ZZ,2021-02-23T13:52:44,true,4,VILLAGE D'EN HAUT,,,,,58230,GIEN-SUR-CURE,,,58125,,,,,,,,,,,,,,,,,,,2016-03-01,A,,,,MORVAN VERT,47.76Z,NAFRev2,N,4.099017,47.140473,0.93,street,Le Village d’En Haut 58230 Gien-sur-Cure,58125_B070,D,LE VILLAGE D EN HAUT,
495071326,00013,49507132600013,O,2007-04-01,,,4312BA,2019-11-14T14:00:46,false,4,LE PARC VERT,,,,LA COUPE LYONNET,58230,GIEN-SUR-CURE,,,58125,,,,,,,,,,,,,,,,,,,2016-03-23,F,,,,LES MARCHANDS,43.12A,NAFRev2,N,4.07331,47.154992,0.93,street,La Coupe Lyonnet 58230 Gien-sur-Cure,58125_B017,G,LA COUPE LYONNET,
500410543,00010,50041054300010,O,2002-10-10,,,,2019-11-14T14:00:46,true,2,,,,,BOIS DE RAVAN,58230,GIEN-SUR-CURE,,,58125,,,,,,,,,,,,,,,,,,,2008-01-01,A,,,,,02.10Z,NAFRev2,N,,,0,,,,,,
504686171,00027,50468617100027,O,2012-01-01,NN,,,2021-02-23T14:17:50,true,3,CHEZ MR KHALID AIT ABBOU,,,,AVENUE DE LA CASSIERE,58230,GIEN-SUR-CURE,,,58125,,,,,,,,,,,,,,,,,,,2015-09-06,A,,,,,90.01Z,NAFRev2,O,4.09369,47.136369,0.57,street,La Cassiere 58230 Gien-sur-Cure,58125_w1g4ul,G,LA CASSIERE,
510853070,00025,51085307000025,O,2021-04-07,,,,2021-05-17T16:00:16,true,1,,,,,LE BOURG,58230,GIEN-SUR-CURE,,,58125,,,,,,,,,,,,,,,,,,,2021-04-07,A,,,,,81.21Z,NAFRev2,N,4.098516,47.136863,0.94,street,Le Bourg 58230 Gien-sur-Cure,58125_q6r0zn,G,LE BOURG,
524200029,00014,52420002900014,O,2010-07-26,,,,2019-11-14T14:00:46,false,2,,,,,LA COUPE LYONNET,58230,GIEN-SUR-CURE,,,58125,,,,,,,,,,,,,,,,,,,2012-10-25,F,,,,,68.20B,NAFRev2,N,4.07331,47.154992,0.93,street,La Coupe Lyonnet 58230 Gien-sur-Cure,58125_B017,G,LA COUPE LYONNET,
528320120,00017,52832012000017,O,2010-10-16,,,,2019-11-14T14:00:46,false,2,,,,,LE BOURG,58230,GIEN-SUR-CURE,,,58125,,,,,,,,,,,,,,,,,,,2019-01-01,F,,,,,90.02Z,NAFRev2,N,4.098516,47.136863,0.94,street,Le Bourg 58230 Gien-sur-Cure,58125_q6r0zn,G,LE BOURG,
530792654,00010,53079265400010,O,2011-03-10,,,,2019-11-14T14:00:46,true,1,,,,,VILLAGE D'EN HAUT,58230,GIEN-SUR-CURE,,,58125,,,,,,,,,,,,,,,,,,,2011-03-10,A,,,,,02.10Z,NAFRev2,N,4.099017,47.140473,0.93,street,Le Village d’En Haut 58230 Gien-sur-Cure,58125_B070,G,LE VILLAGE D EN HAUT,
537383705,00010,53738370500010,O,2011-11-01,,,,2021-08-25T08:00:08,true,3,,,,,LES BRUYERES,58230,GIEN-SUR-CURE,,,58125,,,,,,,,,,,,,,,,,,,2021-05-28,A,,,,,01.29Z,NAFRev2,N,4.074751,47.155087,0.39,street,Les Peus Bouchon Nord 58230 Gien-sur-Cure,58125_B047,G,LES PEUS BOUCHON NORD,
681872073,00017,68187207300017,O,,NN,,,2019-11-14T14:00:46,true,1,,,,,LE BOURG,58230,GIEN-SUR-CURE,,,58125,,,,,,,,,,,,,,,,,,,1990-09-30,F,,,,,67.08,NAP,N,4.098516,47.136863,0.94,street,Le Bourg 58230 Gien-sur-Cure,58125_q6r0zn,G,LE BOURG,
778434225,00026,77843422500026,O,,NN,,,2019-11-14T14:00:46,true,1,,,,,,58230,GIEN-SUR-CURE,,,58125,,,,,,,,,,,,,,,,,,,,F,,,,,55.73,NAP,N,,,0,,,,,,
778457606,00011,77845760600011,O,,NN,,,2019-11-14T14:00:46,true,1,,,,,,58230,GIEN-SUR-CURE,,,58125,,,,,,,,,,,,,,,,,,,1999-03-16,F,,,,,21.01,NAP,N,,,0,,,,,,
778457614,00015,77845761400015,O,,,,,2019-11-14T14:00:46,true,1,,,,,,58230,GIEN-SUR-CURE,,,58125,,,,,,,,,,,,,,,,,,,1984-12-25,F,,,,,55.73,NAP,N,,,0,,,,,,
788867943,00011,78886794300011,O,2000-01-13,,,,2019-11-14T14:00:46,true,1,MAIRIE,,,LD,LE BOURG,58230,GIEN-SUR-CURE,,,58125,,,,,,,,,,,,,,,,,,,2000-01-13,A,,,,,94.99Z,NAFRev2,N,4.098516,47.136863,0.94,street,Le Bourg 58230 Gien-sur-Cure,58125_q6r0zn,G,LE BOURG,
795154723,00014,79515472300014,O,2013-10-09,,,3299ZC,2019-11-14T14:00:46,true,2,,,,LD,LA COUPE LYONNET,58230,GIEN-SUR-CURE,,,58125,,,,,,,,,,,,,,,,,,,2016-12-31,F,,,,L'ATELIER DES PETITES MAINS,93.29Z,NAFRev2,N,4.07331,47.154992,0.93,street,La Coupe Lyonnet 58230 Gien-sur-Cure,58125_B017,G,LA COUPE LYONNET,
795410026,00020,79541002600020,O,1994-01-01,NN,,,2019-11-14T14:00:46,false,3,,,,,,58230,GIEN-SUR-CURE,,,58125,,,,,,,,,,,,,,,,,,,1996-12-31,F,,,,,02.0A,NAF1993,N,,,0,,,,,,
804328375,00014,80432837500014,O,2014-09-01,,,,2019-11-14T14:00:46,true,2,,,,,LA COUPE LYONNET,58230,GIEN-SUR-CURE,,,58125,,,,,,,,,,,,,,,,,,,2018-12-31,F,,,,DB JARDINS FORETS,81.30Z,NAFRev2,N,4.07331,47.154992,0.93,street,La Coupe Lyonnet 58230 Gien-sur-Cure,58125_B017,G,LA COUPE LYONNET,
818389843,00017,81838984300017,O,2015-01-01,,,,2019-11-14T14:00:46,true,1,,,,,VILLAGE D'EN HAUT,58230,GIEN-SUR-CURE,,,58125,,,,,,,,,,,,,,,,,,,2015-01-01,A,,,,,68.20A,NAFRev2,N,4.099017,47.140473,0.93,street,Le Village d’En Haut 58230 Gien-sur-Cure,58125_B070,G,LE VILLAGE D EN HAUT,
818528796,00019,81852879600019,O,2016-01-29,,,,2019-11-14T14:00:46,true,1,,,,HAM,DE LA COUPE LYONNET,58230,GIEN-SUR-CURE,,,58125,,,,,,,,,,,,,,,,,,,2016-01-29,A,,,,,68.20B,NAFRev2,N,4.07331,47.154992,0.85,street,La Coupe Lyonnet 58230 Gien-sur-Cure,58125_B017,G,LA COUPE LYONNET,
820504777,00013,82050477700013,O,2016-01-13,,,,2019-11-14T14:00:46,true,1,,,,,LES LIGERONS D EN HAUT,58230,GIEN-SUR-CURE,,,58125,,,,,,,,,,,,,,,,,,,2016-01-13,A,,,,,68.20A,NAFRev2,N,4.074107,47.158368,0.93,street,Les Ligerons d’En Haut 58230 Gien-sur-Cure,58125_B041,G,LES LIGERONS D EN HAUT,
821027893,00014,82102789300014,O,2016-06-20,,,,2019-11-14T14:00:46,true,2,,,,,LE BOURG,58230,GIEN-SUR-CURE,,,58125,,,,,,,,,,,,,,,,,,,2016-09-14,F,,,,,62.01Z,NAFRev2,N,4.098516,47.136863,0.94,street,Le Bourg 58230 Gien-sur-Cure,58125_q6r0zn,G,LE BOURG,
850039389,00018,85003938900018,O,2019-04-20,,,,2019-11-14T14:00:46,true,1,,,,,LE BOURG,58230,GIEN-SUR-CURE,,,58125,,,,,,,,,,,,,,,,,,,2019-04-20,A,,,,,68.20A,NAFRev2,N,4.098516,47.136863,0.94,street,Le Bourg 58230 Gien-sur-Cure,58125_q6r0zn,G,LE BOURG,
852510742,00020,85251074200020,O,2021-08-01,,,,2021-09-04T12:18:12,true,1,,,,RUE,LA COUPE LYONNET,58230,GIEN-SUR-CURE,,,58125,,,,,,,,,,,,,,,,,,,2021-08-01,A,,,,,94.99Z,NAFRev2,N,4.07331,47.154992,0.81,street,La Coupe Lyonnet 58230 Gien-sur-Cure,58125_B017,G,LA COUPE LYONNET,
877952846,00021,87795284600021,O,2021-03-20,,,,2021-10-11T11:45:20,true,1,,,,,LA COUPE LYONNET,58230,GIEN-SUR-CURE,,,58125,,,,,,,,,,,,,,,,,,,2021-03-20,A,,,,,68.20B,NAFRev2,N,4.07331,47.154992,0.93,street,La Coupe Lyonnet 58230 Gien-sur-Cure,58125_B017,G,LA COUPE LYONNET,
891693871,00016,89169387100016,O,2019-12-19,,,,2020-12-05T03:36:24,true,1,,,,,BOIS DES VENTES BATTENTES,58230,GIEN-SUR-CURE,,,58125,,,,,,,,,,,,,,,,,,,2019-12-19,A,LES VENTES BATTENTES,,,,02.10Z,NAFRev2,N,,,0,,,,,,
909612061,00012,90961206100012,O,2022-02-23,,,,2022-09-13T04:25:33,true,2,,,,,LES BRUYERES,58230,GIEN-SUR-CURE,,,58125,,,,,,,,,,,,,,,,,,,2022-05-31,F,,,,ADB SERVICE,02.10Z,NAFRev2,N,4.074751,47.155087,0.39,street,Les Peus Bouchon Nord 58230 Gien-sur-Cure,58125_B047,G,LES PEUS BOUCHON NORD,
910421502,00014,91042150200014,O,2022-03-01,,,,2022-02-18T09:49:42,true,1,LE BOURG,121,,RTE,DEPARTEMENTALE,58230,GIEN-SUR-CURE,,,58125,,,,,,,,,,,,,,,,,,,2022-03-01,A,,,,,01.29Z,NAFRev2,N,4.098516,47.136863,0.38,street,Le Bourg 58230 Gien-sur-Cure,58125_q6r0zn,D,LE BOURG,
913136602,00012,91313660200012,O,2021-03-13,,,,2022-05-04T11:28:57,true,1,,,,RTE,DU LAC,58230,GIEN-SUR-CURE,,,58125,,,,,,,,,,,,,,,,,,,2021-03-13,A,,,,,68.20A,NAFRev2,N,4.07318,47.153505,0.34,street,Echeintre du Beau 58230 Gien-sur-Cure,58125_B026,G,ECHEINTRE DU BEAU,
917943680,00012,91794368000012,O,2022-06-17,,,,2022-08-01T15:34:38,true,1,,33,,RTE,DE MOUX ,58230,GIEN-SUR-CURE,,,58125,,,,,,,,,,,,,,,,,,,2022-06-17,A,,,,,68.20B,NAFRev2,N,4.095491,47.139951,0.38,street,Pre de la Mouille 58230 Gien-sur-Cure,58125_B053,G,PRE DE LA MOUILLE,
