siren,nic,siret,statutDiffusionEtablissement,dateCreationEtablissement,trancheEffectifsEtablissement,anneeEffectifsEtablissement,activitePrincipaleRegistreMetiersEtablissement,dateDernierTraitementEtablissement,etablissementSiege,nombrePeriodesEtablissement,complementAdresseEtablissement,numeroVoieEtablissement,indiceRepetitionEtablissement,typeVoieEtablissement,libelleVoieEtablissement,codePostalEtablissement,libelleCommuneEtablissement,libelleCommuneEtrangerEtablissement,distributionSpecialeEtablissement,codeCommuneEtablissement,codeCedexEtablissement,libelleCedexEtablissement,codePaysEtrangerEtablissement,libellePaysEtrangerEtablissement,complementAdresse2Etablissement,numeroVoie2Etablissement,indiceRepetition2Etablissement,typeVoie2Etablissement,libelleVoie2Etablissement,codePostal2Etablissement,libelleCommune2Etablissement,libelleCommuneEtranger2Etablissement,distributionSpeciale2Etablissement,codeCommune2Etablissement,codeCedex2Etablissement,libelleCedex2Etablissement,codePaysEtranger2Etablissement,libellePaysEtranger2Etablissement,dateDebut,etatAdministratifEtablissement,enseigne1Etablissement,enseigne2Etablissement,enseigne3Etablissement,denominationUsuelleEtablissement,activitePrincipaleEtablissement,nomenclatureActivitePrincipaleEtablissement,caractereEmployeurEtablissement,longitude,latitude,geo_score,geo_type,geo_adresse,geo_id,geo_ligne,geo_l4,geo_l5
096773379,00019,09677337900019,O,,NN,,,,true,1,,,,,,64450,VIVEN,,,64560,,,,,,,,,,,,,,,,,,,1994-05-04,F,,,,,55.3A,NAF1993,N,,,0,,,,,,
216405605,00017,21640560500017,O,1983-03-01,01,2020,,2022-08-29T09:08:21,true,3,,,,,,64450,VIVEN,,,64560,,,,,,,,,,,,,,,,,,,2008-01-01,A,MAIRIE,,,,84.11Z,NAFRev2,N,,,0,,,,,,
266405372,00019,26640537200019,O,1983-03-01,NN,,,2018-12-10T11:58:16,true,4,,,,,,64450,VIVEN,,,64560,,,,,,,,,,,,,,,,,,,2016-12-31,F,CCAS,,,,88.99B,NAFRev2,N,,,0,,,,,,
314069618,00010,31406961800010,O,1978-01-01,,,,2008-11-07T00:29:24,true,4,,,,,,64450,VIVEN,,,64560,,,,,,,,,,,,,,,,,,,2005-12-31,F,,,,,45.4J,NAFRev1,N,,,0,,,,,,
321384414,00017,32138441400017,O,,NN,,,,true,1,,,,,,64450,VIVEN,,,64560,,,,,,,,,,,,,,,,,,,1988-12-31,F,,,,,55.73,NAP,N,,,0,,,,,,
322050006,00012,32205000600012,O,1900-01-01,,,,2011-04-28T00:19:28,false,2,,,,,,64450,VIVEN,,,64560,,,,,,,,,,,,,,,,,,,1984-12-25,F,,,,,57.03,NAP,N,,,0,,,,,,
331898064,00018,33189806400018,O,1985-01-01,,,,2014-07-08T00:36:57,true,5,,,,,,64450,VIVEN,,,64560,,,,,,,,,,,,,,,,,,,2010-11-29,F,,,,,16.10A,NAFRev2,N,,,0,,,,,,
344862222,00017,34486222200017,O,1988-01-01,NN,,,2013-03-05T10:03:48,false,3,,,,,,64450,VIVEN,,,64560,,,,,,,,,,,,,,,,,,,1998-12-25,F,,,,,01.1A,NAF1993,N,,,0,,,,,,
350211256,00028,35021125600028,O,,NN,,,,true,1,,,,CHE,DU BOURG,64450,VIVEN,,,64560,,,,,,,,,,,,,,,,,,,1995-02-01,F,,,,,74.2A,NAF1993,N,-0.369573,43.464079,0.79,street,Chemin du Bourg 64450 Viven,64560_0025,G,CHEMIN DU BOURG,
351338827,00014,35133882700014,O,1900-01-01,NN,,,2011-04-28T00:41:28,false,3,,,,,,64450,VIVEN,,,64560,,,,,,,,,,,,,,,,,,,1992-12-31,F,,,,,85.1G,NAF1993,N,,,0,,,,,,
378249031,00014,37824903100014,O,1990-06-01,NN,,,2008-01-04T21:14:27,true,3,,,,,,64450,VIVEN,,,64560,,,,,,,,,,,,,,,,,,,2008-01-01,A,,,,,86.90D,NAFRev2,N,,,0,,,,,,
380824003,00012,38082400300012,O,1991-01-01,NN,,,2008-01-04T21:48:03,true,3,,,,,,64450,VIVEN,,,64560,,,,,,,,,,,,,,,,,,,2008-01-01,A,,,,,01.11Z,NAFRev2,N,,,0,,,,,,
382060176,00015,38206017600015,O,1991-03-01,NN,,,2014-06-14T00:33:44,true,5,,,,,,64450,VIVEN,,,64560,,,,,,,,,,,,,,,,,,,2008-01-01,A,,,,,90.01Z,NAFRev2,O,,,0,,,,,,
384670030,00012,38467003000012,O,,NN,,,,true,1,,,,,,64450,VIVEN,,,64560,,,,,,,,,,,,,,,,,,,1992-10-31,F,,,,,74.4B,NAF1993,N,,,0,,,,,,
389659616,00012,38965961600012,O,1993-01-01,01,2020,,2022-08-29T09:14:14,true,4,,,,,,64450,VIVEN,,,64560,,,,,,,,,,,,,,,,,,,2016-08-01,A,,,,,01.43Z,NAFRev2,O,,,0,,,,,,
397582156,00014,39758215600014,O,1993-01-01,NN,,,,true,1,,,,,,64450,VIVEN,,,64560,,,,,,,,,,,,,,,,,,,1999-07-09,F,,,,,92.7C,NAF1993,N,,,0,,,,,,
397634080,00014,39763408000014,O,1994-07-01,NN,,,2008-01-04T18:31:54,true,3,,,,,,64450,VIVEN,,,64560,,,,,,,,,,,,,,,,,,,2008-01-01,A,,,,,56.10A,NAFRev2,N,,,0,,,,,,
401841317,00019,40184131700019,O,1900-01-01,NN,,,2006-12-15T00:58:59,false,3,,,,,,64450,VIVEN,,,64560,,,,,,,,,,,,,,,,,,,1995-12-25,F,,,,,85.1G,NAF1993,N,,,0,,,,,,
402121867,00012,40212186700012,O,1995-09-10,NN,,,2014-07-08T01:33:27,false,5,,,,CHE,DU BOURG,64450,VIVEN,,,64560,,,,,,,,,,,,,,,,,,,2012-10-01,F,,,,,43.29A,NAFRev2,O,-0.369573,43.464079,0.79,street,Chemin du Bourg 64450 Viven,64560_0025,G,CHEMIN DU BOURG,
409524220,00053,40952422000053,O,2001-08-01,NN,,,2014-07-08T01:41:24,false,4,,,,CHE,DU BORNY,64450,VIVEN,,,64560,,,,,,,,,,,,,,,,,,,2011-01-05,F,,,,,96.02A,NAFRev2,N,-0.388657,43.464653,0.79,street,Chemin du Borny 64450 Viven,64560_0020,G,CHEMIN DU BORNY,
412608077,00019,41260807700019,O,1997-07-01,,,,2022-09-29T10:48:34,false,3,,,,CHE,DE COSTE,64450,VIVEN,,,64560,,,,,,,,,,,,,,,,,,,1998-03-02,F,,,,,51.1T,NAF1993,N,-0.379489,43.464317,0.8,street,Chemin de Coste 64450 Viven,64560_0060,G,CHEMIN DE COSTE,
414575621,00019,41457562100019,O,1981-02-01,NN,,,2018-04-12T04:11:58,true,4,,,,,,64450,VIVEN,,,64560,,,,,,,,,,,,,,,,,,,2016-01-01,A,,,,,01.50Z,NAFRev2,N,,,0,,,,,,
414576520,00012,41457652000012,O,1980-01-01,NN,,,2008-01-04T22:50:52,true,3,,,,,,64450,VIVEN,,,64560,,,,,,,,,,,,,,,,,,,2008-01-01,A,,,,,01.11Z,NAFRev2,N,,,0,,,,,,
415056969,00017,41505696900017,O,1997-12-22,01,2020,,2022-08-29T09:31:27,true,3,MME GRACIET JEANNE,,,,,64450,VIVEN,,,64560,,,,,,,,,,,,,,,,,,,2008-01-01,A,,,,,68.20A,NAFRev2,N,,,0,,,,,,
417567179,00011,41756717900011,O,1974-07-01,NN,,,2008-11-26T05:40:01,true,4,,,,,,64450,VIVEN,,,64560,,,,,,,,,,,,,,,,,,,2008-02-29,F,,,,,01.50Z,NAFRev2,N,,,0,,,,,,
444133052,00019,44413305200019,O,2002-10-22,NN,,,2019-03-15T04:10:35,true,3,,,,CHE,DU BOURG,64450,VIVEN,,,64560,,,,,,,,,,,,,,,,,,,2008-01-01,A,,,,,68.20A,NAFRev2,N,-0.369573,43.464079,0.79,street,Chemin du Bourg 64450 Viven,64560_0025,G,CHEMIN DU BOURG,
448363184,00012,44836318400012,O,2003-04-01,NN,,,2010-02-23T08:48:46,false,3,,,,CHE,DE COSTE,64450,VIVEN,,,64560,,,,,,,,,,,,,,,,,,,2004-05-26,F,,,,,70.3A,NAFRev1,N,-0.379489,43.464317,0.8,street,Chemin de Coste 64450 Viven,64560_0060,G,CHEMIN DE COSTE,
478584691,00024,47858469100024,O,2006-01-01,NN,,,2014-07-08T02:54:40,true,5,,,,CHE,VIGNAU,64450,VIVEN,,,64560,,,,,,,,,,,,,,,,,,,2010-12-31,F,TLT,,,,43.91A,NAFRev2,O,-0.375786,43.457589,0.84,street,Chemin de Vignau 64450 Viven,64560_0300,G,CHEMIN DE VIGNAU,
478600091,00027,47860009100027,O,2006-01-01,,,,2014-07-08T02:54:43,true,4,,197,,CHE,VIGNAU,64450,VIVEN,,,64560,,,,,,,,,,,,,,,,,,,2013-11-01,A,,,,BEARN RENOVATION,43.91A,NAFRev2,N,-0.372671,43.459421,0.87,housenumber,197 Chemin de Vignau 64450 Viven,64560_0300_00197,G,197 CHEMIN DE VIGNAU,
482985140,00029,48298514000029,O,2010-07-01,,,2562BZ,2015-01-14T09:22:29,false,2,CHEMIN DU BORNY,,,RTE,D ARZACQ,64450,VIVEN,,,64560,,,,,,,,,,,,,,,,,,,2015-01-01,F,,,,,33.20A,NAFRev2,N,-0.390692,43.461204,0.8,street,Route d’Arzacq 64450 Viven,64560_0005,G,ROUTE D ARZACQ,
488272535,00011,48827253500011,O,2006-01-01,,,,2006-11-01T04:23:00,true,1,,,,CHE,DU VIGNAU,64450,VIVEN,,,64560,,,,,,,,,,,,,,,,,,,2006-01-01,F,,,,,92.3A,NAFRev1,N,-0.375786,43.457589,0.67,street,Chemin de Vignau 64450 Viven,64560_0300,G,CHEMIN DE VIGNAU,
500534839,00013,50053483900013,O,2007-10-06,,,,2016-02-23T03:23:15,true,2,,,,CHE,DU CHATEAU,64450,VIVEN,,,64560,,,,,,,,,,,,,,,,,,,2008-01-01,A,,,,,68.20B,NAFRev2,N,-0.37945,43.458625,0.8,street,Chemin du Château 64450 Viven,64560_0040,G,CHEMIN DU CHATEAU,
504999715,00023,50499971500023,O,2014-06-05,,,8129BP,2022-09-16T09:54:32,true,2,,100,,CHE,DU BORNY,64450,VIVEN,,,64560,,,,,,,,,,,,,,,,,,,2021-12-31,F,,,,,81.30Z,NAFRev2,N,-0.388487,43.464762,0.83,housenumber,100 Chemin du Borny 64450 Viven,64560_0020_00100,G,100 CHEMIN DU BORNY,
508412020,00028,50841202000028,O,2015-11-25,,,,2016-01-14T09:15:21,false,1,LA FINCA,,,,,64450,VIVEN,,,64560,,,,,,,,,,,,,,,,,,,2015-11-25,A,,,,,72.19Z,NAFRev2,N,,,0,,,,,,
513568527,00016,51356852700016,O,1991-03-28,,,,2009-07-09T08:44:42,true,1,,,,CHE,DU MOULIN,64450,VIVEN,,,64560,,,,,,,,,,,,,,,,,,,1991-03-28,A,,,,,01.11Z,NAFRev2,N,-0.361625,43.466124,0.81,street,Chemin du Moulin 64450 Viven,64560_0140,G,CHEMIN DU MOULIN,
514743962,00029,51474396200029,O,2009-11-24,,,,2012-11-10T01:14:51,true,2,,,,CHE,DU BOURG,64450,VIVEN,,,64560,,,,,,,,,,,,,,,,,,,2011-09-30,F,,,,,85.52Z,NAFRev2,N,-0.369573,43.464079,0.79,street,Chemin du Bourg 64450 Viven,64560_0025,G,CHEMIN DU BOURG,
523733657,00028,52373365700028,O,2014-09-27,,,,2018-01-29T13:56:54,true,2,,,,CHE,DE COSTE,64450,VIVEN,,,64560,,,,,,,,,,,,,,,,,,,2017-07-04,F,,,,,68.20B,NAFRev2,N,-0.379489,43.464317,0.8,street,Chemin de Coste 64450 Viven,64560_0060,G,CHEMIN DE COSTE,
528358716,00017,52835871600017,O,2010-11-01,,,,2015-06-01T08:28:41,true,2,,,,RTE,D ARZACQ,64450,VIVEN,,,64560,,,,,,,,,,,,,,,,,,,2013-09-30,F,,,,,17.29Z,NAFRev2,N,-0.390692,43.461204,0.8,street,Route d’Arzacq 64450 Viven,64560_0005,G,ROUTE D ARZACQ,
530614395,00016,53061439500016,O,2009-06-02,,,,2011-02-25T13:00:30,true,1,,,,CHE,DE MOUROU,64450,VIVEN,,,64560,,,,,,,,,,,,,,,,,,,2009-06-02,A,,,,,94.99Z,NAFRev2,N,-0.370862,43.462211,0.6,street,Chemin Mourou 64450 Viven,64560_0150,G,CHEMIN MOUROU,
534934005,00016,53493400500016,O,2011-10-01,NN,,,2017-05-04T08:00:25,true,2,,,,CHE,DE COSTE,64450,VIVEN,,,64560,,,,,,,,,,,,,,,,,,,2015-04-14,A,,,,,49.41B,NAFRev2,N,-0.379489,43.464317,0.8,street,Chemin de Coste 64450 Viven,64560_0060,G,CHEMIN DE COSTE,
534972724,00023,53497272400023,O,2015-08-31,,,8121ZZ,2020-06-11T04:09:17,true,2,,654,,CHE,DE COSTE,64450,VIVEN,,,64560,,,,,,,,,,,,,,,,,,,2019-07-01,F,,,,,81.21Z,NAFRev2,N,-0.379527,43.464394,0.83,housenumber,654 Chemin de Coste 64450 Viven,64560_0060_00654,G,654 CHEMIN DE COSTE,
539322479,00012,53932247900012,O,2012-01-20,,,4322AZ,2017-04-12T11:05:21,false,2,,,,CHE,BRAMEPAS,64450,VIVEN,,,64560,,,,,,,,,,,,,,,,,,,2015-03-31,F,,,,A+D'FUITES,43.22A,NAFRev2,N,-0.38403,43.464603,0.85,street,Chemin de Bramepas 64450 Viven,64560_0030,G,CHEMIN DE BRAMEPAS,
782336671,00022,78233667100022,O,,NN,,,,true,1,,,,CHE,COSTE,64450,VIVEN,,,64560,,,,,,,,,,,,,,,,,,,1996-03-27,F,,,,,45.4F,NAF1993,N,-0.379489,43.464317,0.84,street,Chemin de Coste 64450 Viven,64560_0060,G,CHEMIN DE COSTE,
782379150,00017,78237915000017,O,,NN,,,2006-11-25T22:14:29,true,1,,,,,MAIRIE,64450,VIVEN,,,64560,,,,,,,,,,,,,,,,,,,1995-03-24,F,,,,,70.3D,NAF1993,O,3.0709671,50.6304695,0.92,poi.townhall,Hôtel de Ville Lille,https://osm.org/way/40917078,G,,
782383350,00017,78238335000017,O,,NN,,,2006-11-25T22:14:29,true,1,,,,,,64450,VIVEN,,,64560,,,,,,,,,,,,,,,,,,,,F,,,,,01.74,NAP,N,,,0,,,,,,
782383368,00019,78238336800019,O,,,,,,true,1,,,,,,64450,VIVEN,,,64560,,,,,,,,,,,,,,,,,,,1985-12-25,F,,,,,48.01,NAP,N,,,0,,,,,,
794083378,00016,79408337800016,O,2013-06-27,,,4399CZ,2015-03-18T01:40:15,false,2,,,,CHE,DU MOULIN,64450,VIVEN,,,64560,,,,,,,,,,,,,,,,,,,2014-10-22,F,MDR MACONNERIE DECORATION RENOVATIO,,,MDR MACONNERIE DECORATION RENOVATION,43.99C,NAFRev2,N,-0.361625,43.466124,0.81,street,Chemin du Moulin 64450 Viven,64560_0140,G,CHEMIN DU MOULIN,
803505379,00013,80350537900013,O,2014-07-03,,,,2016-09-05T13:22:36,false,2,,1226,,CHE,DE COSTE,64450,VIVEN,,,64560,,,,,,,,,,,,,,,,,,,2016-04-17,F,,,,,01.49Z,NAFRev2,N,-0.38632,43.464356,0.84,housenumber,1226 Chemin de Coste 64450 Viven,64560_0060_01226,G,1226 CHEMIN DE COSTE,
808063150,00011,80806315000011,O,2014-10-10,,,,2015-11-19T04:35:07,false,2,,245,,CHE,DU MOULIN,64450,VIVEN,,,64560,,,,,,,,,,,,,,,,,,,2015-10-15,F,,,,,86.90D,NAFRev2,N,-0.363255,43.465853,0.84,housenumber,245 Chemin du Moulin 64450 Viven,64560_0140_00245,G,245 CHEMIN DU MOULIN,
822168431,00010,82216843100010,O,2016-09-01,,,,2016-08-26T09:26:30,true,1,,175,,CHE,MESTERNAUD,64450,VIVEN,,,64560,,,,,,,,,,,,,,,,,,,2016-09-01,A,,,,,68.32A,NAFRev2,N,-0.369979,43.459376,0.88,housenumber,175 Chemin de Mesternaud 64450 Viven,64560_0130_00175,G,175 CHEMIN DE MESTERNAUD,
822373429,00015,82237342900015,O,2016-08-29,,,,2019-02-26T14:18:10,false,2,,,,CHE,DE BORNY,64450,VIVEN,,,64560,,,,,,,,,,,,,,,,,,,2019-01-01,F,,,,,68.20B,NAFRev2,N,-0.388657,43.464653,0.58,street,Chemin du Borny 64450 Viven,64560_0020,G,CHEMIN DU BORNY,
824127328,00022,82412732800022,O,2017-04-01,,,,2017-12-04T11:32:52,true,2,,44,,CHE,DU BORNY,64450,VIVEN,,,64560,,,,,,,,,,,,,,,,,,,2017-07-15,F,,,,,85.52Z,NAFRev2,N,-0.387392,43.464281,0.82,housenumber,44 Chemin du Borny 64450 Viven,64560_0020_00044,G,44 CHEMIN DU BORNY,
827729625,00018,82772962500018,O,2016-12-29,,,,2017-02-16T08:37:06,true,1,,445,,CHE,DU CHATEAU VIVEN,64450,VIVEN,,,64560,,,,,,,,,,,,,,,,,,,2016-12-29,A,,,,,64.20Z,NAFRev2,N,-0.375426,43.461457,0.86,housenumber,445 Chemin du Château 64450 Viven,64560_0040_00445,G,445 CHEMIN DU CHATEAU,
833250871,00013,83325087100013,O,2017-11-08,,,,2020-07-16T03:34:13,true,1,,223,,CHE,MOUROU,64450,VIVEN,,,64560,,,,,,,,,,,,,,,,,,,2017-11-08,A,,,,,64.20Z,NAFRev2,N,-0.370724,43.462293,0.81,housenumber,223 Chemin Mourou 64450 Viven,64560_0150_00223,G,223 CHEMIN MOUROU,
842785925,00020,84278592500020,O,2020-02-03,,,,2020-05-05T08:34:20,false,2,,445,,CHE,DU CHATEAU,64450,VIVEN,,,64560,,,,,,,,,,,,,,,,,,,2020-03-12,F,,,,,86.22C,NAFRev2,N,-0.375426,43.461457,0.83,housenumber,445 Chemin du Château 64450 Viven,64560_0040_00445,G,445 CHEMIN DU CHATEAU,
843390097,00015,84339009700015,O,2018-10-02,,,,2018-10-26T11:05:45,true,1,,877,,CHE,COSTE,64450,VIVEN,,,64560,,,,,,,,,,,,,,,,,,,2018-10-02,A,,,,,68.20B,NAFRev2,N,-0.382246,43.46389,0.87,housenumber,877 Chemin de Coste 64450 Viven,64560_0060_00877,G,877 CHEMIN DE COSTE,
853149292,00015,85314929200015,O,2019-07-26,,,,2019-08-19T09:51:12,true,1,,445,,CHE,DU CHATEAU,64450,VIVEN,,,64560,,,,,,,,,,,,,,,,,,,2019-07-26,A,,,,,68.20B,NAFRev2,N,-0.375426,43.461457,0.83,housenumber,445 Chemin du Château 64450 Viven,64560_0040_00445,G,445 CHEMIN DU CHATEAU,
882672652,00014,88267265200014,O,2020-03-03,,,,2020-03-30T08:34:18,true,1,,402,,,CHEMIN DE VIGNAU,64450,VIVEN,,,64560,,,,,,,,,,,,,,,,,,,2020-03-03,A,,,,,47.99A,NAFRev2,N,-0.37488,43.458693,0.94,housenumber,402 Chemin de Vignau 64450 Viven,64560_0300_00402,G,402 CHEMIN DE VIGNAU,
883018780,00014,88301878000014,O,2020-04-17,,,,2020-04-27T10:33:46,true,1,,442,,CHE,DU LUY,64450,VIVEN,,,64560,,,,,,,,,,,,,,,,,,,2020-04-17,A,,,,,68.20B,NAFRev2,N,-0.367137,43.463087,0.81,housenumber,442 Chemin du Luy 64450 Viven,64560_0100_00442,G,442 CHEMIN DU LUY,
908254386,00018,90825438600018,O,2021-12-15,,,7420ZQ,2021-12-16T04:23:25,true,1,MAISON TAUSIA,621,,RTE,D ARZACQ,64450,VIVEN,,,64560,,,,,,,,,,,,,,,,,,,2021-12-15,A,,,,EL GATO BLANCO,74.20Z,NAFRev2,N,-0.391095,43.461702,0.83,housenumber,621 Route d’Arzacq 64450 Viven,64560_0005_00621,G,621 ROUTE D ARZACQ,
908287592,00012,90828759200012,O,2021-12-15,,,,2021-12-18T04:12:38,true,1,,445,,CHE,DU CHATEAU,64450,VIVEN,,,64560,,,,,,,,,,,,,,,,,,,2021-12-15,A,,,,,68.10Z,NAFRev2,N,-0.375426,43.461457,0.83,housenumber,445 Chemin du Château 64450 Viven,64560_0040_00445,G,445 CHEMIN DU CHATEAU,
914090626,00013,91409062600013,O,2022-06-01,,,4321AB,2022-06-01T14:39:36,true,1,,264,,CHE,DE BRAMEPAS,64450,VIVEN,,,64560,,,,,,,,,,,,,,,,,,,2022-06-01,A,,,,MB SUD MULTISERVICES,43.21A,NAFRev2,N,-0.382639,43.466262,0.84,housenumber,264 Chemin de Bramepas 64450 Viven,64560_0030_00264,G,264 CHEMIN DE BRAMEPAS,
919575522,00017,91957552200017,O,2022-09-01,,,,2022-10-01T04:07:56,true,1,,1146,,CHE,DE COSTE ,64450,VIVEN,,,64560,,,,,,,,,,,,,,,,,,,2022-09-01,A,,,,,68.31Z,NAFRev2,N,-0.38532,43.464388,0.72,housenumber,1146 Chemin de Coste 64450 Viven,64560_0060_01146,G,1146 CHEMIN DE COSTE,
