siren,nic,siret,statutDiffusionEtablissement,dateCreationEtablissement,trancheEffectifsEtablissement,anneeEffectifsEtablissement,activitePrincipaleRegistreMetiersEtablissement,dateDernierTraitementEtablissement,etablissementSiege,nombrePeriodesEtablissement,complementAdresseEtablissement,numeroVoieEtablissement,indiceRepetitionEtablissement,typeVoieEtablissement,libelleVoieEtablissement,codePostalEtablissement,libelleCommuneEtablissement,libelleCommuneEtrangerEtablissement,distributionSpecialeEtablissement,codeCommuneEtablissement,codeCedexEtablissement,libelleCedexEtablissement,codePaysEtrangerEtablissement,libellePaysEtrangerEtablissement,complementAdresse2Etablissement,numeroVoie2Etablissement,indiceRepetition2Etablissement,typeVoie2Etablissement,libelleVoie2Etablissement,codePostal2Etablissement,libelleCommune2Etablissement,libelleCommuneEtranger2Etablissement,distributionSpeciale2Etablissement,codeCommune2Etablissement,codeCedex2Etablissement,libelleCedex2Etablissement,codePaysEtranger2Etablissement,libellePaysEtranger2Etablissement,dateDebut,etatAdministratifEtablissement,enseigne1Etablissement,enseigne2Etablissement,enseigne3Etablissement,denominationUsuelleEtablissement,activitePrincipaleEtablissement,nomenclatureActivitePrincipaleEtablissement,caractereEmployeurEtablissement,longitude,latitude,geo_score,geo_type,geo_adresse,geo_id,geo_ligne,geo_l4,geo_l5
216503565,00014,21650356500014,O,1983-03-01,01,2020,,2022-08-29T09:08:23,true,3,,,,,,65130,PERE,,,65356,,,,,,,,,,,,,,,,,,,2008-01-01,A,MAIRIE,,,,84.11Z,NAFRev2,N,,,0,,,,,,
266504554,00012,26650455400012,O,1984-11-20,NN,,,2021-09-29T17:35:38,true,4,,,,,MAIRIE,65130,PERE,,,65356,,,,,,,,,,,,,,,,,,,2021-09-29,F,CCAS,,,,88.99B,NAFRev2,N,0.311082,43.136696,0.9,street,Place de la Mairie 65130 Péré,65356_0120,G,PLACE DE LA MAIRIE,
331808873,00045,33180887300045,O,2017-11-01,,,,2022-10-18T13:55:56,true,2,,,,,LE POUTX,65130,PERE,,,65356,,,,,,,,,,,,,,,,,,,2022-10-31,F,,,,,01.11Z,NAFRev2,N,0.300007,43.151437,0.61,street,Lieu Dit Poutx 65130 Péré,65356_5h7v3q,G,LIEU DIT POUTX,
351560529,00015,35156052900015,O,1989-07-01,NN,,,2008-01-04T23:31:12,true,3,,,,,,65130,PERE,,,65356,,,,,,,,,,,,,,,,,,,2008-01-01,A,,,,,01.42Z,NAFRev2,N,,,0,,,,,,
397516162,00013,39751616200013,O,1993-07-01,NN,,,,true,1,,,,,,65130,PERE,,,65356,,,,,,,,,,,,,,,,,,,1999-08-01,F,,,,,01.2A,NAF1993,N,,,0,,,,,,
407904549,00018,40790454900018,O,1994-04-12,,,,2008-01-04T21:01:27,true,3,,,,,LES COUSTALATS,65130,PERE,,,65356,,,,,,,,,,,,,,,,,,,2008-01-01,A,,,,,94.99Z,NAFRev2,N,,,0,,,,,,
419148333,00018,41914833300018,O,1996-12-31,,,,,true,1,,,,,LES COUSTALATS,65130,PERE,,,65356,,,,,,,,,,,,,,,,,,,1999-10-11,F,,,,,01.1A,NAF1993,N,,,0,,,,,,
419148341,00011,41914834100011,O,1991-12-31,NN,,,2018-11-30T04:23:22,true,4,,,,,,65130,PERE,,,65356,,,,,,,,,,,,,,,,,,,2015-01-01,A,,,,,01.11Z,NAFRev2,N,,,0,,,,,,
420358160,00018,42035816000018,O,1986-12-31,NN,,,2008-01-04T23:50:44,true,3,,,,,,65130,PERE,,,65356,,,,,,,,,,,,,,,,,,,2008-01-01,A,,,,,01.42Z,NAFRev2,N,,,0,,,,,,
420456253,00012,42045625300012,O,1993-12-31,NN,,,2008-01-04T23:52:15,true,3,,,,,,65130,PERE,,,65356,,,,,,,,,,,,,,,,,,,2008-01-01,A,,,,,01.50Z,NAFRev2,N,,,0,,,,,,
422669101,00012,42266910100012,O,1999-04-01,NN,,,2008-01-05T00:25:20,true,3,,,,,,65130,PERE,,,65356,,,,,,,,,,,,,,,,,,,2008-01-01,A,,,,,01.42Z,NAFRev2,N,,,0,,,,,,
433081114,00061,43308111400061,O,2022-08-15,,,,2022-10-01T04:59:24,false,1,,1288,,,RAMPE DE CAPVERN,65130,PERE,,,65356,,,,,,,,,,,,,,,,,,,2022-08-15,A,GANGSTA BULLYS,,,,01.49Z,NAFRev2,N,0.30285,43.144932,0.93,housenumber,1288 Rampe de Capvern 65130 Péré,65356_0040_01288,G,1288 RAMPE DE CAPVERN,
441628781,00011,44162878100011,O,2001-06-01,NN,,3312ZA,2021-09-30T18:18:18,false,4,,,,,,65130,PERE,,,65356,,,,,,,,,,,,,,,,,,,2008-12-31,F,,,,,01.11Z,NAFRev2,N,,,0,,,,,,
441628781,00029,44162878100029,O,2002-04-17,NN,,,2021-09-30T18:18:18,true,3,FERME CONSERVATOIRE BIGOUR,,,,,65130,PERE,,,65356,,,,,,,,,,,,,,,,,,,2008-01-01,A,,,,,33.12Z,NAFRev2,N,,,0,,,,,,
479006157,00016,47900615700016,O,2004-10-11,,,,2015-04-01T04:50:16,true,4,,,,,,65130,PERE,,,65356,,,,,,,,,,,,,,,,,,,2015-01-31,F,,,,,01.11Z,NAFRev2,N,,,0,,,,,,
492307392,00018,49230739200018,O,2000-01-01,,,,2017-01-16T10:37:07,true,3,TAILLADE,,,,,65130,PERE,,,65356,,,,,,,,,,,,,,,,,,,2016-06-12,F,,,,,02.10Z,NAFRev2,N,,,0,,,,,,
510998974,00016,51099897400016,O,2009-03-09,,,4322AZ,2015-05-07T04:21:55,true,2,SARRAMEA,,,,,65130,PERE,,,65356,,,,,,,,,,,,,,,,,,,2015-05-06,F,,,,,43.22A,NAFRev2,N,0.290246,43.145697,0.91,street,Chemin Sarramea 65130 Péré,65356_0150,D,CHEMIN SARRAMEA,
538021650,00022,53802165000022,O,2013-01-31,,,,2016-12-16T11:08:33,false,2,,,,,TAILLADE,65130,PERE,,,65356,,,,,,,,,,,,,,,,,,,2016-03-07,F,,,,,72.19Z,NAFRev2,N,-0.2152563,42.9966417,0.89,poi.stream,Ruisseau de Taillade Aucun,https://osm.org/way/193639723,G,,
572139996,01397,57213999601397,O,1989-01-01,NN,,,,false,4,,,,,,65130,PERE,,,65356,,,,,,,,,,,,,,,,,,,2002-12-31,F,,,,,63.2A,NAF1993,N,,,0,,,,,,
751339847,00012,75133984700012,O,2012-05-03,,,,2012-05-04T09:28:49,true,1,LES COUSTALATS,,,,,65130,PERE,,,65356,,,,,,,,,,,,,,,,,,,2012-05-03,A,,,,,01.42Z,NAFRev2,N,,,0,,,,,,
777104266,00021,77710426600021,O,,NN,,,,true,1,,,,,RN 117,65130,PERE,,,65356,,,,,,,,,,,,,,,,,,,1981-07-14,F,,,,,36.1G,NAF1993,N,,,0,,,,,,
793860669,00019,79386066900019,O,2013-06-11,,,,2021-03-26T03:34:21,true,2,LE VILLAGE,,,,,65130,PERE,,,65356,,,,,,,,,,,,,,,,,,,2021-01-01,A,LA FERME BIGOURD'ANE,,,,68.20B,NAFRev2,N,0.307869,43.140769,0.33,street,Chemin de Braqueville 65130 Péré,65356_0030,D,CHEMIN DE BRAQUEVILLE,
810561134,00018,81056113400018,O,2015-02-01,,,,2015-04-01T04:50:16,true,1,VILLAGE,,,,,65130,PERE,,,65356,,,,,,,,,,,,,,,,,,,2015-02-01,A,,,,,01.45Z,NAFRev2,N,0.307869,43.140769,0.33,street,Chemin de Braqueville 65130 Péré,65356_0030,D,CHEMIN DE BRAQUEVILLE,
824929095,00019,82492909500019,O,2016-06-13,,,,2017-01-16T10:37:07,true,1,,,,,TAILLADE,65130,PERE,,,65356,,,,,,,,,,,,,,,,,,,2016-06-13,A,,,,,02.10Z,NAFRev2,N,-0.2152563,42.9966417,0.89,poi.stream,Ruisseau de Taillade Aucun,https://osm.org/way/193639723,G,,
830760088,00021,83076008800021,O,2022-11-01,,,,2022-10-18T13:55:56,true,1,,,,LD,LE POUTX,65130,PERE,,,65356,,,,,,,,,,,,,,,,,,,2022-11-01,A,CORDIER STEPHANE,,,,01.19Z,NAFRev2,N,0.300007,43.151437,0.61,street,Lieu Dit Poutx 65130 Péré,65356_5h7v3q,G,LIEU DIT POUTX,
878115518,00010,87811551800010,O,2019-10-12,,,,2021-02-10T08:37:27,true,2,,840,,CHE,DE LA SERRE,65130,PERE,,,65356,,,,,,,,,,,,,,,,,,,2021-02-01,A,,,,,70.22Z,NAFRev2,O,0.30369,43.13425,0.84,housenumber,840 Chemin de la Serre 65130 Péré,65356_0160_00840,G,840 CHEMIN DE LA SERRE,
893299727,00014,89329972700014,O,2021-01-01,,,,2021-02-01T09:39:33,true,1,,65,,CHE,CASTAY,65130,PERE,,,65356,,,,,,,,,,,,,,,,,,,2021-01-01,A,,,,,01.43Z,NAFRev2,N,0.307024,43.133985,0.79,housenumber,65 Chemin Castay 65130 Péré,65356_0050_00065,G,65 CHEMIN CASTAY,
900266008,00011,90026600800011,O,2021-06-10,,,,2021-06-11T09:42:42,true,1,,1492,,CHE,DE SARRAMEA,65130,PERE,,,65356,,,,,,,,,,,,,,,,,,,2021-06-10,A,,,,MF PLUS,85.60Z,NAFRev2,N,0.290246,43.145697,0.51,street,Chemin Sarramea 65130 Péré,65356_0150,G,CHEMIN SARRAMEA,
