siren,nic,siret,statutDiffusionEtablissement,dateCreationEtablissement,trancheEffectifsEtablissement,anneeEffectifsEtablissement,activitePrincipaleRegistreMetiersEtablissement,dateDernierTraitementEtablissement,etablissementSiege,nombrePeriodesEtablissement,complementAdresseEtablissement,numeroVoieEtablissement,indiceRepetitionEtablissement,typeVoieEtablissement,libelleVoieEtablissement,codePostalEtablissement,libelleCommuneEtablissement,libelleCommuneEtrangerEtablissement,distributionSpecialeEtablissement,codeCommuneEtablissement,codeCedexEtablissement,libelleCedexEtablissement,codePaysEtrangerEtablissement,libellePaysEtrangerEtablissement,complementAdresse2Etablissement,numeroVoie2Etablissement,indiceRepetition2Etablissement,typeVoie2Etablissement,libelleVoie2Etablissement,codePostal2Etablissement,libelleCommune2Etablissement,libelleCommuneEtranger2Etablissement,distributionSpeciale2Etablissement,codeCommune2Etablissement,codeCedex2Etablissement,libelleCedex2Etablissement,codePaysEtranger2Etablissement,libellePaysEtranger2Etablissement,dateDebut,etatAdministratifEtablissement,enseigne1Etablissement,enseigne2Etablissement,enseigne3Etablissement,denominationUsuelleEtablissement,activitePrincipaleEtablissement,nomenclatureActivitePrincipaleEtablissement,caractereEmployeurEtablissement,longitude,latitude,geo_score,geo_type,geo_adresse,geo_id,geo_ligne,geo_l4,geo_l5
186803615,00019,18680361500019,O,1985-09-09,NN,,,2014-06-13T23:19:16,true,3,,1,,RUE,DES EGLISES,68630,MITTELWIHR,,,68209,,,,,,,,,,,,,,,,,,,2008-01-01,A,,,,,94.91Z,NAFRev2,N,7.322269,48.151367,0.94,housenumber,1 Rue des Eglises 68630 Mittelwihr,68209_0140_00001,G,1 RUE DES EGLISES,
216802090,00011,21680209000011,O,1983-03-01,03,2020,,2022-08-29T09:08:30,true,4,,,,RTE,DU VIN,68630,MITTELWIHR,,,68209,,,,,,,,,,,,,,,,,,,2008-01-01,A,MAIRIE,,,,84.11Z,NAFRev2,O,7.32094,48.152335,0.78,street,Route du Vin 68630 Mittelwihr,68209_0280,G,ROUTE DU VIN,
216802090,00029,21680209000029,O,1983-12-21,NN,,,2006-10-26T23:41:28,false,3,,14,,RUE,DE L ECOLE,68630,MITTELWIHR,,,68209,,,,,,,,,,,,,,,,,,,2004-09-01,F,ECOLE MATERNELLE PUBLIQUE,,,,80.1Z,NAFRev1,N,7.323774,48.149703,0.95,housenumber,14 Rue de l’Ecole 68630 Mittelwihr,68209_0120_00014,G,14 RUE DE L ECOLE,
216802090,00037,21680209000037,O,1983-12-21,NN,,,2014-06-13T23:34:56,false,4,,14,,RUE,DE L ECOLE,68630,MITTELWIHR,,,68209,,,,,,,,,,,,,,,,,,,2011-11-14,A,ECOLE ELEMENTAIRE PUBLIQUE INTERCOMMUNALE,,,,85.20Z,NAFRev2,N,7.323774,48.149703,0.95,housenumber,14 Rue de l’Ecole 68630 Mittelwihr,68209_0120_00014,G,14 RUE DE L ECOLE,
216802090,00045,21680209000045,O,1995-01-01,NN,,,2012-05-05T00:30:33,false,3,MAIRIE,,,RTE,DU VIN,68630,MITTELWIHR,,,68209,,,,,,,,,,,,,,,,,,,2008-01-01,A,SCE EAU ET ASSAINISSEMENT,,,,36.00Z,NAFRev2,N,7.32094,48.152335,0.78,street,Route du Vin 68630 Mittelwihr,68209_0280,G,ROUTE DU VIN,
216802090,00052,21680209000052,O,1985-01-01,NN,,,2012-05-05T00:30:33,false,3,,,,,,68630,MITTELWIHR,,,68209,,,,,,,,,,,,,,,,,,,2008-01-01,A,,,,,02.20Z,NAFRev2,N,,,0,,,,,,
256800368,00043,25680036800043,O,2015-10-30,01,2020,,2022-08-29T09:10:08,true,1,MAIRIE DE MITTELWIHR,,,RTE,DU VIN,68630,MITTELWIHR,,,68209,,,,,,,,,,,,,,,,,,,2015-10-30,A,,,,,93.11Z,NAFRev2,O,7.32094,48.152335,0.78,street,Route du Vin 68630 Mittelwihr,68209_0280,G,ROUTE DU VIN,
266801521,00011,26680152100011,O,1995-12-25,NN,,,2010-06-26T03:14:32,true,2,,,,RTE,DU VIN,68630,MITTELWIHR,,,68209,,,,,,,,,,,,,,,,,,,2008-01-01,A,CCAS MITTELWIHR,,,,88.99B,NAFRev2,N,7.32094,48.152335,0.78,street,Route du Vin 68630 Mittelwihr,68209_0280,G,ROUTE DU VIN,
296800618,00013,29680061800013,O,,,,,2006-11-25T09:11:01,true,1,,,,RTE,DU VIN,68630,MITTELWIHR,,,68209,,,,,,,,,,,,,,,,,,,1987-12-31,F,,,,,90.12,NAP,N,7.32094,48.152335,0.78,street,Route du Vin 68630 Mittelwihr,68209_0280,G,ROUTE DU VIN,
296803794,00019,29680379400019,O,1987-04-06,NN,,,,true,4,MAIRIE,,,RTE,DU VIN,68630,MITTELWIHR,,,68209,,,,,,,,,,,,,,,,,,,2002-12-31,F,AFU LANGACKER,,,,70.1C,NAF1993,O,7.32094,48.152335,0.78,street,Route du Vin 68630 Mittelwihr,68209_0280,G,ROUTE DU VIN,
302253968,00010,30225396800010,O,1900-01-01,NN,,,2008-01-04T19:19:22,true,3,,6,,RUE,DU BOUXHOF,68630,MITTELWIHR,,,68209,,,,,,,,,,,,,,,,,,,2008-01-01,A,,,,,68.20B,NAFRev2,N,7.317572,48.14926,0.95,housenumber,6 Rue du Bouxhof 68630 Mittelwihr,68209_0060_00006,G,6 RUE DU BOUXHOF,
303537351,00015,30353735100015,O,1900-01-01,,,,2007-01-18T09:11:09,true,3,,8,,RUE,DU BURL,68630,MITTELWIHR,,,68209,,,,,,,,,,,,,,,,,,,1994-12-25,F,,,,,01.1G,NAF1993,N,7.319454,48.149479,0.75,housenumber,8 Rue du Buhl 68630 Mittelwihr,68209_0080_00008,G,8 RUE DU BUHL,
303554349,00017,30355434900017,O,1900-01-01,NN,,,2014-08-19T03:32:52,true,5,,7,,RUE,DES MERLES,68630,MITTELWIHR,,,68209,,,,,,,,,,,,,,,,,,,2014-02-28,F,,,,,68.20B,NAFRev2,N,7.317875,48.150624,0.95,housenumber,7 Rue des Merles 68630 Mittelwihr,68209_0200_00007,G,7 RUE DES MERLES,
303786511,00020,30378651100020,O,,,,,,true,1,,3,,RUE,DU BAS VILLAGE,68630,MITTELWIHR,,,68209,,,,,,,,,,,,,,,,,,,1998-03-23,F,,,,,01.1G,NAF1993,N,7.319202,48.149503,0.5,housenumber,3 Rue du Buhl 68630 Mittelwihr,68209_0080_00003,G,3 RUE DU BUHL,
303798870,00018,30379887000018,O,1900-01-01,NN,,,2008-01-04T19:27:13,true,3,,18,,RUE,DES MERLES,68630,MITTELWIHR,,,68209,,,,,,,,,,,,,,,,,,,2008-01-01,A,,,,,68.20B,NAFRev2,N,7.317401,48.150649,0.95,housenumber,18 Rue des Merles 68630 Mittelwihr,68209_0200_00018,G,18 RUE DES MERLES,
303870224,00019,30387022400019,O,1900-01-01,NN,,,2012-06-28T03:48:18,true,4,,2,,RUE,DE L'EGLISE,68630,MITTELWIHR,,,68209,,,,,,,,,,,,,,,,,,,2012-06-30,F,,,,,68.20B,NAFRev2,N,7.32203,48.15126,0.69,housenumber,2 Rue des Eglises 68630 Mittelwihr,68209_0140_00002,G,2 RUE DES EGLISES,
304037807,00019,30403780700019,O,,NN,,,,true,1,,11,,RUE,DES TILLEULS,68630,MITTELWIHR,,,68209,,,,,,,,,,,,,,,,,,,1998-04-03,F,,,,,01.1G,NAF1993,N,7.319179,48.151898,0.95,housenumber,11 Rue des Tilleuls 68630 Mittelwihr,68209_0240_00011,G,11 RUE DES TILLEULS,
304515091,00011,30451509100011,O,1900-01-01,NN,,,2016-04-26T01:46:14,false,5,,26,,RUE,DES MERLES,68630,MITTELWIHR,,,68209,,,,,,,,,,,,,,,,,,,2014-01-01,F,,,,,01.21Z,NAFRev2,O,7.315368,48.151004,0.95,housenumber,26 Rue des Merles 68630 Mittelwihr,68209_0200_00026,G,26 RUE DES MERLES,
304515091,00029,30451509100029,O,2014-01-01,01,2020,,2022-08-29T09:12:00,true,1,,26,,RUE,DES MERLES,68630,MITTELWIHR,,,68209,,,,,,,,,,,,,,,,,,,2014-01-01,A,,,,,01.21Z,NAFRev2,N,7.315368,48.151004,0.95,housenumber,26 Rue des Merles 68630 Mittelwihr,68209_0200_00026,G,26 RUE DES MERLES,
305070930,00022,30507093000022,O,,NN,,,,true,1,,12,,RUE,DE L ECOLE,68630,MITTELWIHR,,,68209,,,,,,,,,,,,,,,,,,,1999-12-31,F,,,,,01.1G,NAF1993,N,7.322645,48.150157,0.95,housenumber,12 Rue de l’Ecole 68630 Mittelwihr,68209_0120_00012,G,12 RUE DE L ECOLE,
305081705,00017,30508170500017,O,1900-01-01,NN,,,,true,4,,8,,RUE,DE RIQUEWIHR,68630,MITTELWIHR,,,68209,,,,,,,,,,,,,,,,,,,1995-12-25,F,,,,,01.1G,NAF1993,N,7.319498,48.150726,0.95,housenumber,8 Rue de Riquewihr 68630 Mittelwihr,68209_0220_00008,G,8 RUE DE RIQUEWIHR,
305094682,00021,30509468200021,O,1900-01-01,NN,,,2006-10-27T00:06:58,true,3,,12,A,RUE,DE L ECOLE,68630,MITTELWIHR,,,68209,,,,,,,,,,,,,,,,,,,2004-12-02,F,,,,,01.1G,NAFRev1,N,7.322645,48.150157,0.95,housenumber,12a Rue de l’Ecole 68630 Mittelwihr,68209_0120_00012_a,G,12A RUE DE L ECOLE,
305598443,00011,30559844300011,O,,NN,,,,true,1,,5,,RUE,DES TILLEULS,68630,MITTELWIHR,,,68209,,,,,,,,,,,,,,,,,,,1993-02-10,F,,,,,18.2C,NAF1993,N,7.318968,48.151425,0.95,housenumber,5 Rue des Tilleuls 68630 Mittelwihr,68209_0240_00005,G,5 RUE DES TILLEULS,
305803173,00015,30580317300015,O,1976-01-01,NN,,,2008-01-04T19:38:10,true,3,,3,,RTE,DU VIN,68630,MITTELWIHR,,,68209,,,,,,,,,,,,,,,,,,,2008-01-01,A,,,,,68.20B,NAFRev2,N,7.320373,48.153814,0.81,housenumber,3 Route du Vin 68630 Mittelwihr,68209_0280_00003,G,3 ROUTE DU VIN,
308249994,00010,30824999400010,O,,NN,,,,true,1,,,,RUE,DU BAS VILLAGE,68630,MITTELWIHR,,,68209,,,,,,,,,,,,,,,,,,,,F,,,,,67.01,NAP,N,7.319087,48.149603,0.45,street,Rue du Buhl 68630 Mittelwihr,68209_0080,G,RUE DU BUHL,
309202075,00011,30920207500011,O,1993-01-01,NN,,,2008-01-09T11:45:19,true,4,,8,,RUE,DES MERLES,68630,MITTELWIHR,,,68209,,,,,,,,,,,,,,,,,,,2008-01-01,F,,,,,68.20B,NAFRev2,N,7.318833,48.150147,0.95,housenumber,8 Rue des Merles 68630 Mittelwihr,68209_0200_00008,G,8 RUE DES MERLES,
309494672,00012,30949467200012,O,,NN,,,,true,1,,14,,RTE,DU VIN,68630,MITTELWIHR,,,68209,,,,,,,,,,,,,,,,,,,,F,,,,,37.04,NAP,N,7.320834,48.150879,0.82,housenumber,14 Route du Vin 68630 Mittelwihr,68209_0280_00014,G,14 ROUTE DU VIN,
309506418,00016,30950641800016,O,1977-01-01,NN,,,,true,1,,,,RUE,DES TILLEULS,68630,MITTELWIHR,,,68209,,,,,,,,,,,,,,,,,,,1999-11-30,F,,,,,52.4J,NAF1993,O,7.31904,48.151973,0.95,street,Rue des Tilleuls 68630 Mittelwihr,68209_0240,G,RUE DES TILLEULS,
310105812,00013,31010581200013,O,1977-01-01,NN,,,2007-01-16T14:11:35,true,3,,20,,RUE,DES MERLES,68630,MITTELWIHR,,,68209,,,,,,,,,,,,,,,,,,,2006-12-31,F,,,,,01.1G,NAFRev1,N,7.316908,48.150725,0.95,housenumber,20 Rue des Merles 68630 Mittelwihr,68209_0200_00020,G,20 RUE DES MERLES,
310446190,00012,31044619000012,O,,NN,,,,true,1,,21,,RUE,DES MERLES,68630,MITTELWIHR,,,68209,,,,,,,,,,,,,,,,,,,2001-11-23,F,,,,,01.1G,NAF1993,N,7.313998,48.151098,0.95,housenumber,21 Rue des Merles 68630 Mittelwihr,68209_0200_00021,G,21 RUE DES MERLES,
310599543,00033,31059954300033,O,1983-09-15,NN,,,2013-09-03T09:11:58,false,4,,3,,RUE,DU BOUXHOF,68630,MITTELWIHR,,,68209,,,,,,,,,,,,,,,,,,,2008-01-01,F,,,,,68.20B,NAFRev2,N,7.32061,48.148781,0.95,housenumber,3 Rue du Bouxhof 68630 Mittelwihr,68209_0060_00003,G,3 RUE DU BOUXHOF,
310708565,00018,31070856500018,O,,,,,,true,1,,11,,RUE,DES MERLES,68630,MITTELWIHR,,,68209,,,,,,,,,,,,,,,,,,,1996-05-31,F,,,,,01.1G,NAF1993,N,7.317226,48.150726,0.95,housenumber,11 Rue des Merles 68630 Mittelwihr,68209_0200_00011,G,11 RUE DES MERLES,
311973259,00014,31197325900014,O,1975-01-01,NN,,,2010-02-01T07:42:30,true,5,,4,,RTE,DU VIN,68630,MITTELWIHR,,,68209,,,,,,,,,,,,,,,,,,,2009-01-01,A,,,,,01.21Z,NAFRev2,N,7.321106,48.152086,0.81,housenumber,4 Route du Vin 68630 Mittelwihr,68209_0280_00004,G,4 ROUTE DU VIN,
312116072,00017,31211607200017,O,1978-01-01,NN,,,2014-04-01T03:33:15,true,4,,5,,RUE,DES MERLES,68630,MITTELWIHR,,,68209,,,,,,,,,,,,,,,,,,,2014-03-31,F,,,,,68.20B,NAFRev2,N,7.31826,48.150633,0.95,housenumber,5 Rue des Merles 68630 Mittelwihr,68209_0200_00005,G,5 RUE DES MERLES,
313156093,00012,31315609300012,O,1978-01-01,NN,,,,true,1,,2,,PL,CHARLES DE GAULLE,68630,MITTELWIHR,,,68209,,,,,,,,,,,,,,,,,,,1995-06-21,F,,,,,70.2C,NAF1993,N,7.319894,48.150204,0.86,housenumber,2 Place Charles de Gaulle 68630 Mittelwihr,68209_0095_00002,G,2 PLACE CHARLES DE GAULLE,
314588773,00031,31458877300031,O,1986-10-16,NN,,,2012-07-28T09:58:15,true,4,,7,A,RUE,DU BOUXHOF,68630,MITTELWIHR,,,68209,,,,,,,,,,,,,,,,,,,2011-12-25,F,,,,,68.20B,NAFRev2,N,7.317413,48.149361,0.95,housenumber,7a Rue du Bouxhof 68630 Mittelwihr,68209_0060_00007_a,G,7A RUE DU BOUXHOF,
314804816,00010,31480481600010,O,,,,,,true,1,,12,,RUE,DE L ECOLE,68630,MITTELWIHR,,,68209,,,,,,,,,,,,,,,,,,,1984-12-25,F,,,,,00.10,NAP,N,7.322645,48.150157,0.95,housenumber,12 Rue de l’Ecole 68630 Mittelwihr,68209_0120_00012,G,12 RUE DE L ECOLE,
314804824,00022,31480482400022,O,,,,,,true,1,,4,,RUE,DES FLEURS,68630,MITTELWIHR,,,68209,,,,,,,,,,,,,,,,,,,2001-05-03,F,,,,,01.1G,NAF1993,N,7.319845,48.151349,0.95,housenumber,4 Rue des Fleurs 68630 Mittelwihr,68209_0160_00004,G,4 RUE DES FLEURS,
315144949,00015,31514494900015,O,1979-01-01,NN,,,2018-09-13T04:02:23,true,5,,2,,RUE,DES EGLISES,68630,MITTELWIHR,,,68209,,,,,,,,,,,,,,,,,,,2016-12-31,F,,,,,01.21Z,NAFRev2,O,7.32203,48.15126,0.94,housenumber,2 Rue des Eglises 68630 Mittelwihr,68209_0140_00002,G,2 RUE DES EGLISES,
317212298,00010,31721229800010,O,1979-01-01,NN,,,2012-01-05T03:54:57,true,5,,5,,RUE,DU VIGNOBLE,68630,MITTELWIHR,,,68209,,,,,,,,,,,,,,,,,,,2011-12-31,F,,,,,68.20B,NAFRev2,N,7.314803,48.152063,0.95,housenumber,5 Rue du Vignoble 68630 Mittelwihr,68209_0260_00005,G,5 RUE DU VIGNOBLE,
319735759,00023,31973575900023,O,1983-02-01,01,2020,4334ZC,2022-08-29T09:16:27,true,3,,2,,RUE,DE RIQUEWIHR,68630,MITTELWIHR,,,68209,,,,,,,,,,,,,,,,,,,2008-01-01,A,,,,,43.34Z,NAFRev2,O,7.319931,48.150415,0.95,housenumber,2 Rue de Riquewihr 68630 Mittelwihr,68209_0220_00002,G,2 RUE DE RIQUEWIHR,
322150806,00022,32215080600022,O,1987-01-01,NN,,,,false,4,,3,,RUE,DU BOUXHOFF,68630,MITTELWIHR,,,68209,,,,,,,,,,,,,,,,,,,1996-12-25,F,,,,,51.3J,NAF1993,O,7.32061,48.148781,0.86,housenumber,3 Rue du Bouxhof 68630 Mittelwihr,68209_0060_00003,G,3 RUE DU BOUXHOF,
322150806,00030,32215080600030,O,1996-03-04,NN,,,2018-09-29T12:19:38,true,5,,8,,RUE,DU CHATEAU,68630,MITTELWIHR,,,68209,,,,,,,,,,,,,,,,,,,2016-12-31,F,,,,,46.34Z,NAFRev2,N,7.322746,48.150568,0.95,housenumber,8 Rue du Chateau 68630 Mittelwihr,68209_0096_00008,G,8 RUE DU CHATEAU,
323376517,00013,32337651700013,O,,NN,,,,true,1,,3,,RTE,DU VIN,68630,MITTELWIHR,,,68209,,,,,,,,,,,,,,,,,,,,F,,,,,59.09,NAP,N,7.320373,48.153814,0.81,housenumber,3 Route du Vin 68630 Mittelwihr,68209_0280_00003,G,3 ROUTE DU VIN,
323642934,00018,32364293400018,O,1982-02-01,NN,,,2020-01-31T08:35:40,true,5,,12,,RUE,DU VIGNOBLE,68630,MITTELWIHR,,,68209,,,,,,,,,,,,,,,,,,,2008-01-01,F,,,,,71.11Z,NAFRev2,O,7.315359,48.151898,0.95,housenumber,12 Rue du Vignoble 68630 Mittelwihr,68209_0260_00012,G,12 RUE DU VIGNOBLE,
323808998,00013,32380899800013,O,1981-01-01,NN,,,,true,1,,1,,RUE,DU VIGNOBLE,68630,MITTELWIHR,,,68209,,,,,,,,,,,,,,,,,,,1994-06-12,F,,,,,01.1G,NAF1993,N,7.316262,48.151897,0.95,housenumber,1 Rue du Vignoble 68630 Mittelwihr,68209_0260_00001,G,1 RUE DU VIGNOBLE,
324205467,00032,32420546700032,O,1993-04-20,NN,,,,true,1,,22,,RTE,DU VIN,68630,MITTELWIHR,,,68209,,,,,,,,,,,,,,,,,,,1998-05-18,F,,,,,15.9A,NAF1993,O,7.320987,48.149892,0.82,housenumber,22 Route du Vin 68630 Mittelwihr,68209_0280_00022,G,22 ROUTE DU VIN,
325457182,00013,32545718200013,O,1982-01-01,01,2020,,2022-08-29T09:18:52,true,4,,22,,RUE,DE RIQUEWIHR,68630,MITTELWIHR,,,68209,,,,,,,,,,,,,,,,,,,2011-12-31,A,,,,,01.21Z,NAFRev2,O,7.318124,48.151334,0.95,housenumber,22 Rue de Riquewihr 68630 Mittelwihr,68209_0220_00022,G,22 RUE DE RIQUEWIHR,
325736601,00015,32573660100015,O,1975-04-01,NN,,,2011-05-13T03:53:09,true,5,,6,,RUE,VIGNOBLE,68630,MITTELWIHR,,,68209,,,,,,,,,,,,,,,,,,,2010-12-31,F,,,,,68.20B,NAFRev2,N,7.31618,48.151843,0.88,housenumber,6 Rue du Vignoble 68630 Mittelwihr,68209_0260_00006,G,6 RUE DU VIGNOBLE,
326250362,00018,32625036200018,O,,,,,,true,1,,14,,RTE,DU VIN,68630,MITTELWIHR,,,68209,,,,,,,,,,,,,,,,,,,1984-12-25,F,,,,,67.01,NAP,N,7.320834,48.150879,0.82,housenumber,14 Route du Vin 68630 Mittelwihr,68209_0280_00014,G,14 ROUTE DU VIN,
326707486,00014,32670748600014,O,1983-03-01,NN,,,,true,1,,8,,RUE,DE RIQUEWIR,68630,MITTELWIHR,,,68209,,,,,,,,,,,,,,,,,,,1999-12-31,F,,,,,70.2B,NAF1993,N,7.319498,48.150726,0.85,housenumber,8 Rue de Riquewihr 68630 Mittelwihr,68209_0220_00008,G,8 RUE DE RIQUEWIHR,
328465026,00016,32846502600016,O,1978-01-01,,,,2006-12-15T00:24:22,false,3,,24,,RUE,DE RIQUEWIHR,68630,MITTELWIHR,,,68209,,,,,,,,,,,,,,,,,,,1994-12-25,F,,,,,01.1G,NAF1993,N,7.31775,48.151522,0.95,housenumber,24 Rue de Riquewihr 68630 Mittelwihr,68209_0220_00024,G,24 RUE DE RIQUEWIHR,
328465026,00024,32846502600024,O,1995-04-01,NN,,,2021-03-23T04:54:55,true,5,,1,,PL,DES CIGOGNES,68630,MITTELWIHR,,,68209,,,,,,,,,,,,,,,,,,,2021-01-01,A,,,,PHILIPPE GOCKER VINS,46.34Z,NAFRev2,N,7.32026,48.150992,0.83,housenumber,1 Place des Cigognes 68630 Mittelwihr,68209_0100_00001,G,1 PLACE DES CIGOGNES,
329602080,00023,32960208000023,O,1900-01-01,,,,2006-12-15T00:24:55,false,4,,1,,RUE,BOUXHOF,68630,MITTELWIHR,,,68209,,,,,,,,,,,,,,,,,,,1993-12-25,F,,,,,55.3A,NAF1993,N,7.321041,48.148767,0.88,housenumber,1 Rue du Bouxhof 68630 Mittelwihr,68209_0060_00001,G,1 RUE DU BOUXHOF,
330481763,00010,33048176300010,O,1984-07-01,01,2020,,2022-08-29T09:21:30,true,5,,1,,RUE,DU CHATEAU,68630,MITTELWIHR,,,68209,,,,,,,,,,,,,,,,,,,2012-12-31,A,,,,,01.21Z,NAFRev2,O,7.32118,48.150786,0.95,housenumber,1 Rue du Chateau 68630 Mittelwihr,68209_0096_00001,G,1 RUE DU CHATEAU,
330499385,00012,33049938500012,O,1984-08-06,NN,,,2020-06-16T08:34:46,true,4,,1,,RTE,DU VIN,68630,MITTELWIHR,,,68209,,,,,,,,,,,,,,,,,,,2020-06-30,F,,,,,86.21Z,NAFRev2,N,7.319841,48.155264,0.81,housenumber,1 Route du Vin 68630 Mittelwihr,68209_0280_00001,G,1 ROUTE DU VIN,
331729087,00030,33172908700030,O,1996-07-01,NN,,4321AB,2021-04-16T08:46:41,true,8,,1,,RUE,DES FLEURS,68630,MITTELWIHR,,,68209,,,,,,,,,,,,,,,,,,,2020-12-31,F,,,,,43.21A,NAFRev2,N,7.319816,48.150786,0.95,housenumber,1 Rue des Fleurs 68630 Mittelwihr,68209_0160_00001,G,1 RUE DES FLEURS,
332713130,00018,33271313000018,O,,NN,,,,true,1,,2,A,RUE,DU CHATEAU,68630,MITTELWIHR,,,68209,,,,,,,,,,,,,,,,,,,1990-04-01,F,,,,,67.01,NAP,N,7.321117,48.150887,0.95,housenumber,2a Rue du Chateau 68630 Mittelwihr,68209_0096_00002_a,G,2A RUE DU CHATEAU,
333428571,00017,33342857100017,O,1984-06-23,NN,,,2008-01-04T20:39:05,true,3,,,,,MAIRIE,68630,MITTELWIHR,,,68209,,,,,,,,,,,,,,,,,,,2008-01-01,A,,,,,68.32A,NAFRev2,N,3.0709671,50.6304695,0.92,poi.townhall,Hôtel de Ville Lille,https://osm.org/way/40917078,G,,
333485100,00015,33348510000015,O,1985-07-01,NN,,,2021-12-23T03:41:19,true,3,,13,,RTE,DU VINS,68630,MITTELWIHR,,,68209,,,,,,,,,,,,,,,,,,,2008-01-01,A,,,,,01.21Z,NAFRev2,N,7.320884,48.151626,0.7,housenumber,13 Route du Vin 68630 Mittelwihr,68209_0280_00013,G,13 ROUTE DU VIN,
333610590,00015,33361059000015,O,1983-03-14,,,,2008-08-25T14:41:33,true,4,,8,,RUE,DU BUHL,68630,MITTELWIHR,,,68209,,,,,,,,,,,,,,,,,,,2008-01-01,F,,,,,01.21Z,NAFRev2,N,7.319454,48.149479,0.95,housenumber,8 Rue du Buhl 68630 Mittelwihr,68209_0080_00008,G,8 RUE DU BUHL,
333846194,00020,33384619400020,O,2001-05-01,,,,2006-10-27T02:32:44,true,3,,22,,RTE,DU VIN,68630,MITTELWIHR,,,68209,,,,,,,,,,,,,,,,,,,2004-04-30,F,,,,,52.4H,NAFRev1,N,7.320987,48.149892,0.82,housenumber,22 Route du Vin 68630 Mittelwihr,68209_0280_00022,G,22 ROUTE DU VIN,
333882561,00017,33388256100017,O,1985-09-01,NN,,,,false,4,,24,,RUE,DE RIQUEWIHR,68630,MITTELWIHR,,,68209,,,,,,,,,,,,,,,,,,,2000-02-04,F,,,,,01.1G,NAF1993,N,7.31775,48.151522,0.95,housenumber,24 Rue de Riquewihr 68630 Mittelwihr,68209_0220_00024,G,24 RUE DE RIQUEWIHR,
333882561,00025,33388256100025,O,2000-02-04,01,2019,,2021-10-27T08:30:08,true,4,,1,,PL,DES CIGOGNES,68630,MITTELWIHR,,,68209,,,,,,,,,,,,,,,,,,,2012-12-31,A,,,,,01.21Z,NAFRev2,O,7.32026,48.150992,0.83,housenumber,1 Place des Cigognes 68630 Mittelwihr,68209_0100_00001,G,1 PLACE DES CIGOGNES,
334202504,00125,33420250400125,O,2017-03-01,01,2020,,2022-08-29T09:23:39,false,2,,22,,RTE,DU VIN,68630,MITTELWIHR,,,68209,,,,,,,,,,,,,,,,,,,2017-04-01,A,,,,,46.34Z,NAFRev2,O,7.320987,48.149892,0.82,housenumber,22 Route du Vin 68630 Mittelwihr,68209_0280_00022,G,22 ROUTE DU VIN,
334681046,00010,33468104600010,O,1986-02-05,NN,,,2010-03-09T04:25:37,true,4,,1,,RUE,DU CHATEAU,68630,MITTELWIHR,,,68209,,,,,,,,,,,,,,,,,,,2009-12-31,F,,,,,47.25Z,NAFRev2,N,7.32118,48.150786,0.95,housenumber,1 Rue du Chateau 68630 Mittelwihr,68209_0096_00001,G,1 RUE DU CHATEAU,
335244216,00016,33524421600016,O,,NN,,,,true,1,,5,,RUE,DU BOUXHOF,68630,MITTELWIHR,,,68209,,,,,,,,,,,,,,,,,,,1990-06-08,F,,,,,84.13,NAP,N,7.319868,48.148833,0.95,housenumber,5 Rue du Bouxhof 68630 Mittelwihr,68209_0060_00005,G,5 RUE DU BOUXHOF,
340919018,00036,34091901800036,O,2004-12-23,NN,,,2017-09-22T08:38:25,true,8,22A,22,B,RTE,DU VIN,68630,MITTELWIHR,,,68209,,,,,,,,,,,,,,,,,,,2017-10-01,A,,,,,68.31Z,NAFRev2,N,7.320832,48.150192,0.83,housenumber,22b Route du Vin 68630 Mittelwihr,68209_0280_00022_b,G,22B ROUTE DU VIN,
342934239,00019,34293423900019,O,1987-09-01,01,2020,,2022-10-07T03:56:33,true,3,DOMAINE DU BOUXHOF,,,,DOMAINE DU BOUXHOF,68630,MITTELWIHR,,,68209,,,,,,,,,,,,,,,,,,,2008-01-01,A,,,,,01.21Z,NAFRev2,N,7.316134,48.149794,0.63,street,Rue du Bouxhof 68630 Mittelwihr,68209_0060,G,RUE DU BOUXHOF,
343118121,00015,34311812100015,O,,,,,2007-01-18T09:24:39,true,1,,16,,RUE,DES MERLES,68630,MITTELWIHR,,,68209,,,,,,,,,,,,,,,,,,,1989-11-01,F,,,,,01.1G,NAF1993,N,7.317889,48.150556,0.95,housenumber,16 Rue des Merles 68630 Mittelwihr,68209_0200_00016,G,16 RUE DES MERLES,
344494596,00010,34449459600010,O,1988-01-27,01,2020,,2022-08-29T09:29:07,true,4,,2,,RUE,DE L ECOLE,68630,MITTELWIHR,,,68209,,,,,,,,,,,,,,,,,,,2012-12-31,A,,,,,01.21Z,NAFRev2,O,7.321695,48.150255,0.95,housenumber,2 Rue de l’Ecole 68630 Mittelwihr,68209_0120_00002,G,2 RUE DE L ECOLE,
344560420,00012,34456042000012,O,1988-04-01,11,2020,3312ZA,2022-08-29T09:29:10,true,5,,3,,RTE,DU VIN,68630,MITTELWIHR,,,68209,,,,,,,,,,,,,,,,,,,2008-01-01,A,,,,,46.61Z,NAFRev2,O,7.320373,48.153814,0.81,housenumber,3 Route du Vin 68630 Mittelwihr,68209_0280_00003,G,3 ROUTE DU VIN,
344574546,00018,34457454600018,O,1988-03-01,01,2019,,2021-10-27T08:37:02,true,3,,12,,RUE,DU CHATEAU,68630,MITTELWIHR,,,68209,,,,,,,,,,,,,,,,,,,2008-01-01,A,,,,,01.21Z,NAFRev2,N,7.32279,48.150299,0.95,housenumber,12 Rue du Chateau 68630 Mittelwihr,68209_0096_00012,G,12 RUE DU CHATEAU,
344577150,00016,34457715000016,O,1988-04-19,NN,,,2012-05-05T02:58:50,false,5,,1,,PL,DES CIGOGNES,68630,MITTELWIHR,,,68209,,,,,,,,,,,,,,,,,,,2010-06-25,F,,,,,77.31Z,NAFRev2,N,7.32026,48.150992,0.83,housenumber,1 Place des Cigognes 68630 Mittelwihr,68209_0100_00001,G,1 PLACE DES CIGOGNES,
344577150,00024,34457715000024,O,2010-06-25,01,2020,,2022-08-29T09:29:10,true,2,,9,,,ROUTE DU VIN,68630,MITTELWIHR,,,68209,,,,,,,,,,,,,,,,,,,2011-12-31,A,,,,,77.31Z,NAFRev2,O,7.32094,48.152335,0.95,housenumber,9 Route du Vin 68630 Mittelwihr,68209_0280_00009,G,9 ROUTE DU VIN,
345004345,00012,34500434500012,O,1988-03-01,,,,,false,4,,7,A,RUE,DU BOUXHOF,68630,MITTELWIHR,,,68209,,,,,,,,,,,,,,,,,,,1993-12-25,F,,,,,60.2L,NAF1993,N,7.317413,48.149361,0.95,housenumber,7a Rue du Bouxhof 68630 Mittelwihr,68209_0060_00007_a,G,7A RUE DU BOUXHOF,
345344063,00010,34534406300010,O,1988-01-01,NN,,,2016-04-26T03:51:29,true,4,,4,,RUE,DES FLEURS,68630,MITTELWIHR,,,68209,,,,,,,,,,,,,,,,,,,2015-12-31,F,,,,,01.21Z,NAFRev2,N,7.319845,48.151349,0.95,housenumber,4 Rue des Fleurs 68630 Mittelwihr,68209_0160_00004,G,4 RUE DES FLEURS,
348650706,00016,34865070600016,O,1988-09-29,NN,,,2009-07-17T05:52:00,true,4,,1,,RUE,DU VIGNOBLE,68630,MITTELWIHR,,,68209,,,,,,,,,,,,,,,,,,,2008-12-31,F,,,,,01.21Z,NAFRev2,N,7.316262,48.151897,0.95,housenumber,1 Rue du Vignoble 68630 Mittelwihr,68209_0260_00001,G,1 RUE DU VIGNOBLE,
348650763,00017,34865076300017,O,1988-09-29,,,,2011-04-23T06:33:48,false,4,,,,CHE,DU HANDELBERG,68630,MITTELWIHR,,,68209,,,,,,,,,,,,,,,,,,,2000-01-01,F,,,,,01.1G,NAF1993,N,7.323198,48.152262,0.69,street,Chemin du Mandelberg 68630 Mittelwihr,68209_v3c3wv,G,CHEMIN DU MANDELBERG,
348652637,00011,34865263700011,O,,,,,,true,1,,1,,RTE,DE VIN,68630,MITTELWIHR,,,68209,,,,,,,,,,,,,,,,,,,1992-10-31,F,,,,,85.1E,NAF1993,N,7.319841,48.155264,0.6,housenumber,1 Route du Vin 68630 Mittelwihr,68209_0280_00001,G,1 ROUTE DU VIN,
348714692,00038,34871469200038,O,2017-03-15,,,,2017-07-30T04:28:34,true,2,,1,,RUE,DES ORCHIDEES,68630,MITTELWIHR,,,68209,,,,,,,,,,,,,,,,,,,2017-07-17,F,,,,,46.18Z,NAFRev2,N,7.320802,48.153665,0.94,housenumber,1 Rue des Orchidees 68630 Mittelwihr,68209_0208_00001,G,1 RUE DES ORCHIDEES,
349179598,00017,34917959800017,O,1989-01-01,11,2020,4322AZ,2022-08-29T09:31:04,true,4,,,,CHE,DU MANDELBERG,68630,MITTELWIHR,,,68209,,,,,,,,,,,,,,,,,,,2008-01-01,A,,,,,43.22A,NAFRev2,O,7.323198,48.152262,0.84,street,Chemin du Mandelberg 68630 Mittelwihr,68209_v3c3wv,G,CHEMIN DU MANDELBERG,
349211698,00015,34921169800015,O,1988-12-30,NN,,,2009-12-01T03:50:41,true,4,,9,,RTE,DU VIN,68630,MITTELWIHR,,,68209,,,,,,,,,,,,,,,,,,,2008-12-31,F,,,,,68.20B,NAFRev2,N,7.32094,48.152335,0.81,housenumber,9 Route du Vin 68630 Mittelwihr,68209_0280_00009,G,9 ROUTE DU VIN,