siren,nic,siret,statutDiffusionEtablissement,dateCreationEtablissement,trancheEffectifsEtablissement,anneeEffectifsEtablissement,activitePrincipaleRegistreMetiersEtablissement,dateDernierTraitementEtablissement,etablissementSiege,nombrePeriodesEtablissement,complementAdresseEtablissement,numeroVoieEtablissement,indiceRepetitionEtablissement,typeVoieEtablissement,libelleVoieEtablissement,codePostalEtablissement,libelleCommuneEtablissement,libelleCommuneEtrangerEtablissement,distributionSpecialeEtablissement,codeCommuneEtablissement,codeCedexEtablissement,libelleCedexEtablissement,codePaysEtrangerEtablissement,libellePaysEtrangerEtablissement,complementAdresse2Etablissement,numeroVoie2Etablissement,indiceRepetition2Etablissement,typeVoie2Etablissement,libelleVoie2Etablissement,codePostal2Etablissement,libelleCommune2Etablissement,libelleCommuneEtranger2Etablissement,distributionSpeciale2Etablissement,codeCommune2Etablissement,codeCedex2Etablissement,libelleCedex2Etablissement,codePaysEtranger2Etablissement,libellePaysEtranger2Etablissement,dateDebut,etatAdministratifEtablissement,enseigne1Etablissement,enseigne2Etablissement,enseigne3Etablissement,denominationUsuelleEtablissement,activitePrincipaleEtablissement,nomenclatureActivitePrincipaleEtablissement,caractereEmployeurEtablissement,longitude,latitude,geo_score,geo_type,geo_adresse,geo_id,geo_ligne,geo_l4,geo_l5
038863072,00013,03886307200013,O,1997-12-25,NN,,,2011-04-23T04:02:21,true,2,,29,,RUE,PASTEUR,77250,MORET-LOING-ET-ORVANNE,,,77316,,,,,,,,,,,,,,,,,,,2008-01-01,A,,,,,81.10Z,NAFRev2,O,2.800901,48.374048,0.97,housenumber,29 Rue Pasteur 77250 Moret-Loing-et-Orvanne,77491_0960_00029,G,29 RUE PASTEUR,
130012834,00284,13001283400284,O,2010-11-01,03,2019,,2021-10-27T08:03:54,false,2,CENTRE DES FINANCES PUBLIQUES,28,,RUE,GRANDE,77250,MORET-LOING-ET-ORVANNE,,,77316,,,,,,,,,,,,,,,,,,,2016-09-08,A,TRESORERIE DE MORET-LOING ET ORVANNE,,,,84.11Z,NAFRev2,N,2.852097,48.350918,0.94,housenumber,28 Rue Grande (Montarlot) 77250 Moret-Loing-et-Orvanne,77299_0040_00028,G,28 RUE GRANDE,MONTARLOT
177701315,00182,17770131500182,O,1999-03-10,03,2019,,2021-12-14T09:37:54,false,8,,73,,RUE,VICTOR HUGO,77250,MORET-LOING-ET-ORVANNE,,,77316,,,,,,,,,,,,,,,,,,,2013-09-23,F,UEAJ VENEUX LES SABLONS,,,,88.99A,NAFRev2,N,2.788183,48.386745,0.97,housenumber,73 Rue Victor Hugo 77250 Moret-Loing-et-Orvanne,77491_1360_00073,G,73 RUE VICTOR HUGO,
177701513,00141,17770151300141,O,1990-01-01,11,2020,,2022-08-29T09:04:00,false,3,,5,,AV,JEAN JAURES,77250,MORET-LOING-ET-ORVANNE,,,77316,,,,,,,,,,,,,,,,,,,2008-01-01,A,COMMISSARIAT DE MORET-SUR-LOING,,,,84.24Z,NAFRev2,N,2.81131,48.374705,0.86,housenumber,5 Avenue Jean Jaurès 77250 Moret-Loing-et-Orvanne,77316_0330_00005,G,5 AVENUE JEAN JAURES,
177702115,00243,17770211500243,O,1983-04-01,,,,2013-04-29T22:36:45,false,4,,28,,RUE,GRANDE,77250,MORET-LOING-ET-ORVANNE,,,77316,,,,,,,,,,,,,,,,,,,2010-11-01,F,TRESORERIE DE MORET-SUR-LOING,,,,84.11Z,NAFRev2,N,2.852097,48.350918,0.94,housenumber,28 Rue Grande (Montarlot) 77250 Moret-Loing-et-Orvanne,77299_0040_00028,G,28 RUE GRANDE,MONTARLOT
177706611,00098,17770661100098,O,1985-01-01,NN,,,2017-01-03T13:41:41,false,4,,9,,RUE,DU BOIS PRIEUR,77250,MORET-LOING-ET-ORVANNE,,,77316,,,,,,,,,,,,,,,,,,,2008-12-31,F,ARRONDIS TERRIT SUD SUB MORET,,,,84.13Z,NAFRev2,N,2.782566,48.378999,0.96,housenumber,9 Rue du Bois Prieur 77250 Moret-Loing-et-Orvanne,77491_0060_00009,G,9 RUE DU BOIS PRIEUR,
197700388,00014,19770038800014,O,1983-03-01,21,2020,,2022-08-29T09:04:42,true,3,,,,RUE,DU GYMNASE,77250,MORET-LOING-ET-ORVANNE,,,77316,,,,,,,,,,,,,,,,,,,2008-01-01,A,,,,,85.31Z,NAFRev2,N,2.814374,48.368395,0.96,street,Rue du Gymnase 77250 Moret-Loing-et-Orvanne,77316_0315,G,RUE DU GYMNASE,
200049005,00016,20004900500016,O,2015-01-01,NN,,,2017-05-04T01:18:28,true,2,MORET-SUR-LOING,26,,RUE,GRANDE,77250,MORET-LOING-ET-ORVANNE,,,77316,,,,,,,,,,,,,,,,,,,2016-01-01,F,MAIRIE,,,,84.11Z,NAFRev2,O,2.851785,48.350802,0.94,housenumber,26 Rue Grande (Montarlot) 77250 Moret-Loing-et-Orvanne,77299_0040_00026,G,26 RUE GRANDE,MONTARLOT
200049005,00024,20004900500024,O,2015-01-01,,,,2016-02-13T12:47:05,false,2,MORET-SUR-LOING,26,,RUE,GRANDE,77250,MORET-LOING-ET-ORVANNE,,,77316,,,,,,,,,,,,,,,,,,,2016-01-01,F,COMMUNE DELEGUEE DE MORET-SUR-LOING,,,,84.11Z,NAFRev2,N,2.851785,48.350802,0.94,housenumber,26 Rue Grande (Montarlot) 77250 Moret-Loing-et-Orvanne,77299_0040_00026,G,26 RUE GRANDE,MONTARLOT
200049005,00032,20004900500032,O,2015-01-01,,,,2016-02-13T12:47:05,false,2,ECUELLES,45,,RUE,GEORGES VILLETTE,77250,MORET-LOING-ET-ORVANNE,,,77316,,,,,,,,,,,,,,,,,,,2016-01-01,F,COMMUNE DELEGUEE DE ECUELLES,,,,84.11Z,NAFRev2,N,2.821175,48.354258,0.97,housenumber,45 Rue Georges Villette 77250 Moret-Loing-et-Orvanne,77166_0260_00045,G,45 RUE GEORGES VILLETTE,
200049005,00040,20004900500040,O,2015-01-01,NN,,,2017-05-04T01:18:28,false,2,MORET-SUR-LOING,27,,AV,GEORGES CLEMENCEAU,77250,MORET-LOING-ET-ORVANNE,,,77316,,,,,,,,,,,,,,,,,,,2016-01-01,F,ECOLE PRIMAIRE PUBLIQUE LES COLUMIERES,,,,85.20Z,NAFRev2,O,2.814565,48.369384,0.89,housenumber,27 Avenue Georges Clémenceau 77250 Moret-Loing-et-Orvanne,77316_0258_00027,G,27 AVENUE GEORGES CLEMENCEAU,
200049005,00057,20004900500057,O,2015-01-01,NN,,,2017-05-04T01:18:28,false,2,MORET-SUR-LOING,22,,RUE,DU DONJON,77250,MORET-LOING-ET-ORVANNE,,,77316,,,,,,,,,,,,,,,,,,,2016-01-01,F,ECOLE MATERNELLE PUBLIQUE,,,,85.10Z,NAFRev2,O,2.818831,48.370523,0.96,housenumber,22 Rue du Donjon 77250 Moret-Loing-et-Orvanne,77316_0165_00022,G,22 RUE DU DONJON,
200049005,00065,20004900500065,O,2015-01-01,NN,,,2017-05-04T01:18:28,false,2,ECUELLES,,,RUE,RAVANNE,77250,MORET-LOING-ET-ORVANNE,,,77316,,,,,,,,,,,,,,,,,,,2016-01-01,F,ECOLE ELEMENTAIRE PUBLIQUE RAVANNE,,,,85.20Z,NAFRev2,O,2.828947,48.367894,0.95,street,Rue de Ravanne 77250 Moret-Loing-et-Orvanne,77166_0422,G,RUE DE RAVANNE,
200049005,00073,20004900500073,O,2015-01-01,NN,,,2017-05-04T01:18:28,false,2,ECUELLES,20,,RUE,DE L'EGLISE,77250,MORET-LOING-ET-ORVANNE,,,77316,,,,,,,,,,,,,,,,,,,2016-01-01,F,ECOLE MATERNELLE PUBLIQUE LES LILAS,,,,85.10Z,NAFRev2,O,2.819316,48.352037,0.94,housenumber,20 Rue de l’Eglise (Écuelles) 77250 Moret-Loing-et-Orvanne,77166_0140_00020,G,20 RUE DE L EGLISE,ECUELLES
200049013,00010,20004901300010,O,2015-01-01,NN,,,2017-05-04T01:18:28,true,2,MAIRIE COM DELEGUEE DE MORET-SUR-LOING,26,,RUE,GRANDE,77250,MORET-LOING-ET-ORVANNE,,,77316,,,,,,,,,,,,,,,,,,,2016-01-01,F,,,,,88.99B,NAFRev2,O,2.851785,48.350802,0.94,housenumber,26 Rue Grande (Montarlot) 77250 Moret-Loing-et-Orvanne,77299_0040_00026,G,26 RUE GRANDE,MONTARLOT
200050250,00014,20005025000014,O,2015-01-01,,,,2016-02-13T12:47:09,true,2,MAIRIE COM DELEGUEE DE MORET-SUR-LOING,26,,RUE,GRANDE,77250,MORET-LOING-ET-ORVANNE,,,77316,,,,,,,,,,,,,,,,,,,2016-01-01,F,,,,,88.99B,NAFRev2,N,2.851785,48.350802,0.94,housenumber,26 Rue Grande (Montarlot) 77250 Moret-Loing-et-Orvanne,77299_0040_00026,G,26 RUE GRANDE,MONTARLOT
200055069,00013,20005506900013,O,2016-01-01,NN,,,2019-06-24T13:08:46,true,2,MORET SUR LOING,26,,RUE,GRANDE,77250,MORET-LOING-ET-ORVANNE,,,77316,,,,,,,,,,,,,,,,,,,2017-01-01,F,MAIRIE,,,,84.11Z,NAFRev2,O,2.851785,48.350802,0.94,housenumber,26 Rue Grande (Montarlot) 77250 Moret-Loing-et-Orvanne,77299_0040_00026,G,26 RUE GRANDE,MONTARLOT
200055069,00021,20005506900021,O,2016-01-01,,,,2017-02-12T14:18:49,false,2,,,,,,77250,MORET-LOING-ET-ORVANNE,,,77316,,,,,,,,,,,,,,,,,,,2017-01-01,F,COMMUNE DELEGUEE DE EPISY,,,,84.11Z,NAFRev2,N,,,0,,,,,,
200055069,00039,20005506900039,O,2016-01-01,,,,2017-02-12T14:18:50,false,2,,16,,RUE,DES JONCS,77250,MORET-LOING-ET-ORVANNE,,,77316,,,,,,,,,,,,,,,,,,,2017-01-01,F,COMMUNE DELEGUEE DE MONTARLOT,,,,84.11Z,NAFRev2,N,2.851766,48.349001,0.96,housenumber,16 Rue des Joncs 77250 Moret-Loing-et-Orvanne,77299_0060_00016,G,16 RUE DES JONCS,
200055069,00047,20005506900047,O,2016-01-01,,,,2017-02-12T14:18:50,false,2,,45,,RUE,GEORGES VILLETTE,77250,MORET-LOING-ET-ORVANNE,,,77316,,,,,,,,,,,,,,,,,,,2017-01-01,F,COMMUNE DELEGUEE DE ECUELLES,,,,84.11Z,NAFRev2,N,2.821175,48.354258,0.97,housenumber,45 Rue Georges Villette 77250 Moret-Loing-et-Orvanne,77166_0260_00045,G,45 RUE GEORGES VILLETTE,
200055069,00054,20005506900054,O,2016-01-01,,,,2017-02-12T14:18:50,false,2,,26,,RUE,GRANDE,77250,MORET-LOING-ET-ORVANNE,,,77316,,,,,,,,,,,,,,,,,,,2017-01-01,F,COMMUNE DELEGUEE DE MORET-SUR-LOING,,,,84.11Z,NAFRev2,N,2.851785,48.350802,0.94,housenumber,26 Rue Grande (Montarlot) 77250 Moret-Loing-et-Orvanne,77299_0040_00026,G,26 RUE GRANDE,MONTARLOT
200055069,00062,20005506900062,O,2016-01-01,NN,,,2019-06-24T13:08:46,false,2,,26,,RUE,GRANDE,77250,MORET-LOING-ET-ORVANNE,,,77316,,,,,,,,,,,,,,,,,,,2017-01-01,F,ECOLE PRIMAIRE PUBLIQUE,,,,85.20Z,NAFRev2,O,2.851785,48.350802,0.94,housenumber,26 Rue Grande (Montarlot) 77250 Moret-Loing-et-Orvanne,77299_0040_00026,G,26 RUE GRANDE,MONTARLOT
200055069,00070,20005506900070,O,2016-01-01,NN,,,2018-09-29T12:03:48,false,2,,4,,RUE,DES VIGNES,77250,MORET-LOING-ET-ORVANNE,,,77316,,,,,,,,,,,,,,,,,,,2017-01-01,F,ECOLE PRIMAIRE PUBLIQUE,,,,85.20Z,NAFRev2,O,2.848821,48.350292,0.94,housenumber,4 Rue des Vignes (Montarlot) 77250 Moret-Loing-et-Orvanne,77299_0160_00004,G,4 RUE DES VIGNES,MONTARLOT
200055069,00088,20005506900088,O,2016-01-01,NN,,,2019-06-24T13:08:46,false,2,,27,,AV,GEORGES CLEMENCEAU,77250,MORET-LOING-ET-ORVANNE,,,77316,,,,,,,,,,,,,,,,,,,2017-01-01,F,ECOLE PRIMAIRE PUBLIQUE LES COLUMIERES,,,,85.20Z,NAFRev2,O,2.814565,48.369384,0.89,housenumber,27 Avenue Georges Clémenceau 77250 Moret-Loing-et-Orvanne,77316_0258_00027,G,27 AVENUE GEORGES CLEMENCEAU,
200055069,00096,20005506900096,O,2016-01-01,NN,,,2019-06-24T13:08:46,false,2,,22,,RUE,DU DONJON,77250,MORET-LOING-ET-ORVANNE,,,77316,,,,,,,,,,,,,,,,,,,2017-01-01,F,ECOLE MATERNELLE PUBLIQUE,,,,85.10Z,NAFRev2,O,2.818831,48.370523,0.96,housenumber,22 Rue du Donjon 77250 Moret-Loing-et-Orvanne,77316_0165_00022,G,22 RUE DU DONJON,
200055069,00104,20005506900104,O,2016-01-01,NN,,,2019-06-24T13:08:46,false,2,,,,RUE,RAVANNE,77250,MORET-LOING-ET-ORVANNE,,,77316,,,,,,,,,,,,,,,,,,,2017-01-01,F,ECOLE PRIMAIRE PUBLIQUE RAVANNE,,,,85.20Z,NAFRev2,O,2.828947,48.367894,0.95,street,Rue de Ravanne 77250 Moret-Loing-et-Orvanne,77166_0422,G,RUE DE RAVANNE,
200055069,00112,20005506900112,O,2016-01-01,NN,,,2019-06-24T13:08:46,false,2,,20,,RUE,DE L 'EGLISE,77250,MORET-LOING-ET-ORVANNE,,,77316,,,,,,,,,,,,,,,,,,,2017-01-01,F,ECOLE MATERNELLE PUBLIQUE LES LILAS,,,,85.10Z,NAFRev2,O,2.819316,48.352037,0.94,housenumber,20 Rue de l’Eglise (Écuelles) 77250 Moret-Loing-et-Orvanne,77166_0140_00020,G,20 RUE DE L EGLISE,ECUELLES
200055069,00120,20005506900120,O,2017-01-01,,,,2016-12-27T11:27:09,false,1,,,,RUE,DES JONCS,77250,MORET-LOING-ET-ORVANNE,,,77316,,,,,,,,,,,,,,,,,,,2017-01-01,F,COMMUNE DELEGUEE DE MONTARLOT,,,,84.11Z,NAFRev2,N,2.853175,48.34941,0.96,street,Rue des Joncs 77250 Moret-Loing-et-Orvanne,77299_0060,G,RUE DES JONCS,
200055093,00013,20005509300013,O,2016-01-01,,,,2017-02-12T14:18:50,true,2,MAIRIE - MORET SUR LOING,26,,RUE,GRANDE,77250,MORET-LOING-ET-ORVANNE,,,77316,,,,,,,,,,,,,,,,,,,2017-01-01,F,,,,,88.99B,NAFRev2,O,2.851785,48.350802,0.94,housenumber,26 Rue Grande (Montarlot) 77250 Moret-Loing-et-Orvanne,77299_0040_00026,G,26 RUE GRANDE,MONTARLOT
200073039,00014,20007303900014,O,2017-01-01,22,2020,,2022-08-29T09:05:26,true,1,,26,,RUE,GRANDE,77250,MORET-LOING-ET-ORVANNE,,,77316,,,,,,,,,,,,,,,,,,,2017-01-01,A,MAIRIE,,,,84.11Z,NAFRev2,O,2.851785,48.350802,0.94,housenumber,26 Rue Grande (Montarlot) 77250 Moret-Loing-et-Orvanne,77299_0040_00026,G,26 RUE GRANDE,MONTARLOT
200073039,00022,20007303900022,O,2017-01-01,,,,2017-01-03T14:13:55,false,1,,,,RUE,DU 11 NOVEMBRE 1918,77250,MORET-LOING-ET-ORVANNE,,,77316,,,,,,,,,,,,,,,,,,,2017-01-01,A,COMMUNE DELEGUEE DE VENEUX-LES-SABONS,,,,84.11Z,NAFRev2,N,2.795078,48.378208,0.83,street,Place du 11 Novembre 1918 77250 Moret-Loing-et-Orvanne,77316_0514ww,G,PLACE DU 11 NOVEMBRE 1918,
200073039,00030,20007303900030,O,2017-01-01,,,,2016-12-27T11:14:43,false,1,,45,,RUE,GEORGES VILLETTE,77250,MORET-LOING-ET-ORVANNE,,,77316,,,,,,,,,,,,,,,,,,,2017-01-01,A,COMMUNE DELEGUEE DE ECUELLES,,,,84.11Z,NAFRev2,N,2.821175,48.354258,0.97,housenumber,45 Rue Georges Villette 77250 Moret-Loing-et-Orvanne,77166_0260_00045,G,45 RUE GEORGES VILLETTE,
200073039,00048,20007303900048,O,2017-01-01,,,,2016-12-27T11:18:38,false,1,,,,,LE BOURG,77250,MORET-LOING-ET-ORVANNE,,,77316,,,,,,,,,,,,,,,,,,,2017-01-01,A,COMMUNE DELEGUEE DE EPISY,,,,84.11Z,NAFRev2,N,2.7898,48.335349,0.95,street,Le Bourg 77250 Moret-Loing-et-Orvanne,77316_1x7w81,G,LE BOURG,
200073039,00055,20007303900055,O,2017-01-01,,,,2016-12-27T11:31:03,false,1,,16,,RUE,DES AJONCS,77250,MORET-LOING-ET-ORVANNE,,,77316,,,,,,,,,,,,,,,,,,,2017-01-01,A,COMMUNE DELEGUEE DE MONTARLOT,,,,84.11Z,NAFRev2,N,2.828225,48.362555,0.61,housenumber,16 Rue des Faïenciers 77250 Moret-Loing-et-Orvanne,77166_0230_00016,G,16 RUE DES FAIENCIERS,
200073039,00063,20007303900063,O,2017-01-01,,,,2016-12-27T11:34:20,false,1,,26,,RUE,GRANDE,77250,MORET-LOING-ET-ORVANNE,,,77316,,,,,,,,,,,,,,,,,,,2017-01-01,A,COMMUNE DELEGUEE DE MORET-SUR-LOING,,,,84.11Z,NAFRev2,N,2.851785,48.350802,0.94,housenumber,26 Rue Grande (Montarlot) 77250 Moret-Loing-et-Orvanne,77299_0040_00026,G,26 RUE GRANDE,MONTARLOT
200073039,00071,20007303900071,O,2017-01-01,02,2020,,2022-08-29T09:05:26,false,1,,26,,RUE,GRANDE,77250,MORET-LOING-ET-ORVANNE,,,77316,,,,,,,,,,,,,,,,,,,2017-01-01,A,ECOLE PRIMAIRE PUBLIQUE,,,,85.20Z,NAFRev2,N,2.851785,48.350802,0.94,housenumber,26 Rue Grande (Montarlot) 77250 Moret-Loing-et-Orvanne,77299_0040_00026,G,26 RUE GRANDE,MONTARLOT
200073039,00089,20007303900089,O,2017-01-01,01,2020,,2022-08-29T09:05:26,false,1,,4,,RUE,DES VIGNES,77250,MORET-LOING-ET-ORVANNE,,,77316,,,,,,,,,,,,,,,,,,,2017-01-01,A,ECOLE PRIMAIRE PUBLIQUE,,,,85.20Z,NAFRev2,N,2.848821,48.350292,0.94,housenumber,4 Rue des Vignes (Montarlot) 77250 Moret-Loing-et-Orvanne,77299_0160_00004,G,4 RUE DES VIGNES,MONTARLOT
200073039,00097,20007303900097,O,2017-01-01,03,2020,,2022-08-29T09:05:26,false,1,,27,,RUE,GEORGES CLEMENCEAU,77250,MORET-LOING-ET-ORVANNE,,,77316,,,,,,,,,,,,,,,,,,,2017-01-01,A,ECOLE PRIMAIRE PUBLIQUE LES COLUMIERES,,,,85.20Z,NAFRev2,N,2.788218,48.383415,0.96,housenumber,27 Rue Georges Clemenceau 77250 Moret-Loing-et-Orvanne,77491_0535_00027,G,27 RUE GEORGES CLEMENCEAU,
200073039,00105,20007303900105,O,2017-01-01,02,2020,,2022-08-29T09:05:26,false,1,,22,,RUE,DU DONJON,77250,MORET-LOING-ET-ORVANNE,,,77316,,,,,,,,,,,,,,,,,,,2017-01-01,A,ECOLE MATERNELLE LE DONJON,,,,85.10Z,NAFRev2,N,2.818831,48.370523,0.96,housenumber,22 Rue du Donjon 77250 Moret-Loing-et-Orvanne,77316_0165_00022,G,22 RUE DU DONJON,
200073039,00113,20007303900113,O,2017-01-01,11,2020,,2022-08-29T09:05:26,false,1,,,,RUE,RAVANNE,77250,MORET-LOING-ET-ORVANNE,,,77316,,,,,,,,,,,,,,,,,,,2017-01-01,A,ECOLE ELEMENTAIRE PUBLIQUE RAVANNE,,,,85.20Z,NAFRev2,N,2.828947,48.367894,0.95,street,Rue de Ravanne 77250 Moret-Loing-et-Orvanne,77166_0422,G,RUE DE RAVANNE,
200073039,00121,20007303900121,O,2017-01-01,03,2020,,2022-08-29T09:05:26,false,1,,20,,RUE,DE L'EGLISE,77250,MORET-LOING-ET-ORVANNE,,,77316,,,,,,,,,,,,,,,,,,,2017-01-01,A,ECOLE MATERNELLE PUBLIQUE LES LILAS,,,,85.10Z,NAFRev2,N,2.819316,48.352037,0.94,housenumber,20 Rue de l’Eglise (Écuelles) 77250 Moret-Loing-et-Orvanne,77166_0140_00020,G,20 RUE DE L EGLISE,ECUELLES
200073039,00139,20007303900139,O,2017-01-01,03,2020,,2022-08-29T09:05:26,false,1,,5,,RUE,CLAUDE BERNARD,77250,MORET-LOING-ET-ORVANNE,,,77316,,,,,,,,,,,,,,,,,,,2017-01-01,A,ECOLE MATERNELLE PUBLIQUE ALEXANDRE CHEVRIER,,,,85.10Z,NAFRev2,N,2.792156,48.379473,0.96,housenumber,5 Rue Claude Bernard 77250 Moret-Loing-et-Orvanne,77491_0220_00005,G,5 RUE CLAUDE BERNARD,
200073039,00147,20007303900147,O,2017-01-01,11,2020,,2022-08-29T09:05:26,false,1,,66,,RTE,DE BOURGOGNE,77250,MORET-LOING-ET-ORVANNE,,,77316,,,,,,,,,,,,,,,,,,,2017-01-01,A,ECOLE ELEMENTAIRE PUBLIQUE ALEXANDRE CHEVRIER,,,,85.20Z,NAFRev2,N,2.790689,48.379297,0.88,housenumber,66 Route de Bourgogne 77250 Moret-Loing-et-Orvanne,77491_0120_00066,G,66 ROUTE DE BOURGOGNE,
200073054,00013,20007305400013,O,2017-01-01,02,2020,,2022-08-29T09:05:26,true,1,MAIRIE,26,,RUE,GRANDE,77250,MORET-LOING-ET-ORVANNE,,,77316,,,,,,,,,,,,,,,,,,,2017-01-01,A,,,,,88.99B,NAFRev2,O,2.851785,48.350802,0.94,housenumber,26 Rue Grande (Montarlot) 77250 Moret-Loing-et-Orvanne,77299_0040_00026,G,26 RUE GRANDE,MONTARLOT
200073054,00021,20007305400021,O,2017-01-01,,,,2016-12-27T14:04:55,false,1,,26,,RUE,GRANDE,77250,MORET-LOING-ET-ORVANNE,,,77316,,,,,,,,,,,,,,,,,,,2017-01-01,F,ECOLE PRIMAIRE PUBLIQUE,,,,85.20Z,NAFRev2,N,2.851785,48.350802,0.94,housenumber,26 Rue Grande (Montarlot) 77250 Moret-Loing-et-Orvanne,77299_0040_00026,G,26 RUE GRANDE,MONTARLOT
200074474,00012,20007447400012,O,2017-01-01,,,,2017-02-02T15:04:53,true,1,MAIRIE,26,,RUE,GRANDE,77250,MORET-LOING-ET-ORVANNE,,,77316,,,,,,,,,,,,,,,,,,,2017-01-01,A,,,,,88.99B,NAFRev2,N,2.851785,48.350802,0.94,housenumber,26 Rue Grande (Montarlot) 77250 Moret-Loing-et-Orvanne,77299_0040_00026,G,26 RUE GRANDE,MONTARLOT
217701663,00015,21770166300015,O,1983-03-01,NN,,,2016-04-26T01:26:39,true,5,,,,,,77250,MORET-LOING-ET-ORVANNE,,,77316,,,,,,,,,,,,,,,,,,,2015-01-01,F,MAIRIE,,,,84.11Z,NAFRev2,O,,,0,,,,,,
217701663,00023,21770166300023,O,1983-12-21,NN,,,2016-04-26T01:26:39,false,4,,,,RUE,DE RAVANNE,77250,MORET-LOING-ET-ORVANNE,,,77316,,,,,,,,,,,,,,,,,,,2015-01-01,F,ECOL PRIM GROUPE RAVANNE,,,,85.20Z,NAFRev2,N,2.828947,48.367894,0.96,street,Rue de Ravanne 77250 Moret-Loing-et-Orvanne,77166_0422,G,RUE DE RAVANNE,
217701663,00031,21770166300031,O,1983-12-21,NN,,,2015-05-14T03:40:33,false,4,,45,,RUE,GEORGES VILLETTE,77250,MORET-LOING-ET-ORVANNE,,,77316,,,,,,,,,,,,,,,,,,,2015-01-01,F,ECOLE PRIMAIRE PUBLIQUE,,,,85.20Z,NAFRev2,N,2.821175,48.354258,0.97,housenumber,45 Rue Georges Villette 77250 Moret-Loing-et-Orvanne,77166_0260_00045,G,45 RUE GEORGES VILLETTE,
217701663,00049,21770166300049,O,1985-02-28,NN,,,2016-04-26T01:26:39,false,4,,20,,RUE,DE L'EGLISE,77250,MORET-LOING-ET-ORVANNE,,,77316,,,,,,,,,,,,,,,,,,,2015-01-01,F,ECOLE MATERNELLE PUBLIQUE LES LILAS,,,,85.10Z,NAFRev2,N,2.819316,48.352037,0.94,housenumber,20 Rue de l’Eglise (Écuelles) 77250 Moret-Loing-et-Orvanne,77166_0140_00020,G,20 RUE DE L EGLISE,ECUELLES
217701663,00056,21770166300056,O,1996-12-25,NN,,,2015-02-27T09:39:42,false,3,,45,,RUE,GEORGES VILLETTE,77250,MORET-LOING-ET-ORVANNE,,,77316,,,,,,,,,,,,,,,,,,,2015-01-01,F,SCE EAU D'ECUELLES,,,,36.00Z,NAFRev2,N,2.821175,48.354258,0.97,housenumber,45 Rue Georges Villette 77250 Moret-Loing-et-Orvanne,77166_0260_00045,G,45 RUE GEORGES VILLETTE,
217701705,00014,21770170500014,O,1983-03-01,NN,,,2017-05-04T01:29:46,true,5,,,,,,77250,MORET-LOING-ET-ORVANNE,,,77316,,,,,,,,,,,,,,,,,,,2016-01-01,F,MAIRIE,,,,84.11Z,NAFRev2,O,,,0,,,,,,
217701705,00022,21770170500022,O,1983-12-21,NN,,,2017-05-04T01:29:46,false,4,,26,,RUE,GRANDE,77250,MORET-LOING-ET-ORVANNE,,,77316,,,,,,,,,,,,,,,,,,,2016-01-01,F,ECOLE PRIMAIRE PUBLIQUE,,,,85.20Z,NAFRev2,N,2.851785,48.350802,0.94,housenumber,26 Rue Grande (Montarlot) 77250 Moret-Loing-et-Orvanne,77299_0040_00026,G,26 RUE GRANDE,MONTARLOT
217701705,00030,21770170500030,O,1997-01-01,NN,,,2016-01-18T20:43:29,false,4,,26,,,GRANDE RUE,77250,MORET-LOING-ET-ORVANNE,,,77316,,,,,,,,,,,,,,,,,,,2014-01-01,F,SERVICE EAU ET ASSAINISSEMENT,,,,36.00Z,NAFRev2,N,2.784706,48.334259,0.96,housenumber,26 Grande Rue 77250 Moret-Loing-et-Orvanne,77170_0220_00026,G,26 GRANDE RUE,
217701705,00048,21770170500048,O,1997-01-01,NN,,,2016-01-18T20:43:29,false,4,,26,,,GRANDE RUE,77250,MORET-LOING-ET-ORVANNE,,,77316,,,,,,,,,,,,,,,,,,,2000-01-01,F,SERVICE ASSAINISSEMENT,,,,90.0A,NAF1993,N,2.784706,48.334259,0.96,housenumber,26 Grande Rue 77250 Moret-Loing-et-Orvanne,77170_0220_00026,G,26 GRANDE RUE,
217702992,00017,21770299200017,O,1983-03-01,NN,,,2017-05-04T01:29:48,true,5,,,,,,77250,MORET-LOING-ET-ORVANNE,,,77316,,,,,,,,,,,,,,,,,,,2016-01-01,F,MAIRIE,,,,84.11Z,NAFRev2,O,,,0,,,,,,
217702992,00025,21770299200025,O,1983-12-21,NN,,,2017-05-04T01:29:48,false,4,,4,,RUE,DES VIGNES,77250,MORET-LOING-ET-ORVANNE,,,77316,,,,,,,,,,,,,,,,,,,2016-01-01,F,ECOLE ELEMENTAIRE PUBLIQUE,,,,85.20Z,NAFRev2,N,2.848821,48.350292,0.94,housenumber,4 Rue des Vignes (Montarlot) 77250 Moret-Loing-et-Orvanne,77299_0160_00004,G,4 RUE DES VIGNES,MONTARLOT
217702992,00033,21770299200033,O,2000-01-01,NN,,,2016-01-18T20:49:47,false,4,,16,,RUE,DES JONCS,77250,MORET-LOING-ET-ORVANNE,,,77316,,,,,,,,,,,,,,,,,,,2013-12-31,F,SERVICE EAU,,,,36.00Z,NAFRev2,N,2.851766,48.349001,0.96,housenumber,16 Rue des Joncs 77250 Moret-Loing-et-Orvanne,77299_0060_00016,G,16 RUE DES JONCS,
217703164,00012,21770316400012,O,1983-03-01,NN,,,2016-04-26T01:26:41,true,5,,,,,,77250,MORET-LOING-ET-ORVANNE,,,77316,,,,,,,,,,,,,,,,,,,2015-01-01,F,MAIRIE,,,,84.11Z,NAFRev2,O,,,0,,,,,,
217703164,00020,21770316400020,O,1983-04-01,NN,,,2015-02-27T09:37:51,false,4,HOTEL DE VILLE,,,,,77250,MORET-LOING-ET-ORVANNE,,,77316,,,,,,,,,,,,,,,,,,,2015-01-01,F,S E P A M,,,,84.11Z,NAFRev2,N,2.817231,48.372254,0.58,street,Rue de l’’Hôtel Dieu 77250 Moret-Loing-et-Orvanne,77316_0320,D,RUE DE L HOTEL DIEU,
217703164,00038,21770316400038,O,1983-12-21,NN,,,2016-04-26T01:26:41,false,4,,27,,AV,GEORGES CLEMENCEAU,77250,MORET-LOING-ET-ORVANNE,,,77316,,,,,,,,,,,,,,,,,,,2015-01-01,F,ECOLE ELEMENTAIRE PUB. LES COLUMIERES,,,,85.20Z,NAFRev2,N,2.814565,48.369384,0.89,housenumber,27 Avenue Georges Clémenceau 77250 Moret-Loing-et-Orvanne,77316_0258_00027,G,27 AVENUE GEORGES CLEMENCEAU,
217703164,00046,21770316400046,O,1983-12-21,NN,,,2016-04-26T01:26:41,false,4,,22,,RUE,DU DONJON,77250,MORET-LOING-ET-ORVANNE,,,77316,,,,,,,,,,,,,,,,,,,2015-01-01,F,ECOLE MATERNELLE PUBLIQUE,,,,85.10Z,NAFRev2,N,2.818831,48.370523,0.96,housenumber,22 Rue du Donjon 77250 Moret-Loing-et-Orvanne,77316_0165_00022,G,22 RUE DU DONJON,
217704196,00054,21770419600054,O,1996-12-25,NN,,,2017-01-03T12:22:56,false,3,,2,,RUE,GRANDE,77250,MORET-LOING-ET-ORVANNE,,,77316,,,,,,,,,,,,,,,,,,,2015-12-25,F,SCE EAU DE SAINT MAMMES,,,,36.00Z,NAFRev2,N,2.847974,48.347925,0.94,housenumber,2 Rue Grande (Montarlot) 77250 Moret-Loing-et-Orvanne,77299_0040_00002,G,2 RUE GRANDE,MONTARLOT
217704915,00016,21770491500016,O,1983-03-01,NN,,,2019-06-24T13:12:19,true,5,,,,,,77250,MORET-LOING-ET-ORVANNE,,,77316,,,,,,,,,,,,,,,,,,,2017-01-01,F,MAIRIE,,,,84.11Z,NAFRev2,O,,,0,,,,,,
217704915,00024,21770491500024,O,1983-12-21,NN,,,2019-06-24T13:12:19,false,4,,5,,RUE,C  BERNARD,77250,MORET-LOING-ET-ORVANNE,,,77316,,,,,,,,RTE,DE BOURGOGNE,77250,MORET-LOING-ET-ORVANNE,,,77316,,,,,2017-01-01,F,ECOLE MATERNELLE PUBLIQUE A. CHEVRIER,,,,85.10Z,NAFRev2,N,2.792156,48.379473,0.84,housenumber,5 Rue Claude Bernard 77250 Moret-Loing-et-Orvanne,77491_0220_00005,G,5 RUE CLAUDE BERNARD,
217704915,00040,21770491500040,O,1983-12-21,NN,,,2019-06-24T13:12:19,false,5,,66,,RTE,DE BOURGOGNE,77250,MORET-LOING-ET-ORVANNE,,,77316,,,,,,,,,,,,,,,,,,,2008-01-01,F,ECOLE ELEMENTAIRE PUBLIQUE A. CHEVRIER,,,,85.20Z,NAFRev2,N,2.790689,48.379297,0.88,housenumber,66 Route de Bourgogne 77250 Moret-Loing-et-Orvanne,77491_0120_00066,G,66 ROUTE DE BOURGOGNE,
217704915,00057,21770491500057,O,1996-12-25,NN,,,2017-02-12T14:23:28,false,3,,,,PL,DU 11 NOVEMBRE,77250,MORET-LOING-ET-ORVANNE,,,77316,,,,,,,,,,,,,,,,,,,2017-01-01,F,SE ASSAINISSEMENT DE VENEUX LES SABLONS,,,,37.00Z,NAFRev2,N,2.795078,48.378208,0.84,street,Place du 11 Novembre 1918 77250 Moret-Loing-et-Orvanne,77316_0514ww,G,PLACE DU 11 NOVEMBRE 1918,
217704915,00065,21770491500065,O,1996-12-25,NN,,,2017-02-12T14:23:28,false,3,,,,PL,DU 11 NOVEMBRE,77250,MORET-LOING-ET-ORVANNE,,,77316,,,,,,,,,,,,,,,,,,,2017-01-01,F,SCE EAU DE VENEUX,,,,36.00Z,NAFRev2,N,2.795078,48.378208,0.84,street,Place du 11 Novembre 1918 77250 Moret-Loing-et-Orvanne,77316_0514ww,G,PLACE DU 11 NOVEMBRE 1918,