siren,nic,siret,statutDiffusionEtablissement,dateCreationEtablissement,trancheEffectifsEtablissement,anneeEffectifsEtablissement,activitePrincipaleRegistreMetiersEtablissement,dateDernierTraitementEtablissement,etablissementSiege,nombrePeriodesEtablissement,complementAdresseEtablissement,numeroVoieEtablissement,indiceRepetitionEtablissement,typeVoieEtablissement,libelleVoieEtablissement,codePostalEtablissement,libelleCommuneEtablissement,libelleCommuneEtrangerEtablissement,distributionSpecialeEtablissement,codeCommuneEtablissement,codeCedexEtablissement,libelleCedexEtablissement,codePaysEtrangerEtablissement,libellePaysEtrangerEtablissement,complementAdresse2Etablissement,numeroVoie2Etablissement,indiceRepetition2Etablissement,typeVoie2Etablissement,libelleVoie2Etablissement,codePostal2Etablissement,libelleCommune2Etablissement,libelleCommuneEtranger2Etablissement,distributionSpeciale2Etablissement,codeCommune2Etablissement,codeCedex2Etablissement,libelleCedex2Etablissement,codePaysEtranger2Etablissement,libellePaysEtranger2Etablissement,dateDebut,etatAdministratifEtablissement,enseigne1Etablissement,enseigne2Etablissement,enseigne3Etablissement,denominationUsuelleEtablissement,activitePrincipaleEtablissement,nomenclatureActivitePrincipaleEtablissement,caractereEmployeurEtablissement,longitude,latitude,geo_score,geo_type,geo_adresse,geo_id,geo_ligne,geo_l4,geo_l5
219501194,00019,21950119400019,O,1983-03-01,02,2020,,2022-08-29T09:09:34,true,4,,1,,,GRANDE  RUE,95770,BUHY,,,95119,,,,,,,,,,,,,,,,,,,2008-01-01,A,MAIRIE,,,,84.11Z,NAFRev2,O,1.69225,49.196389,0.94,housenumber,1 Grande Rue 95770 Buhy,95119_0221_00001,G,1 GRANDE RUE,
219501194,00027,21950119400027,O,1983-12-21,01,2020,,2022-08-29T09:09:34,false,3,,3,,RUE,DES ECOLES,95770,BUHY,,,95119,,,,,,,,,,,,,,,,,,,2008-01-01,A,ECOLE ELEMENTAIRE PUBLIQUE,,,,85.20Z,NAFRev2,N,1.692286,49.192811,0.94,housenumber,3 Rue des Ecoles 95770 Buhy,95119_0026_00003,G,3 RUE DES ECOLES,
219501194,00035,21950119400035,O,1999-12-25,NN,,,2008-01-04T18:45:51,false,2,MAIRIE,1,,,GRANDE RUE,95770,BUHY,,,95119,,,,,,,,,,,,,,,,,,,2008-01-01,A,SERVICE D'EAU,,,,36.00Z,NAFRev2,N,1.69225,49.196389,0.94,housenumber,1 Grande Rue 95770 Buhy,95119_0221_00001,G,1 GRANDE RUE,
269500336,00012,26950033600012,O,1983-03-01,NN,,,2016-07-23T12:16:14,true,4,,,,,,95770,BUHY,,,95119,,,,,,,,,,,,,,,,,,,2016-01-01,F,CCAS,,,,88.99B,NAFRev2,N,,,0,,,,,,
269504478,00018,26950447800018,O,1995-12-25,,,,2010-06-26T03:18:05,true,2,,,,RUE,GRANDE,95770,BUHY,,,95119,,,,,,,,,,,,,,,,,,,2008-01-01,A,CDE,,,,88.99B,NAFRev2,N,1.691406,49.194289,0.82,street,Grande Rue 95770 Buhy,95119_0221,G,GRANDE RUE,
304041817,00012,30404181700012,O,,NN,,,,true,1,,,,,,95770,BUHY,,,95119,,,,,,,,,,,,,,,,,,,1972-12-25,F,,,,,55.72,NAP,N,,,0,,,,,,
307386417,00058,30738641700058,O,2002-03-01,NN,,,2017-09-19T04:28:54,true,7,,13,,,GRANDE RUE,95770,BUHY,,,95119,,,,,,,,,,,,,,,,,,,2017-06-30,F,,,,,73.11Z,NAFRev2,N,1.691406,49.194289,0.94,housenumber,13 Grande Rue 95770 Buhy,95119_0221_00013,G,13 GRANDE RUE,
310207535,00033,31020753500033,O,2004-11-08,NN,,,2022-03-29T08:49:16,true,6,,3,,RUE,GRANDE RUE,95770,BUHY,,,95119,,,,,,,,,,,,,,,,,,,2022-02-28,F,,,,,82.19Z,NAFRev2,N,1.691609,49.195932,0.82,housenumber,3 Grande Rue 95770 Buhy,95119_0221_00003,G,3 GRANDE RUE,
316252394,00010,31625239400010,O,,,,,,true,1,,9,,,VENELLE AU BOIS,95770,BUHY,,,95119,,,,,,,,,,,,,,,,,,,1988-04-15,F,,,,,87.08,NAP,N,1.710843,49.198065,0.84,housenumber,9 Venelle aux Bois 95770 Buhy,95119_b030_00009,G,9 VENELLE AUX BOIS,
319955621,00010,31995562100010,O,,,,,,true,1,,19,,RUE,GRANDE RUE,95770,BUHY,,,95119,,,,,,,,,,,,,,,,,,,1996-11-07,F,,,,,01.3Z,NAF1993,N,1.6912,49.193906,0.83,housenumber,19 Grande Rue 95770 Buhy,95119_0221_00019,G,19 GRANDE RUE,
325022887,00013,32502288700013,O,,NN,,,,true,1,,3,,RUE,GRANDE RUE,95770,BUHY,,,95119,,,,,,,,,,,,,,,,,,,1985-06-14,F,,,,,55.71,NAP,N,1.691609,49.195932,0.82,housenumber,3 Grande Rue 95770 Buhy,95119_0221_00003,G,3 GRANDE RUE,
325454460,00016,32545446000016,O,,,,,,true,1,,33,,,GRANDE RUE,95770,BUHY,,,95119,,,,,,,,,,,,,,,,,,,1984-12-25,F,,,,,64.11,NAP,N,1.694658,49.191978,0.94,housenumber,33 Grande Rue 95770 Buhy,95119_0221_00033,G,33 GRANDE RUE,
329639041,00022,32963904100022,O,2011-04-01,,,,2021-02-23T10:50:24,true,1,HAMEAU DE BUCHET,5,,CHE,DE LA NOREE,95770,BUHY,,,95119,,,,,,,,,,,,,,,,,,,2011-04-01,A,,,,,81.30Z,NAFRev2,N,1.710241,49.197895,0.84,housenumber,5 Chemin de la Noree 95770 Buhy,95119_0172_00005,G,5 CHEMIN DE LA NOREE,
329643878,00013,32964387800013,O,,NN,,,,true,1,,1,,RUE,GRANDE,95770,BUHY,,,95119,,,,,,,,,,,,,,,,,,,1995-08-09,F,,,,,45.1A,NAF1993,N,1.69225,49.196389,0.77,housenumber,1 Grande Rue 95770 Buhy,95119_0221_00001,G,1 GRANDE RUE,
333218881,00014,33321888100014,O,,NN,,,,true,1,,3,,RUE,DU TRESOR,95770,BUHY,,,95119,,,,,,,,,,,,,,,,,,,1988-12-31,F,,,,,77.01,NAP,N,1.69254,49.192261,0.94,housenumber,3 Rue du Trésor 95770 Buhy,95119_0220_00003,G,3 RUE DU TRESOR,
337928717,00012,33792871700012,O,1900-01-01,NN,,,2011-04-28T00:30:23,false,3,,2,,CHE,DU LAVOIR,95770,BUHY,,,95119,,,,,,,,,,,,,,,,,,,1996-03-11,F,,,,,74.8F,NAF1993,N,1.711931,49.197507,0.82,housenumber,2 Chemin du Lavoir 95770 Buhy,95119_0134_00002,G,2 CHEMIN DU LAVOIR,
338594104,00022,33859410400022,O,2000-07-01,NN,,,2017-07-25T03:33:49,true,4,,5,,,GRANDE RUE,95770,BUHY,,,95119,,,,,,,,,,,,,,,,,,,2017-06-24,F,,,,,68.20B,NAFRev2,N,1.691536,49.195584,0.94,housenumber,5 Grande Rue 95770 Buhy,95119_0221_00005,G,5 GRANDE RUE,
339523276,00048,33952327600048,O,2008-12-04,,,,2011-12-05T10:10:58,true,2,,7,,RUE,DE LA SOURCE,95770,BUHY,,,95119,,,,,,,,,,,,,,,,,,,2009-10-09,F,,,,,46.69A,NAFRev2,O,1.690588,49.195267,0.94,housenumber,7 Rue de la Source 95770 Buhy,95119_0215_00007,G,7 RUE DE LA SOURCE,
340155688,00021,34015568800021,O,2010-01-04,,,,2012-11-09T00:34:12,true,2,HAMEAU BUCHET,2,,,AU BOIS -,95770,BUHY,,,95119,,,,,,,,,,,,,,,,,,,2012-01-30,F,,,,,47.99B,NAFRev2,N,1.711886,49.197119,0.6,housenumber,2 Rue Venelle aux Bois 95770 Buhy,95119_0246_00002,G,2 RUE VENELLE AUX BOIS,
340541309,00019,34054130900019,O,,,,,,true,1,,1,,,VENELLE AU BOIS BUCHET,95770,BUHY,,,95119,,,,,,,,,,,,,,,,,,,1987-10-12,F,,,,,55.60,NAP,N,1.7113,49.19717,0.65,housenumber,1 Rue Venelle aux Bois 95770 Buhy,95119_0246_00001,G,1 RUE VENELLE AUX BOIS,
342012218,00026,34201221800026,O,2010-11-01,,,,2021-02-23T10:57:37,true,3,,10,,RTE,DES 15 ARPENTS,95770,BUHY,,,95119,95770,,,,,,,,,,,,,,,,,,2019-10-01,A,,,,,85.59B,NAFRev2,N,1.711246,49.196253,0.86,housenumber,10 Route des 15 Arpents 95770 Buhy,95119_0195_00010,G,10 ROUTE DES 15 ARPENTS,
344933809,00016,34493380900016,O,,,,,,true,1,,,,RUE,DE MONTREUIL,95770,BUHY,,,95119,,,,,,,,,,,,,,,,,,,1990-12-03,F,,,,,69.12,NAP,N,1.695946,49.191524,0.78,street,Route de Montreuil 95770 Buhy,95119_0150,G,ROUTE DE MONTREUIL,
345163778,00029,34516377800029,O,1996-04-01,NN,,,2012-06-21T11:26:22,false,4,,12,,,VENELLE AUX BOIS,95770,BUHY,,,95119,,,,,,,,,,,,,,,,,,,2011-12-31,F,,,,,71.11Z,NAFRev2,N,1.710644,49.198287,0.94,housenumber,12 Venelle aux Bois 95770 Buhy,95119_b030_00012,G,12 VENELLE AUX BOIS,
345163778,00037,34516377800037,O,2006-09-01,,,,2010-12-10T11:24:16,false,3,BUCHET,2,,CHE,DES PRES,95770,BUHY,,,95119,,,,,,,,,,,,,,,,,,,2010-03-01,F,,,,,01.43Z,NAFRev2,N,1.713645,49.198131,0.8,housenumber,2 Chemin des Pres 95770 Buhy,95119_25prxa_00002,G,2 CHEMIN DES PRES,
379210388,00011,37921038800011,O,1990-08-08,NN,,,2015-07-10T03:39:06,true,3,,1,,RUE,DU CLOS MINET,95770,BUHY,,,95119,,,,,,,,,,,,,,,,,,,2008-01-01,A,,,,,68.20B,NAFRev2,N,1.691537,49.193529,0.94,housenumber,1 Rue du Clos Minet 95770 Buhy,95119_0014_00001,G,1 RUE DU CLOS MINET,
380985846,00019,38098584600019,O,1962-02-23,NN,,4399CZ,2020-03-25T09:09:49,false,7,BUCHET,2,,CHE,DU LAVOIR,95770,BUHY,,,95119,,,,,,,,,,,,,,,,,,,2020-03-13,F,,,,,43.99C,NAFRev2,N,1.711931,49.197507,0.82,housenumber,2 Chemin du Lavoir 95770 Buhy,95119_0134_00002,G,2 CHEMIN DU LAVOIR,
380985846,00027,38098584600027,O,2020-03-13,,,4399CZ,2021-02-23T11:09:27,true,1,BUCHET,6,,IMP,DU CHENE,95770,BUHY,,,95119,,,,,,,,,,,,,,,,,,,2020-03-13,A,,,,,43.99C,NAFRev2,N,1.712132,49.19596,0.81,housenumber,6 Impasse du Chene 95770 Buhy,95119_0010_00006,G,6 IMPASSE DU CHENE,
381791391,00018,38179139100018,O,1991-05-01,NN,,,2021-10-08T03:51:04,true,4,ST CLAIR SUR EPTE,2,,,GRANDE RUE,95770,BUHY,,,95119,,,,,,,,,,,,,,,,,,,2012-12-31,A,,,,,01.11Z,NAFRev2,O,1.691971,49.195714,0.94,housenumber,2 Grande Rue 95770 Buhy,95119_0221_00002,G,2 GRANDE RUE,
382698470,00012,38269847000012,O,1991-08-06,,,,,true,1,,1,,RTE,DES QUINZE ARPENTS,95770,BUHY,,,95119,,,,,,,,,,,,,,,,,,,2000-06-27,F,,,,,45.2V,NAF1993,N,1.711525,49.196945,0.58,housenumber,1 Route des 15 Arpents 95770 Buhy,95119_0195_00001,G,1 ROUTE DES 15 ARPENTS,
389114687,00020,38911468700020,O,2006-01-01,,,,2006-11-25T11:55:45,false,1,,2,,RUE,DE LA SOURCE,95770,BUHY,,,95119,,,,,,,,,,,,,,,,,,,2006-01-01,F,,,,,72.1Z,NAFRev1,N,1.690752,49.195335,0.94,housenumber,2 Rue de la Source 95770 Buhy,95119_0215_00002,G,2 RUE DE LA SOURCE,
395326812,00025,39532681200025,O,1989-10-15,,,,,false,3,M MOUCHEL REMY,1,,RUE,DE MONTREUIL,95770,BUHY,,,95119,,,,,,,,,,,,,,,,,,,1994-07-01,F,,,,,33.1B,NAF1993,N,1.695808,49.19177,0.8,housenumber,1 Route de Montreuil 95770 Buhy,95119_0150_00001,G,1 ROUTE DE MONTREUIL,
398025700,00012,39802570000012,O,1994-07-02,NN,,,2014-06-08T04:54:27,true,3,LES GROUES,2,,RTE,MONTREUIL,95770,BUHY,,,95119,,,,,,,,,,,,,,,,,,,2008-01-01,A,,,,,01.11Z,NAFRev2,N,1.696792,49.191533,0.82,housenumber,2 Route de Montreuil 95770 Buhy,95119_0150_00002,G,2 ROUTE DE MONTREUIL,
404337859,00023,40433785900023,O,2010-04-01,,,,2012-11-09T01:02:56,false,2,HAMEAU DE BUCHET,5,,CHE,DE LA NOREE,95770,BUHY,,,95119,,,,,,,,,,,,,,,,,,,2012-01-31,F,AUXILIUM VEXIN,,,,96.09Z,NAFRev2,N,1.710241,49.197895,0.84,housenumber,5 Chemin de la Noree 95770 Buhy,95119_0172_00005,G,5 CHEMIN DE LA NOREE,
405128604,00015,40512860400015,O,1966-01-01,NN,,,,true,3,,,,,BUCHET,95770,BUHY,,,95119,,,,,,,,,,,,,,,,,,,2003-04-30,F,,,,,01.1A,NAFRev1,N,1.711545,49.197368,0.94,street,Buchet 95770 Buhy,95119_q5g40y,G,BUCHET,
408303857,00010,40830385700010,O,1995-01-01,NN,,,2008-01-04T21:08:15,true,3,,3,,,GRANDE RUE,95770,BUHY,,,95119,,,,,,,,,,,,,,,,,,,2008-01-01,A,,,,,55.20Z,NAFRev2,N,1.691609,49.195932,0.94,housenumber,3 Grande Rue 95770 Buhy,95119_0221_00003,G,3 GRANDE RUE,
408464899,00017,40846489900017,O,1996-07-24,NN,,,2008-01-04T21:10:45,true,3,,9,,,VENELLE AU BOIS,95770,BUHY,,,95119,,,,,,,,,,,,,,,,,,,2008-01-01,A,,,,,68.20A,NAFRev2,N,1.710843,49.198065,0.84,housenumber,9 Venelle aux Bois 95770 Buhy,95119_b030_00009,G,9 VENELLE AUX BOIS,
411036288,00016,41103628800016,O,1996-11-08,NN,,,2014-04-18T04:54:29,true,3,,19,,,GRANDE RUE,95770,BUHY,,,95119,,,,,,,,,,,,,,,,,,,2008-01-01,A,,,,,68.20B,NAFRev2,N,1.6912,49.193906,0.94,housenumber,19 Grande Rue 95770 Buhy,95119_0221_00019,G,19 GRANDE RUE,
413802521,00034,41380252100034,O,2011-09-19,,,,2021-07-31T03:37:59,false,2,,2,,,GRANDE RUE,95770,BUHY,,,95119,,,,,,,,,,,,,,,,,,,2013-03-31,F,,,,,90.03B,NAFRev2,N,1.691971,49.195714,0.94,housenumber,2 Grande Rue 95770 Buhy,95119_0221_00002,G,2 GRANDE RUE,
414101642,00018,41410164200018,O,1997-10-01,,,,,true,1,,15,,RUE,TRESOR,95770,BUHY,,,95119,,,,,,,,,,,,,,,,,,,2000-09-30,F,,,,,72.1Z,NAF1993,N,1.694493,49.191406,0.87,housenumber,15 Rue du Trésor 95770 Buhy,95119_0220_00015,G,15 RUE DU TRESOR,
422701920,00023,42270192000023,O,2000-07-01,NN,,,2013-02-07T10:39:33,true,3,RTE DE PARNES,2,,,ESPACE ELIE,95770,BUHY,,,95119,,,,,,,,,,,,,,,,,,,2005-06-06,F,,,,,34.2A,NAFRev1,N,1.709806,49.196318,0.55,street,Espace les Brossettes 95770 Buhy,95119_v61g14,G,ESPACE LES BROSSETTES,
432204998,00012,43220499800012,O,2000-04-01,,,,,true,1,,3,,RUE,DU TRESOR,95770,BUHY,,,95119,,,,,,,,,,,,,,,,,,,2000-09-30,F,,,,,93.0N,NAF1993,N,1.69254,49.192261,0.94,housenumber,3 Rue du Trésor 95770 Buhy,95119_0220_00003,G,3 RUE DU TRESOR,
434454187,00015,43445418700015,O,2001-01-01,02,2020,4334ZB,2022-08-29T09:12:38,true,3,,3,,RUE,DE LA SOURCE,95770,BUHY,,,95119,,,,,,,,,,,,,,,,,,,2008-01-01,A,,,,,43.34Z,NAFRev2,O,1.690512,49.195825,0.94,housenumber,3 Rue de la Source 95770 Buhy,95119_0215_00003,G,3 RUE DE LA SOURCE,
439865817,00035,43986581700035,O,2005-04-22,NN,,,2014-06-14T02:32:54,true,3,CHEZ M ET MME CHAMPRDONDE,1,T,RTE,DES 15 ARPENTS BUCHET,95770,BUHY,,,95119,,,,,,,,,,,,,,,,,,,2012-07-28,F,,,,,90.01Z,NAFRev2,O,1.711449,49.196675,0.66,housenumber,1ter Route des 15 Arpents 95770 Buhy,95119_0195_00001_ter,G,1TER ROUTE DES 15 ARPENTS,
443212345,00021,44321234500021,O,2003-03-21,NN,,,2008-11-08T02:17:43,false,4,BUCHET,15,,RTE,DE PARNES,95770,BUHY,,,95119,,,,,,,,,,,,,,,,,,,2007-09-30,F,,,,,51.1R,NAFRev1,O,1.713164,49.197637,0.84,housenumber,15 Route de Parnes 95770 Buhy,95119_0190_00015,G,15 ROUTE DE PARNES,
443212345,00054,44321234500054,O,2010-06-30,,,,2012-02-15T14:56:27,true,2,BUCHET,2,,,VENELLE AU BOIS,95770,BUHY,,,95119,,,,,,,,,,,,,,,,,,,2012-01-30,F,,,,,18.13Z,NAFRev2,N,1.711886,49.197119,0.79,housenumber,2 Rue Venelle aux Bois 95770 Buhy,95119_0246_00002,G,2 RUE VENELLE AUX BOIS,
445325202,00023,44532520200023,O,2015-01-30,,,,2022-04-05T04:23:18,true,2,HAMEAU DE BUCHET,2,,CHE,DES PRES,95770,BUHY,,,95119,,,,,,,,,,,,,,,,,,,2021-12-31,F,,,,,68.20B,NAFRev2,N,1.713645,49.198131,0.8,housenumber,2 Chemin des Pres 95770 Buhy,95119_25prxa_00002,G,2 CHEMIN DES PRES,
450033352,00011,45003335200011,O,1978-11-28,NN,,,2008-01-05T01:59:26,true,3,ME MELISSA MACON,4,B,RUE,DES ECOLES,95770,BUHY,,,95119,,,,,,,,,,,,,,,,,,,2008-01-01,A,,,,,93.29Z,NAFRev2,N,1.69239,49.192915,0.79,street,Rue des Ecoles 95770 Buhy,95119_0026,G,RUE DES ECOLES,
450137898,00026,45013789800026,O,2006-07-26,,,,2010-01-28T05:44:43,true,3,,,,RTE,DE PARNES,95770,BUHY,,,95119,,,,,,,,,,,,,,,,,,,2010-01-18,F,,,,,80.10Z,NAFRev2,N,1.711074,49.197012,0.81,street,Route de Parnes 95770 Buhy,95119_0190,G,ROUTE DE PARNES,
450886619,00011,45088661900011,O,2003-11-21,NN,,,2018-08-20T10:10:59,true,4,,13,,RUE,DU TRESOR,95770,BUHY,,,95119,,,,,,,,,,,,,,,,,,,2017-07-31,F,,,,,82.99Z,NAFRev2,N,1.693769,49.191696,0.94,housenumber,13 Rue du Trésor 95770 Buhy,95119_0220_00013,G,13 RUE DU TRESOR,
451243497,00018,45124349700018,O,2004-01-01,NN,,,2015-01-22T09:50:07,false,4,,,,,BUCHET,95770,BUHY,,,95119,,,,,,,,,,,,,,,,,,,2009-12-31,F,,,,,01.11Z,NAFRev2,N,1.711545,49.197368,0.94,street,Buchet 95770 Buhy,95119_q5g40y,G,BUCHET,
452343361,00013,45234336100013,O,2003-12-01,NN,,,2006-11-25T19:03:24,false,3,,7,,RUE,DE LA SOURCE,95770,BUHY,,,95119,,,,,,,,,,,,,,,,,,,2004-04-01,F,,,,,74.2A,NAFRev1,N,1.690588,49.195267,0.94,housenumber,7 Rue de la Source 95770 Buhy,95119_0215_00007,G,7 RUE DE LA SOURCE,
452361165,00015,45236116500015,O,2004-04-01,01,2020,,2022-10-01T05:01:08,true,5,,2,,RTE,DE MONTREUIL,95770,BUHY,,,95119,,,,,,,,,,,,,,,,,,,2008-01-01,A,,,,,81.29B,NAFRev2,O,1.696792,49.191533,0.84,housenumber,2 Route de Montreuil 95770 Buhy,95119_0150_00002,G,2 ROUTE DE MONTREUIL,
481825792,00023,48182579200023,O,2019-04-24,,,,2021-03-16T19:36:11,true,2,,12,,RUE,DU TRESOR,95770,BUHY,,,95119,,,,,,,,,,,,,,,,,,,2020-08-05,F,,,,,46.13Z,NAFRev2,N,1.693248,49.191815,0.94,housenumber,12 Rue du Trésor 95770 Buhy,95119_0220_00012,G,12 RUE DU TRESOR,
484897822,00017,48489782200017,O,2005-10-24,,,,2017-11-23T03:52:06,false,3,,19,,,VENELLES AU BOIS,95770,BUHY,,,95119,,,,,,,,,,,,,,,,,,,2017-09-01,F,,,,,68.20B,NAFRev2,N,1.711604,49.199367,0.72,housenumber,19 Venelle aux Bois 95770 Buhy,95119_b030_00019,G,19 VENELLE AUX BOIS,
492585799,00017,49258579900017,O,2006-11-01,NN,,,2010-04-18T12:26:30,true,3,,3,,RUE,DE LA SOURCE,95770,BUHY,,,95119,,,,,,,,,,,,,,,,,,,2008-09-30,F,,,,,81.22Z,NAFRev2,O,1.690512,49.195825,0.94,housenumber,3 Rue de la Source 95770 Buhy,95119_0215_00003,G,3 RUE DE LA SOURCE,
495388845,00044,49538884500044,O,2012-05-01,,,,2021-02-23T14:04:44,true,1,,2,,RTE,DE PARNES,95770,BUHY,,,95119,,,,,,,,,,,,,,,,,,,2012-05-01,A,,,,,74.90B,NAFRev2,N,1.710689,49.19676,0.83,housenumber,2 Route de Parnes 95770 Buhy,95119_0190_00002,G,2 ROUTE DE PARNES,
497945857,00017,49794585700017,O,2006-11-10,,,,2008-01-05T00:43:59,true,2,CHEZ MME CAMARA,111,,BD,SERRURIER,95770,BUHY,,,95119,,,,,,,,,,,,,,,,,,,2008-01-01,A,,,,,94.99Z,NAFRev2,N,,,0,,,,,,
499820058,00018,49982005800018,O,2007-09-01,,,,2011-09-11T06:02:01,true,2,,2,,RUE,DE LA SOURCE,95770,BUHY,,,95119,,,,,,,,,,,,,,,,,,,2008-01-01,A,,,,,47.91B,NAFRev2,N,1.690752,49.195335,0.94,housenumber,2 Rue de la Source 95770 Buhy,95119_0215_00002,G,2 RUE DE LA SOURCE,
507874048,00014,50787404800014,O,2008-09-05,,,,2010-01-20T05:22:10,true,2,,1,,RUE,DE LA SOURCE,95770,BUHY,,,95119,,,,,,,,,,,,,,,,,,,2009-03-20,F,,,,,81.30Z,NAFRev2,N,1.691036,49.19594,0.94,housenumber,1 Rue de la Source 95770 Buhy,95119_0215_00001,G,1 RUE DE LA SOURCE,
510971054,00026,51097105400026,O,2016-01-06,,,,2021-02-23T15:18:54,false,1,,15,,RUE,GRANDE RUE,95770,BUHY,,,95119,,,,,,,,,,,,,,,,,,,2016-01-06,A,,,,,95.22Z,NAFRev2,N,1.691309,49.194113,0.83,housenumber,15 Grande Rue 95770 Buhy,95119_0221_00015,G,15 GRANDE RUE,
513639898,00024,51363989800024,O,2014-10-01,,,,2016-05-26T08:29:43,false,2,,7,,CHE,DE LA NOREE,95770,BUHY,,,95119,,,,,,,,,,,,,,,,,,,2016-05-01,F,,,,,70.22Z,NAFRev2,N,1.710241,49.197895,0.84,housenumber,7 Chemin de la Noree 95770 Buhy,95119_0172_00007,G,7 CHEMIN DE LA NOREE,
520766494,00014,52076649400014,O,2010-01-11,,,,2013-08-25T03:41:07,true,2,,7,,RUE,DE LA SOURCE,95770,BUHY,,,95119,,,,,,,,,,,,,,,,,,,2013-07-31,F,,,,,46.19B,NAFRev2,N,1.690588,49.195267,0.94,housenumber,7 Rue de la Source 95770 Buhy,95119_0215_00007,G,7 RUE DE LA SOURCE,
521631598,00013,52163159800013,O,2010-01-01,01,2020,,2022-08-29T09:23:55,true,2,,14,B,RTE,DE PARNES,95770,BUHY,,,95119,,,,,,,,,,,,,,,,,,,2012-12-31,A,,,,,01.11Z,NAFRev2,O,1.711074,49.197012,0.64,street,Route de Parnes 95770 Buhy,95119_0190,G,ROUTE DE PARNES,
528233679,00026,52823367900026,O,2013-06-01,,,4329BB,2020-03-27T19:32:23,true,2,,12,,RUE,VENELLE AUX BOIS,95770,BUHY,,,95119,,,,,,,,,,,,,,,,,,,2020-03-13,F,,,,,43.32A,NAFRev2,N,1.710675,49.198529,0.94,housenumber,12 Rue Venelle aux Bois 95770 Buhy,95119_0246_00012,G,12 RUE VENELLE AUX BOIS,
533402731,00038,53340273100038,O,2017-09-27,NN,,9602BB,2021-02-23T15:54:10,true,1,HAMEAU DE BUCHET,14,,,VENELLE AU BOIS,95770,BUHY,,,95119,,,,,,,,,,,,,,,,,,,2017-09-27,A,,,,ESTHETIQUE ET ENERGIE,96.02B,NAFRev2,N,1.710758,49.198721,0.85,housenumber,14 Venelle aux Bois 95770 Buhy,95119_b030_00014,G,14 VENELLE AUX BOIS,
539812099,00015,53981209900015,O,2012-01-01,,,,2013-07-10T14:43:39,false,2,,15,,RTE,DE PARNES,95770,BUHY,,,95119,,,,,,,,,,,,,,,,,,,2013-06-14,F,,,,,47.52A,NAFRev2,N,1.713164,49.197637,0.84,housenumber,15 Route de Parnes 95770 Buhy,95119_0190_00015,G,15 ROUTE DE PARNES,
578107005,00014,57810700500014,O,,,,,,true,1,,6,,RUE,TAVERNE,95770,BUHY,,,95119,,,,,,,,,,,,,,,,,,,1984-12-25,F,,,,,00.97,NAP,N,1.71215,49.197434,0.42,housenumber,6 Rue Venelle aux Bois 95770 Buhy,95119_0246_00006,G,6 RUE VENELLE AUX BOIS,
688106046,00016,68810604600016,O,,,,,,true,1,,,,HAM,BUCHET,95770,BUHY,,,95119,,,,,,,,,,,,,,,,,,,1984-12-25,F,,,,,67.05,NAP,N,1.711545,49.197368,0.94,street,Buchet 95770 Buhy,95119_q5g40y,G,BUCHET,
751318742,00010,75131874200010,O,2012-04-16,,,,2014-03-21T03:08:02,true,1,,2,,CHE,DES PRES,95770,BUHY,,,95119,,,,,,,,,,,,,,,,,,,2012-04-16,A,,,,,70.10Z,NAFRev2,N,1.713645,49.198131,0.8,housenumber,2 Chemin des Pres 95770 Buhy,95119_25prxa_00002,G,2 CHEMIN DES PRES,
785900820,00024,78590082000024,O,,NN,,,,true,1,,8,,RUE,DU TRESOR,95770,BUHY,,,95119,,,,,,,,,,,,,,,,,,,1996-07-22,F,,,,,01.1A,NAF1993,N,1.692372,49.19222,0.94,housenumber,8 Rue du Trésor 95770 Buhy,95119_0220_00008,G,8 RUE DU TRESOR,
789027034,00014,78902703400014,O,2012-10-12,,,4312BA,2016-03-22T04:22:44,false,2,HAMEAU DE BUCHET,19,,RTE,DE PARNES,95770,BUHY,,,95119,,,,,,,,,,,,,,,,,,,2015-12-14,F,,,,,81.30Z,NAFRev2,N,1.712362,49.197189,0.84,housenumber,19 Route de Parnes 95770 Buhy,95119_0190_00019,G,19 ROUTE DE PARNES,
790277636,00011,79027763600011,O,2013-01-03,,,,2015-07-30T10:38:44,true,2,HAMEAU DE BUCHET,16,,,ESPACE LES BROSSETTES,95770,BUHY,,,95119,,,,,,,,,,,,,,,,,,,2015-06-30,F,,,,,74.90B,NAFRev2,N,1.710279,49.196567,0.94,housenumber,16 Espace les Brossettes 95770 Buhy,95119_v61g14_00016,G,16 ESPACE LES BROSSETTES,
790459606,00014,79045960600014,O,2013-01-14,,,4321AB,2015-12-03T19:25:40,false,2,,3,B,,DU CLOS MINET,95770,BUHY,,,95119,,,,,,,,,,,,,,,,,,,2015-11-05,F,,,,ALL GOT,43.21A,NAFRev2,N,1.691254,49.193133,0.83,housenumber,3bis Rue du Clos Minet 95770 Buhy,95119_0014_00003_bis,G,3BIS RUE DU CLOS MINET,
790976484,00028,79097648400028,O,2021-09-15,,,,2021-12-16T15:52:45,true,1,,4,,GR,RUE,95770,BUHY,,,95119,,,,,,,,,,,,,,,,,,,2021-09-15,A,,,,,01.11Z,NAFRev2,N,1.691406,49.194289,0.5,street,Grande Rue 95770 Buhy,95119_0221,G,GRANDE RUE,
791407877,00012,79140787700012,O,2013-01-23,,,,2013-02-25T16:08:13,true,1,HAMEAU DE BUCHET,16,,,ESPACE LES BROSSETTES,95770,BUHY,,,95119,,,,,,,,,,,,,,,,,,,2013-01-23,A,,,,,94.99Z,NAFRev2,N,1.710279,49.196567,0.94,housenumber,16 Espace les Brossettes 95770 Buhy,95119_v61g14_00016,G,16 ESPACE LES BROSSETTES,
793215062,00019,79321506200019,O,2013-06-01,,,,2022-10-12T08:45:19,true,2,,6,,RTE,PARNES,95770,BUHY,,,95119,,,,,,,,,,,,,,,,,,,2021-12-31,F,,,,,96.09Z,NAFRev2,N,1.711111,49.196906,0.8,housenumber,6 Route de Parnes 95770 Buhy,95119_0190_00006,G,6 ROUTE DE PARNES,
793880667,00035,79388066700035,O,2021-11-04,,,,2022-04-26T16:14:52,false,1,,3,,CHE,DES PRES,95770,BUHY,,,95119,,,,,,,,,,,,,,,,,,,2021-11-04,F,,,,,70.22Z,NAFRev2,N,1.713297,49.198218,0.8,housenumber,3 Chemin des Pres 95770 Buhy,95119_25prxa_00003,G,3 CHEMIN DES PRES,
794066027,00010,79406602700010,O,2013-07-04,,,,2018-06-19T04:25:17,false,4,,3,,,GRANDE RUE,95770,BUHY,,,95119,,,,,,,,,,,,,,,,,,,2018-06-01,F,,,,,86.90F,NAFRev2,N,1.691609,49.195932,0.94,housenumber,3 Grande Rue 95770 Buhy,95119_0221_00003,G,3 GRANDE RUE,
799779541,00017,79977954100017,O,2014-01-17,,,,2017-02-02T09:35:38,true,4,,10,,,ESPACE LES BROSSETTES,95770,BUHY,,,95119,,,,,,,,,,,,,,,,,,,2017-01-11,F,,,,,41.20B,NAFRev2,N,1.709541,49.196376,0.94,housenumber,10 Espace les Brossettes 95770 Buhy,95119_v61g14_00010,G,10 ESPACE LES BROSSETTES,
803446954,00015,80344695400015,O,2014-06-30,,,,2016-04-25T09:30:14,true,2,BUHY,1,,CHE,DES CORNOUILLERS,95770,BUHY,,,95119,,,,,,,,,,,,,,,,,,,2015-12-31,F,,,,,55.10Z,NAFRev2,N,1.69098,49.194349,0.86,housenumber,1 Chemin des Cornouillers 95770 Buhy,95119_0019_00001,G,1 CHEMIN DES CORNOUILLERS,
803743988,00013,80374398800013,O,2014-08-18,,,,2022-04-01T19:34:41,false,2,,12,,RUE,VENELLE AU BOIS,95770,BUHY,,,95119,,,,,,,,,,,,,,,,,,,2016-11-30,F,,,,,82.11Z,NAFRev2,N,1.710675,49.198529,0.87,housenumber,12 Rue Venelle aux Bois 95770 Buhy,95119_0246_00012,G,12 RUE VENELLE AUX BOIS,
805227238,00013,80522723800013,O,2014-10-11,,,,2014-10-16T08:49:07,true,1,,10,,RTE,DES 15 ARPENTS,95770,BUHY,,,95119,,,,,,,,,,,,,,,,,,,2014-10-11,A,,,,,68.31Z,NAFRev2,N,1.711246,49.196253,0.86,housenumber,10 Route des 15 Arpents 95770 Buhy,95119_0195_00010,G,10 ROUTE DES 15 ARPENTS,
809132749,00015,80913274900015,O,2015-01-01,,,,2021-10-13T08:54:02,true,2,,14,,,ROUTE DE PARNES,95770,BUHY,,,95119,,,,,,,,,,,,,,,,,,,2021-09-30,F,,,,,85.51Z,NAFRev2,N,1.711074,49.197012,0.94,street,Route de Parnes 95770 Buhy,95119_0190,G,ROUTE DE PARNES,
814952735,00011,81495273500011,O,2015-11-06,,,,2015-12-02T05:33:03,true,1,,2,,,CHEMIN DES PRES,95770,BUHY,,,95119,,,,,,,,,,,,,,,,,,,2015-11-06,A,,,,,68.20B,NAFRev2,N,1.713645,49.198131,0.94,housenumber,2 Chemin des Pres 95770 Buhy,95119_25prxa_00002,G,2 CHEMIN DES PRES,
820805562,00015,82080556200015,O,2016-06-01,,,,2017-03-30T15:03:23,false,2,,1,,CHE,DES COURNOUILLERS,95770,BUHY,,,95119,,,,,,,,,,,,,,,,,,,2017-03-12,F,,,,,73.11Z,NAFRev2,N,1.69098,49.194349,0.75,housenumber,1 Chemin des Cornouillers 95770 Buhy,95119_0019_00001,G,1 CHEMIN DES CORNOUILLERS,