siren,nic,siret,statutDiffusionEtablissement,dateCreationEtablissement,trancheEffectifsEtablissement,anneeEffectifsEtablissement,activitePrincipaleRegistreMetiersEtablissement,dateDernierTraitementEtablissement,etablissementSiege,nombrePeriodesEtablissement,complementAdresseEtablissement,numeroVoieEtablissement,indiceRepetitionEtablissement,typeVoieEtablissement,libelleVoieEtablissement,codePostalEtablissement,libelleCommuneEtablissement,libelleCommuneEtrangerEtablissement,distributionSpecialeEtablissement,codeCommuneEtablissement,codeCedexEtablissement,libelleCedexEtablissement,codePaysEtrangerEtablissement,libellePaysEtrangerEtablissement,complementAdresse2Etablissement,numeroVoie2Etablissement,indiceRepetition2Etablissement,typeVoie2Etablissement,libelleVoie2Etablissement,codePostal2Etablissement,libelleCommune2Etablissement,libelleCommuneEtranger2Etablissement,distributionSpeciale2Etablissement,codeCommune2Etablissement,codeCedex2Etablissement,libelleCedex2Etablissement,codePaysEtranger2Etablissement,libellePaysEtranger2Etablissement,dateDebut,etatAdministratifEtablissement,enseigne1Etablissement,enseigne2Etablissement,enseigne3Etablissement,denominationUsuelleEtablissement,activitePrincipaleEtablissement,nomenclatureActivitePrincipaleEtablissement,caractereEmployeurEtablissement,longitude,latitude,geo_score,geo_type,geo_adresse,geo_id,geo_ligne,geo_l4,geo_l5
219502879,00014,21950287900014,O,1983-03-01,11,2020,,2022-08-29T09:09:34,true,4,,,,RUE,ROBERT MACHY,95810,GRISY-LES-PLATRES,,,95287,,,,,,,,,,,,,,,,,,,2008-01-01,A,MAIRIE,,,,84.11Z,NAFRev2,O,2.050361,49.130719,0.95,street,Rue Robert Machy 95810 Grisy-les-Plâtres,95287_0178,G,RUE ROBERT MACHY,
219502879,00022,21950287900022,O,1983-12-21,02,2020,,2022-08-29T09:09:34,false,3,,29,,RUE,ROBERT MACHY,95810,GRISY-LES-PLATRES,,,95287,,,,,,,,,,,,,,,,,,,2008-01-01,A,ECOLE ELEMENTAIRE PUBLIQUE,,,,85.20Z,NAFRev2,N,2.052141,49.130247,0.95,housenumber,29 Rue Robert Machy 95810 Grisy-les-Plâtres,95287_0178_00029,G,29 RUE ROBERT MACHY,
219502879,00030,21950287900030,O,1998-12-25,NN,,,2019-11-14T14:01:05,false,3,MAIRIE,,,RUE,ROBERT MACHY,95810,GRISY-LES-PLATRES,,,95287,,,,,,,,,,,,,,,,,,,2008-01-01,F,SERVICE D'ASSAINISSEMENT,,,,37.00Z,NAFRev2,N,2.050361,49.130719,0.95,street,Rue Robert Machy 95810 Grisy-les-Plâtres,95287_0178,G,RUE ROBERT MACHY,
259502417,00019,25950241700019,O,1994-07-07,01,2019,,2021-10-27T08:12:34,true,3,MAIRIE,10,,RUE,ROBERT MACHY,95810,GRISY-LES-PLATRES,,,95287,,,,,,,,,,,,,,,,,,,2008-01-01,A,,,,,36.00Z,NAFRev2,N,2.050361,49.130719,0.95,housenumber,10 Rue Robert Machy 95810 Grisy-les-Plâtres,95287_0178_00010,G,10 RUE ROBERT MACHY,
269503660,00012,26950366000012,O,1995-12-25,,,,2020-07-28T12:59:12,true,3,,10,,RUE,ROBERT MACHY,95810,GRISY-LES-PLATRES,,,95287,,,,,,,,,,,,,,,,,,,2017-12-31,F,CCAS,,,,88.99B,NAFRev2,N,2.050361,49.130719,0.95,housenumber,10 Rue Robert Machy 95810 Grisy-les-Plâtres,95287_0178_00010,G,10 RUE ROBERT MACHY,
269504296,00014,26950429600014,O,1995-12-25,NN,,,2019-11-14T14:01:05,true,2,,10,,RUE,ROBERT MACHY,95810,GRISY-LES-PLATRES,,,95287,,,,,,,,,,,,,,,,,,,2008-01-01,A,CDE,,,,88.99B,NAFRev2,N,2.050361,49.130719,0.95,housenumber,10 Rue Robert Machy 95810 Grisy-les-Plâtres,95287_0178_00010,G,10 RUE ROBERT MACHY,
299500470,00016,29950047000016,O,1996-12-25,NN,,,2019-11-14T14:01:05,true,2,,10,,RUE,ROBERT MACHY,95810,GRISY-LES-PLATRES,,,95287,,,,,,,,,,,,,,,,,,,2008-01-01,A,,,,,42.99Z,NAFRev2,N,2.050361,49.130719,0.95,housenumber,10 Rue Robert Machy 95810 Grisy-les-Plâtres,95287_0178_00010,G,10 RUE ROBERT MACHY,
303764948,00012,30376494800012,O,,NN,,,2019-11-14T14:01:05,true,1,,3,,RUE,DU BOIS QUERIS,95810,GRISY-LES-PLATRES,,,95287,,,,,,,,,,,,,,,,,,,,F,,,,,81.21,NAP,N,2.048035,49.134705,0.95,housenumber,3 Rue du Bois Quéris 95810 Grisy-les-Plâtres,95287_0069_00003,G,3 RUE DU BOIS QUERIS,
304041957,00016,30404195700016,O,1976-01-01,NN,,,2019-11-14T14:01:05,true,3,,,,RTE,DE BEAUVAIS,95810,GRISY-LES-PLATRES,,,95287,,,,,,,,,,,,,,,,,,,2008-01-01,A,,,,,68.20B,NAFRev2,N,2.051014,49.134011,0.39,street,Rue de Berval 95810 Grisy-les-Plâtres,95287_0111,G,RUE DE BERVAL,
304041965,00027,30404196500027,O,,NN,,,2019-11-14T14:01:05,true,1,,16,,RUE,GAL DE GAULLE,95810,GRISY-LES-PLATRES,,,95287,,,,,,,,,,,,,,,,,,,1989-06-30,F,,,,,21.08,NAP,N,2.049256,49.131726,0.89,housenumber,16 Rue du Général de Gaulle 95810 Grisy-les-Plâtres,95287_0130_00016,G,16 RUE DU GENERAL DE GAULLE,
304422074,00027,30442207400027,O,,,,,2019-11-14T14:01:05,true,1,,,,LD,LES VIVIERS,95810,GRISY-LES-PLATRES,,,95287,,,,,,,,,,,,,,,,,,,1985-12-25,F,,,,,49.01,NAP,N,2.045813,49.129641,0.47,locality,Les Vignes de Buard 95810 Grisy-les-Plâtres,95287_B043,G,LES VIGNES DE BUARD,
305433625,00038,30543362500038,O,,,,,2019-11-14T14:01:05,true,1,,3,,RUE,DU BOIS QUERIS,95810,GRISY-LES-PLATRES,,,95287,,,,,,,,,,,,,,,,,,,,F,,,,,65.06,NAP,N,2.048035,49.134705,0.95,housenumber,3 Rue du Bois Quéris 95810 Grisy-les-Plâtres,95287_0069_00003,G,3 RUE DU BOIS QUERIS,
305798878,00016,30579887800016,O,,NN,,,2019-11-14T14:01:05,true,1,,1,,PL,DU SOLEIL LEVANT,95810,GRISY-LES-PLATRES,,,95287,,,,,,,,,,,,,,,,,,,1988-06-28,F,,,,,65.06,NAP,N,2.04897,49.132298,0.86,housenumber,1 Place du Soleil Levant 95810 Grisy-les-Plâtres,95287_0200_00001,G,1 PLACE DU SOLEIL LEVANT,
307618140,00015,30761814000015,O,,NN,,,2019-11-14T14:01:05,true,1,,18,,RUE,GENERAL DE GAULLE,95810,GRISY-LES-PLATRES,,,95287,,,,,,,,,,,,,,,,,,,1989-09-12,F,,,,,67.05,NAP,N,2.049211,49.131924,0.94,housenumber,18 Rue du Général de Gaulle 95810 Grisy-les-Plâtres,95287_0130_00018,G,18 RUE DU GENERAL DE GAULLE,
307934463,00018,30793446300018,O,,,,,2019-11-14T14:01:05,true,1,,7,,RUE,DE BERVAL,95810,GRISY-LES-PLATRES,,,95287,,,,,,,,,,,,,,,,,,,1984-12-25,F,,,,,55.10,NAP,N,2.050442,49.132652,0.95,housenumber,7 Rue de Berval 95810 Grisy-les-Plâtres,95287_0111_00007,G,7 RUE DE BERVAL,
311933733,00017,31193373300017,O,1978-01-01,NN,,,2019-11-14T14:01:05,true,3,,3,,RUE,SAINT CAPRAIS,95810,GRISY-LES-PLATRES,,,95287,,,,,,,,,,,,,,,,,,,2008-01-01,A,,,,,68.20B,NAFRev2,N,2.050993,49.13098,0.94,housenumber,3 Rue Saint-Caprais 95810 Grisy-les-Plâtres,95287_0179_00003,G,3 RUE SAINT CAPRAIS,
312137524,00012,31213752400012,O,,,,,2019-11-14T14:01:05,true,1,,7,,PL,DU SOLEIL LEVANT,95810,GRISY-LES-PLATRES,,,95287,,,,,,,,,,,,,,,,,,,,F,,,,,79.06,NAP,N,2.049137,49.132535,0.86,housenumber,7 Place du Soleil Levant 95810 Grisy-les-Plâtres,95287_0200_00007,G,7 PLACE DU SOLEIL LEVANT,
313198962,00026,31319896200026,O,1997-01-15,NN,,,2019-11-14T14:01:05,true,3,,2,,CHE,DE BUTEL,95810,GRISY-LES-PLATRES,,,95287,,,,,,,,,,,,,,,,,,,2008-01-01,A,,,,,46.18Z,NAFRev2,N,2.050403,49.128474,0.7,housenumber,2 Rue de Butel 95810 Grisy-les-Plâtres,95287_0101_00002,G,2 RUE DE BUTEL,
313260630,00030,31326063000030,O,1990-01-01,,,,2019-11-14T14:01:05,true,4,,12,,RUE,DU VEXIN,95810,GRISY-LES-PLATRES,,,95287,,,,,,,,,,,,,,,,,,,1996-12-25,F,,,,,28.1C,NAF1993,N,2.052567,49.130702,0.95,housenumber,12 Rue du Vexin 95810 Grisy-les-Plâtres,95287_0194_00012,G,12 RUE DU VEXIN,
314879040,00041,31487904000041,O,2007-04-01,,,,2019-11-14T14:01:05,true,3,,4,,RUE,DU VEXIN,95810,GRISY-LES-PLATRES,,,95287,,,,,,,,,,,,,,,,,,,2011-07-01,F,LE SAINT CAPRAIS,,,,56.30Z,NAFRev2,N,2.050026,49.132078,0.95,housenumber,4 Rue du Vexin 95810 Grisy-les-Plâtres,95287_0194_00004,G,4 RUE DU VEXIN,
315168237,00016,31516823700016,O,,,,,2019-11-14T14:01:05,true,1,,6,,CHE,DE FROUVILLE,95810,GRISY-LES-PLATRES,,,95287,,,,,,,,,,,,,,,,,,,1984-12-25,F,,,,,55.10,NAP,N,2.048002,49.12961,0.38,housenumber,6 Rue du Général de Gaulle 95810 Grisy-les-Plâtres,95287_0130_00006,G,6 RUE DU GENERAL DE GAULLE,
315602243,00026,31560224300026,O,,NN,,,2019-11-14T14:01:05,true,1,,,,,HARAS DE GRISY,95810,GRISY-LES-PLATRES,,,95287,,,,,,,,,,,,,,,,,,,1997-08-15,F,,,,,01.2C,NAF1993,N,2.049075,49.132138,0.58,street,Rue du Général de Gaulle 95810 Grisy-les-Plâtres,95287_0130,G,RUE DU GENERAL DE GAULLE,
315644377,00014,31564437700014,O,,NN,,,2019-11-14T14:01:05,true,1,,27,,RUE,ROBERT MACHY,95810,GRISY-LES-PLATRES,,,95287,,,,,,,,,,,,,,,,,,,1987-12-25,F,,,,,55.10,NAP,N,2.052026,49.130219,0.95,housenumber,27 Rue Robert Machy 95810 Grisy-les-Plâtres,95287_0178_00027,G,27 RUE ROBERT MACHY,
315843664,00014,31584366400014,O,1979-01-01,NN,,,2019-11-14T14:01:05,true,3,,13,,RUE,ROBERT MACHY,95810,GRISY-LES-PLATRES,,,95287,,,,,,,,,,,,,,,,,,,2008-01-01,A,,,,,70.22Z,NAFRev2,N,2.05103,49.130596,0.95,housenumber,13 Rue Robert Machy 95810 Grisy-les-Plâtres,95287_0178_00013,G,13 RUE ROBERT MACHY,
318063781,00039,31806378100039,O,1993-04-01,,,,2022-06-14T03:45:37,true,4,,18,,RUE,GENERAL DE GAULLE,95810,GRISY-LES-PLATRES,,,95287,,,,,,,,,,,,,,,,,,,2008-01-01,F,,,,,68.20B,NAFRev2,N,2.049211,49.131924,0.94,housenumber,18 Rue du Général de Gaulle 95810 Grisy-les-Plâtres,95287_0130_00018,G,18 RUE DU GENERAL DE GAULLE,
318539608,00030,31853960800030,O,2012-01-01,,,,2021-02-23T10:43:07,true,1,,,,,17 RUE ROBERT MACHY,95810,GRISY-LES-PLATRES,,,95287,,,,,,,,,,,,,,,,,,,2012-01-01,A,,,,,71.11Z,NAFRev2,N,2.051392,49.130392,0.95,housenumber,17 Rue Robert Machy 95810 Grisy-les-Plâtres,95287_0178_00017,G,17 RUE ROBERT MACHY,
318680378,00011,31868037800011,O,,NN,,,2019-11-14T14:01:05,true,1,,8,,PL,DU SOLEIL LEVANT,95810,GRISY-LES-PLATRES,,,95287,,,,,,,,,,,,,,,,,,,1989-06-30,F,,,,,84.10,NAP,N,2.049421,49.132565,0.86,housenumber,8 Place du Soleil Levant 95810 Grisy-les-Plâtres,95287_0200_00008,G,8 PLACE DU SOLEIL LEVANT,
319339560,00017,31933956000017,O,1900-01-01,NN,,,2019-11-14T14:01:05,false,3,,26,,RUE,DU GAL DE GAULLE,95810,GRISY-LES-PLATRES,,,95287,,,,,,,,,,,,,,,,,,,1987-12-25,F,,,,,77.14,NAP,N,2.048954,49.133063,0.91,housenumber,26 Rue du Général de Gaulle 95810 Grisy-les-Plâtres,95287_0130_00026,G,26 RUE DU GENERAL DE GAULLE,
320307473,00027,32030747300027,O,2005-10-20,NN,,,2021-08-12T17:27:08,true,4,,4,,RUE,DES MAUROIS,95810,GRISY-LES-PLATRES,,,95287,,,,,,,,,,,,,,,,,,,2017-01-05,F,,,,,47.89Z,NAFRev2,O,2.057454,49.132302,0.94,housenumber,4 Rue des Maurois 95810 Grisy-les-Plâtres,95287_0158_00004,G,4 RUE DES MAUROIS,
322258088,00010,32225808800010,O,1979-01-01,NN,,,2019-11-14T14:01:05,true,4,,1,,RUE,DU VEXIN,95810,GRISY-LES-PLATRES,,,95287,,,,,,,,,,,,,,,,,,,1991-12-25,F,,,,,77.05,NAP,N,2.049646,49.132355,0.95,housenumber,1 Rue du Vexin 95810 Grisy-les-Plâtres,95287_0194_00001,G,1 RUE DU VEXIN,
322992926,00012,32299292600012,O,,,,,2019-11-14T14:01:05,true,1,,1,,RUE,DE L ISLE,95810,GRISY-LES-PLATRES,,,95287,,,,,,,,,,,,,,,,,,,1984-12-25,F,,,,,55.40,NAP,N,2.05082,49.134865,0.95,housenumber,1 Rue de l’Isle 95810 Grisy-les-Plâtres,95287_0139_00001,G,1 RUE DE L ISLE,
323138024,00019,32313802400019,O,,,,,2019-11-14T14:01:05,true,1,,6,,RUE,DU VEXIN,95810,GRISY-LES-PLATRES,,,95287,,,,,,,,,,,,,,,,,,,1985-12-25,F,,,,,67.01,NAP,N,2.050492,49.131837,0.95,housenumber,6 Rue du Vexin 95810 Grisy-les-Plâtres,95287_0194_00006,G,6 RUE DU VEXIN,
323360917,00013,32336091700013,O,,NN,,,2019-11-14T14:01:05,true,1,,3,,RUE,SAINT CAPRAIS,95810,GRISY-LES-PLATRES,,,95287,,,,,,,,,,,,,,,,,,,1987-12-30,F,,,,,64.21,NAP,N,2.050993,49.13098,0.94,housenumber,3 Rue Saint-Caprais 95810 Grisy-les-Plâtres,95287_0179_00003,G,3 RUE SAINT CAPRAIS,
324548247,00026,32454824700026,O,2009-05-15,,,,2019-11-14T14:01:05,true,2,,13,,RUE,DE BUTEL,95810,GRISY-LES-PLATRES,,,95287,,,,,,,,,,,,,,,,,,,2011-04-01,F,,,,,62.02A,NAFRev2,N,2.050895,49.128199,0.94,housenumber,13 Rue de Butel 95810 Grisy-les-Plâtres,95287_0101_00013,G,13 RUE DE BUTEL,
325525467,00024,32552546700024,O,2006-11-01,,,,2021-02-23T10:47:58,true,2,,41,,RUE,DU VEXIN,95810,GRISY-LES-PLATRES,,,95287,,,,,,,,,,,,,,,,,,,2008-01-01,A,,,,,90.03B,NAFRev2,N,2.05285,49.130673,0.95,housenumber,41 Rue du Vexin 95810 Grisy-les-Plâtres,95287_0194_00041,G,41 RUE DU VEXIN,
325565547,00040,32556554700040,O,1998-08-26,NN,,,2019-11-14T14:01:05,true,7,,4,,CHE,DE BUTEL,95810,GRISY-LES-PLATRES,,,95287,,,,,,,,,,,,,,,,,,,2013-07-10,F,,,,,82.19Z,NAFRev2,N,2.051518,49.128555,0.64,street,Rue de Butel 95810 Grisy-les-Plâtres,95287_0101,G,RUE DE BUTEL,
327858304,00063,32785830400063,O,2009-03-15,,,,2019-11-14T14:01:05,true,2,,1,,PL,DE L'EGLISE,95810,GRISY-LES-PLATRES,,,95287,,,,,,,,,,,,,,,,,,,2011-07-06,F,,,,,18.13Z,NAFRev2,N,2.050079,49.13113,0.84,housenumber,1 Place de l’Eglise 95810 Grisy-les-Plâtres,95287_0198_00001,G,1 PLACE DE L EGLISE,
327903373,00014,32790337300014,O,,NN,,,2019-11-14T14:01:05,true,1,,11,,RUE,DU VEXIN,95810,GRISY-LES-PLATRES,,,95287,,,,,,,,,,,,,,,,,,,1991-12-25,F,,,,,21.02,NAP,N,2.05052,49.131893,0.95,housenumber,11 Rue du Vexin 95810 Grisy-les-Plâtres,95287_0194_00011,G,11 RUE DU VEXIN,
328430053,00038,32843005300038,O,1998-09-08,NN,,,2019-11-14T14:01:05,true,3,,4,,RUE,DES MAUROIS,95810,GRISY-LES-PLATRES,,,95287,,,,,,,,,,,,,,,,,,,2008-01-01,A,,,,,68.20B,NAFRev2,O,2.057454,49.132302,0.94,housenumber,4 Rue des Maurois 95810 Grisy-les-Plâtres,95287_0158_00004,G,4 RUE DES MAUROIS,
330568288,00030,33056828800030,O,1998-09-08,01,2020,,2022-08-29T09:21:33,false,5,,4,,RUE,DES MAUROIS,95810,GRISY-LES-PLATRES,,,95287,,,,,,,,,,,,,,,,,,,2021-03-31,F,,,,,68.20B,NAFRev2,O,2.057454,49.132302,0.94,housenumber,4 Rue des Maurois 95810 Grisy-les-Plâtres,95287_0158_00004,G,4 RUE DES MAUROIS,
331063560,00048,33106356000048,O,1992-07-01,NN,,1071DZ,2020-03-27T19:32:34,true,8,LES VIVIERS,,,,LIEU DIT LES VIVIERS,95810,GRISY-LES-PLATRES,,,95287,,,,,,,,,,,,,,,,,,,2020-03-15,F,,,,,10.71D,NAFRev2,N,2.045813,49.129641,0.47,locality,Les Vignes de Buard 95810 Grisy-les-Plâtres,95287_B043,G,LES VIGNES DE BUARD,
333382836,00109,33338283600109,O,2006-12-13,,,,2019-11-14T14:01:05,false,2,,18,,RUE,DU GENERAL DE GAULLE,95810,GRISY-LES-PLATRES,,,95287,,,,,,,,,,,,,,,,,,,2007-10-26,F,,,,,60.2E,NAFRev1,N,2.049211,49.131924,0.95,housenumber,18 Rue du Général de Gaulle 95810 Grisy-les-Plâtres,95287_0130_00018,G,18 RUE DU GENERAL DE GAULLE,
334498862,00013,33449886200013,O,,NN,,,2019-11-14T14:01:05,true,1,,25,,RUE,DU GENERAL DE GAULLE,95810,GRISY-LES-PLATRES,,,95287,,,,,,,,,,,,,,,,,,,,F,,,,,64.49,NAP,N,2.049075,49.132138,0.95,housenumber,25 Rue du Général de Gaulle 95810 Grisy-les-Plâtres,95287_0130_00025,G,25 RUE DU GENERAL DE GAULLE,
335017422,00015,33501742200015,O,,NN,,,2019-11-14T14:01:05,true,1,,11,,RUE,VEXIN,95810,GRISY-LES-PLATRES,,,95287,,,,,,,,,,,,,,,,,,,1988-04-29,F,,,,,77.01,NAP,N,2.05052,49.131893,0.88,housenumber,11 Rue du Vexin 95810 Grisy-les-Plâtres,95287_0194_00011,G,11 RUE DU VEXIN,
335044178,00036,33504417800036,O,2017-02-28,,,,2021-02-23T10:54:03,true,1,,22,,RUE,DE L'ISLE,95810,GRISY-LES-PLATRES,,,95287,,,,,,,,,,,,,,,,,,,2017-02-28,A,,,,,68.20B,NAFRev2,N,2.051189,49.133133,0.95,housenumber,22 Rue de l’Isle 95810 Grisy-les-Plâtres,95287_0139_00022,G,22 RUE DE L ISLE,
337955694,00019,33795569400019,O,,,,,2019-11-14T14:01:05,true,1,,3,,PL,DU SOLEIL LEVANT,95810,GRISY-LES-PLATRES,,,95287,,,,,,,,,,,,,,,,,,,1989-12-31,F,,,,,67.01,NAP,N,2.048736,49.132421,0.86,housenumber,3 Place du Soleil Levant 95810 Grisy-les-Plâtres,95287_0200_00003,G,3 PLACE DU SOLEIL LEVANT,
339659484,00010,33965948400010,O,1986-12-12,NN,,,2019-11-14T14:01:05,false,4,,7,,RUE,DU BOIS QUERIS,95810,GRISY-LES-PLATRES,,,95287,,,,,,,,,,,,,,,,,,,1995-12-25,F,,,,,51.6K,NAF1993,O,2.047957,49.135883,0.95,housenumber,7 Rue du Bois Quéris 95810 Grisy-les-Plâtres,95287_0069_00007,G,7 RUE DU BOIS QUERIS,
339712812,00017,33971281200017,O,1986-12-01,NN,,,2019-11-14T14:01:05,true,4,,2,,RUE,DE L'ISLE,95810,GRISY-LES-PLATRES,,,95287,,,,,,,,,,,,,,,,,,,2003-01-01,F,,,,,45.1A,NAF1993,O,2.051272,49.132968,0.85,street,Rue de l’Isle 95810 Grisy-les-Plâtres,95287_0139,G,RUE DE L ISLE,
340443944,00020,34044394400020,O,1997-10-15,NN,,,2019-11-14T14:01:05,true,3,,4,,RUE,DU VEXIN,95810,GRISY-LES-PLATRES,,,95287,,,,,,,,,,,,,,,,,,,2007-03-31,F,,,,,55.4A,NAFRev1,N,2.050026,49.132078,0.95,housenumber,4 Rue du Vexin 95810 Grisy-les-Plâtres,95287_0194_00004,G,4 RUE DU VEXIN,
341576809,00055,34157680900055,O,2015-06-01,01,2020,,2022-08-29T09:27:02,true,2,,19,,RUE,DU VEXIN,95810,GRISY-LES-PLATRES,,,95287,,,,,,,,,,,,,,,,,,,2015-09-20,A,,,,,69.10Z,NAFRev2,O,2.051064,49.131575,0.95,housenumber,19 Rue du Vexin 95810 Grisy-les-Plâtres,95287_0194_00019,G,19 RUE DU VEXIN,
341878130,00010,34187813000010,O,,NN,,,2019-11-14T14:01:05,true,1,,3,,,COUR DES POUCHETS,95810,GRISY-LES-PLATRES,,,95287,,,,,,,,,,,,,,,,,,,1992-08-15,F,,,,,92.3A,NAF1993,N,2.048398,49.132009,0.94,housenumber,3 Cour des Pouchets 95810 Grisy-les-Plâtres,95287_0170_00003,G,3 COUR DES POUCHETS,
343680609,00066,34368060900066,O,2021-04-01,,,,2021-07-02T12:18:17,true,2,CHEZ MLLE GALOPIN,1,,PL,DE L'EGLISE,95810,GRISY-LES-PLATRES,,,95287,,,,,,,,,,,,,,,,,,,2021-04-21,A,,,,,46.19B,NAFRev2,N,2.050079,49.13113,0.84,housenumber,1 Place de l’Eglise 95810 Grisy-les-Plâtres,95287_0198_00001,G,1 PLACE DE L EGLISE,
343980249,00027,34398024900027,O,1988-12-14,NN,,,2019-11-14T14:01:05,false,4,,3,,RUE,DU BOIS QUERIS,95810,GRISY-LES-PLATRES,,,95287,,,,,,,,,,,,,,,,,,,1995-01-30,F,,,,,50.2Z,NAF1993,N,2.048035,49.134705,0.95,housenumber,3 Rue du Bois Quéris 95810 Grisy-les-Plâtres,95287_0069_00003,G,3 RUE DU BOIS QUERIS,
344272752,00017,34427275200017,O,,NN,,,2019-11-14T14:01:05,true,1,,25,,RUE,DU GENERAL DE GAULLE,95810,GRISY-LES-PLATRES,,,95287,,,,,,,,,,,,,,,,,,,1992-08-10,F,,,,,51.3A,NAF1993,N,2.049075,49.132138,0.95,housenumber,25 Rue du Général de Gaulle 95810 Grisy-les-Plâtres,95287_0130_00025,G,25 RUE DU GENERAL DE GAULLE,
344381744,00012,34438174400012,O,1988-02-01,NN,,,2019-11-14T14:01:05,true,3,,25,,RUE,DU GAL DE GAULLE,95810,GRISY-LES-PLATRES,,,95287,,,,,,,,,,,,,,,,,,,2008-01-01,A,,,,,68.20B,NAFRev2,N,2.049075,49.132138,0.91,housenumber,25 Rue du Général de Gaulle 95810 Grisy-les-Plâtres,95287_0130_00025,G,25 RUE DU GENERAL DE GAULLE,
344478565,00023,34447856500023,O,1996-03-20,NN,,,2019-11-14T14:01:05,false,4,,3,,RUE,DE BERVAL,95810,GRISY-LES-PLATRES,,,95287,,,,,,,,,,,,,,,,,,,2008-07-25,F,,,,,68.20B,NAFRev2,N,2.050225,49.132458,0.95,housenumber,3 Rue de Berval 95810 Grisy-les-Plâtres,95287_0111_00003,G,3 RUE DE BERVAL,
344608369,00031,34460836900031,O,2011-03-15,,,,2021-02-23T10:59:35,true,1,,14,,RUE,DES MAUROIS,95810,GRISY-LES-PLATRES,,,95287,,,,,,,,,,,,,,,,,,,2011-03-15,A,,,,,81.30Z,NAFRev2,N,2.054769,49.13115,0.94,housenumber,14 Rue des Maurois 95810 Grisy-les-Plâtres,95287_0158_00014,G,14 RUE DES MAUROIS,
344972609,00012,34497260900012,O,,NN,,,2019-11-14T14:01:05,true,1,,1,,RUE,DES MAUROIS,95810,GRISY-LES-PLATRES,,,95287,,,,,,,,,,,,,,,,,,,1993-12-20,F,,,,,28.5D,NAF1993,N,2.053423,49.130716,0.94,housenumber,1 Rue des Maurois 95810 Grisy-les-Plâtres,95287_0158_00001,G,1 RUE DES MAUROIS,
347382863,00012,34738286300012,O,,NN,,,2019-11-14T14:01:05,true,1,,10,,RUE,DE L ISLE,95810,GRISY-LES-PLATRES,,,95287,,,,,,,,,,,,,,,,,,,1988-07-31,F,,,,,64.44,NAP,N,2.049925,49.133998,0.95,housenumber,10 Rue de l’Isle 95810 Grisy-les-Plâtres,95287_0139_00010,G,10 RUE DE L ISLE,
347573313,00017,34757331300017,O,1900-01-01,NN,,,2019-11-14T14:01:05,false,4,,13,,RUE,DU VEXIN,95810,GRISY-LES-PLATRES,,,95287,,,,,,,,,,,,,,,,,,,1992-06-26,F,,,,,45.3A,NAF1993,N,2.050608,49.131878,0.95,housenumber,13 Rue du Vexin 95810 Grisy-les-Plâtres,95287_0194_00013,G,13 RUE DU VEXIN,
347573313,00025,34757331300025,O,2002-07-09,NN,,,2019-11-14T14:01:05,false,8,,3,,PL,DU SOLEIL LEVANT,95810,GRISY-LES-PLATRES,,,95287,,,,,,,,,,,,,,,,,,,2007-11-16,F,,,,,45.3A,NAFRev1,O,2.048736,49.132421,0.86,housenumber,3 Place du Soleil Levant 95810 Grisy-les-Plâtres,95287_0200_00003,G,3 PLACE DU SOLEIL LEVANT,
348106576,00039,34810657600039,O,2015-05-02,,,,2019-11-14T14:01:05,true,2,,2,B,RUE,GENERAL DE GAULLE,95810,GRISY-LES-PLATRES,,,95287,,,,,,,,,,,,,,,,,,,2015-12-31,F,,,,,71.12B,NAFRev2,N,2.047827,49.128542,0.94,housenumber,2b Rue du Général de Gaulle 95810 Grisy-les-Plâtres,95287_0130_00002_b,G,2B RUE DU GENERAL DE GAULLE,
348866880,00019,34886688000019,O,1988-11-16,NN,,,2019-11-14T14:01:05,true,3,FERME DU CHATEAU,,,RTE,DE BEAUVAIS,95810,GRISY-LES-PLATRES,,,95287,,,,,,,,,,,,,,,,,,,2008-01-01,A,,,,,68.20B,NAFRev2,N,2.051014,49.134011,0.39,street,Rue de Berval 95810 Grisy-les-Plâtres,95287_0111,G,RUE DE BERVAL,
348971375,00012,34897137500012,O,,,,,2019-11-14T14:01:05,true,1,,25,,RUE,DU GAL DE GAULLE,95810,GRISY-LES-PLATRES,,,95287,,,,,,,,,,,,,,,,,,,1989-12-31,F,,,,,64.11,NAP,N,2.049075,49.132138,0.91,housenumber,25 Rue du Général de Gaulle 95810 Grisy-les-Plâtres,95287_0130_00025,G,25 RUE DU GENERAL DE GAULLE,
349096842,00019,34909684200019,O,1988-11-16,NN,,,2019-11-14T14:01:05,true,3,FERME DU CHATEAU,,,,ROUTE DE BEAUVAIS,95810,GRISY-LES-PLATRES,,,95287,,,,,,,,,,,,,,,,,,,2008-01-01,A,,,,,68.20B,NAFRev2,N,2.056045,49.130789,0.48,locality,Route de l’Isle Adam 95810 Grisy-les-Plâtres,95287_0140,G,ROUTE DE L ISLE ADAM,
349388256,00027,34938825600027,O,1989-11-01,NN,,,2019-11-14T14:01:05,true,6,,1,B,RUE,DE CORMEILLES,95810,GRISY-LES-PLATRES,,,95287,,,,,,,,,,,,,,,,,,,2008-01-01,F,,,,,68.20B,NAFRev2,N,2.045515,49.129368,0.86,housenumber,1bis Rue de Cormeilles 95810 Grisy-les-Plâtres,95287_0105_00001_bis,G,1BIS RUE DE CORMEILLES,
349902163,00014,34990216300014,O,1989-01-01,NN,,,2019-11-14T14:01:05,true,3,EPIAIS RHUS,10,,,CHANTEREINES,95810,GRISY-LES-PLATRES,,,95287,,,,,,,,,,,,,,,,,,,2008-01-01,A,,,,,01.11Z,NAFRev2,N,2.048303,49.131659,0.31,street,Impasse du Château 95810 Grisy-les-Plâtres,95287_0090,G,IMPASSE DU CHATEAU,
351284948,00012,35128494800012,O,1989-05-12,NN,,,2019-11-14T14:01:05,true,3,,13,,RUE,BUTEL,95810,GRISY-LES-PLATRES,,,95287,,,,,,,,,,,,,,,,,,,2008-01-01,A,,,,,01.19Z,NAFRev2,N,2.050895,49.128199,0.93,housenumber,13 Rue de Butel 95810 Grisy-les-Plâtres,95287_0101_00013,G,13 RUE DE BUTEL,
353135593,00013,35313559300013,O,1990-01-01,NN,,,2019-11-14T14:01:05,true,5,,7,,PL,DU SOLEIL LEVANT,95810,GRISY-LES-PLATRES,,,95287,,,,,,,,,,,,,,,,,,,2008-10-24,F,,,,,68.31Z,NAFRev2,O,2.049137,49.132535,0.86,housenumber,7 Place du Soleil Levant 95810 Grisy-les-Plâtres,95287_0200_00007,G,7 PLACE DU SOLEIL LEVANT,
353337900,00016,35333790000016,O,1990-01-01,NN,,,2020-02-07T03:59:29,true,4,,2,,RUE,DU GENERAL DE GAULLE,95810,GRISY-LES-PLATRES,,,95287,,,,,,,,,,,,,,,,,,,2019-12-20,F,,,,,68.20B,NAFRev2,N,2.047595,49.127096,0.95,housenumber,2 Rue du Général de Gaulle 95810 Grisy-les-Plâtres,95287_0130_00002,G,2 RUE DU GENERAL DE GAULLE,
353796741,00075,35379674100075,O,2018-07-01,03,2020,4120AZ,2022-08-29T09:04:13,true,1,,34,,RUE,DE L ISLE,95810,GRISY-LES-PLATRES,,,95287,,,,,,,,,,,,,,,,,,,2018-07-01,A,,,,SAP,41.20A,NAFRev2,O,2.052223,49.132721,0.95,housenumber,34 Rue de l’Isle 95810 Grisy-les-Plâtres,95287_0139_00034,G,34 RUE DE L ISLE,
354040792,00013,35404079200013,O,1990-03-01,NN,,,2019-11-14T14:01:05,true,3,,3,,PL,DU SOLEIL LEVANT,95810,GRISY-LES-PLATRES,,,95287,,,,,,,,,,,,,,,,,,,2008-01-01,A,,,,,68.20B,NAFRev2,N,2.048736,49.132421,0.86,housenumber,3 Place du Soleil Levant 95810 Grisy-les-Plâtres,95287_0200_00003,G,3 PLACE DU SOLEIL LEVANT,
354048258,00017,35404825800017,O,1990-01-01,NN,,,2019-11-14T14:01:05,true,5,,8,,RUE,DU VEXIN,95810,GRISY-LES-PLATRES,,,95287,,,,,,,,,,,,,,,,,,,2011-03-31,F,,,,,43.91B,NAFRev2,O,2.050791,49.131678,0.95,housenumber,8 Rue du Vexin 95810 Grisy-les-Plâtres,95287_0194_00008,G,8 RUE DU VEXIN,
356000117,05346,35600011705346,O,1991-01-01,NN,,,2019-11-14T14:01:05,false,4,,12,,RUE,MACHY,95810,GRISY-LES-PLATRES,,,95287,,,,,,,,,,,,,,,,,,,2009-03-18,F,BUREAU DE POSTE,,,,53.10Z,NAFRev2,O,2.050744,49.130673,0.87,housenumber,12 Rue Robert Machy 95810 Grisy-les-Plâtres,95287_0178_00012,G,12 RUE ROBERT MACHY,
356000117,31623,35600011731623,O,2004-12-13,,,,2019-11-14T14:01:05,false,3,,12,,RUE,ROBERT MACHY,95810,GRISY-LES-PLATRES,,,95287,,,,,,,,,,,,,,,,,,,2005-10-31,F,CENTRE COURRIER 2,,,,64.1A,NAFRev1,N,2.050744,49.130673,0.95,housenumber,12 Rue Robert Machy 95810 Grisy-les-Plâtres,95287_0178_00012,G,12 RUE ROBERT MACHY,