siren,nic,siret,statutDiffusionEtablissement,dateCreationEtablissement,trancheEffectifsEtablissement,anneeEffectifsEtablissement,activitePrincipaleRegistreMetiersEtablissement,dateDernierTraitementEtablissement,etablissementSiege,nombrePeriodesEtablissement,complementAdresseEtablissement,numeroVoieEtablissement,indiceRepetitionEtablissement,typeVoieEtablissement,libelleVoieEtablissement,codePostalEtablissement,libelleCommuneEtablissement,libelleCommuneEtrangerEtablissement,distributionSpecialeEtablissement,codeCommuneEtablissement,codeCedexEtablissement,libelleCedexEtablissement,codePaysEtrangerEtablissement,libellePaysEtrangerEtablissement,complementAdresse2Etablissement,numeroVoie2Etablissement,indiceRepetition2Etablissement,typeVoie2Etablissement,libelleVoie2Etablissement,codePostal2Etablissement,libelleCommune2Etablissement,libelleCommuneEtranger2Etablissement,distributionSpeciale2Etablissement,codeCommune2Etablissement,codeCedex2Etablissement,libelleCedex2Etablissement,codePaysEtranger2Etablissement,libellePaysEtranger2Etablissement,dateDebut,etatAdministratifEtablissement,enseigne1Etablissement,enseigne2Etablissement,enseigne3Etablissement,denominationUsuelleEtablissement,activitePrincipaleEtablissement,nomenclatureActivitePrincipaleEtablissement,caractereEmployeurEtablissement,longitude,latitude,geo_score,geo_type,geo_adresse,geo_id,geo_ligne,geo_l4,geo_l5
211200399,00015,21120039900015,O,1983-03-01,03,2020,,2022-08-29T09:05:56,true,4,,,,PL,ST JACQUES,12360,BRUSQUE,,,12039,,,,,,,,,,,,,,,,,,,2008-01-01,A,MAIRIE,,,,84.11Z,NAFRev2,O,2.949439,43.767105,0.68,street,Place Saint Jacques 12360 Brusque,12039_0121,G,PLACE SAINT JACQUES,
211200399,00023,21120039900023,O,1983-12-21,01,2020,,2022-08-29T09:05:56,false,3,,,,,,12360,BRUSQUE,,,12039,,,,,,,,,,,,,,,,,,,2008-01-01,A,ECOLE PRIMAIRE PUBLIQUE,,,,85.20Z,NAFRev2,N,,,0,,,,,,
211200399,00031,21120039900031,O,1997-01-01,NN,,,2006-10-26T23:40:14,false,3,,,,,LE BOURG,12360,BRUSQUE,,,12039,,,,,,,,,,,,,,,,,,,2005-02-05,F,ATELIER RELAIS STATION SERVICE,,,,70.2C,NAFRev1,N,2.949241,43.767407,0.51,locality,Rue Gaston Bourguet 12360 Brusque,12039_0020,G,RUE GASTON BOURGUET,
211200399,00049,21120039900049,O,1997-01-01,NN,,,2008-01-04T18:25:53,false,3,MAIRIE,,,,,12360,BRUSQUE,,,12039,,,,,,,,,,,,,,,,,,,2008-01-01,A,SERVICE EAU ET ASSAINISSEMENT,,,,36.00Z,NAFRev2,N,2.948544,43.767465,0.38,street,Rue de la Coordonnerie 12360 Brusque,12039_0046,D,RUE DE LA COORDONNERIE,
211200399,00056,21120039900056,O,2003-05-01,NN,,,2008-01-04T18:25:53,false,3,,,,RTE,ARNAC,12360,BRUSQUE,,,12039,,,,,,,,,,,,,,,,,,,2008-01-01,A,CAMPING MUNICIPAL DU DOURDOU,,,,55.30Z,NAFRev2,N,2.952025,43.760685,0.66,street,Route d’Arnac 12360 Brusque,12039_0005,G,ROUTE D ARNAC,
261201644,00018,26120164400018,O,1984-10-01,NN,,,2016-07-23T12:31:26,true,4,,,,,MAIRIE,12360,BRUSQUE,,,12039,,,,,,,,,,,,,,,,,,,2016-01-01,F,CCAS,,,,88.99B,NAFRev2,N,3.0709671,50.6304695,0.92,poi.townhall,Hôtel de Ville Lille,https://osm.org/way/40917078,G,,
300211117,00019,30021111700019,O,,NN,,,,true,1,,,,,,12360,BRUSQUE,,,12039,,,,,,,,,,,,,,,,,,,1988-12-31,F,,,,,57.08,NAP,N,,,0,,,,,,
300255304,00010,30025530400010,O,1974-01-01,NN,,,2008-12-06T05:01:16,true,4,,,,AV,DE CAMARES,12360,BRUSQUE,,,12039,,,,,,,,,,,,,,,,,,,2008-01-01,A,,,,,43.22B,NAFRev2,N,2.945666,43.77264,0.73,street,Route de Camares. 12360 Brusque,12039_0030,G,ROUTE DE CAMARES ,
300270451,00051,30027045100051,O,1995-01-01,NN,,,2014-07-08T00:10:46,false,5,,,,,PENSIONNAT ST THOMAS,12360,BRUSQUE,,,12039,,,,,,,,,,,,,,,,,,,2011-06-30,F,,,,,96.02A,NAFRev2,O,2.950836,43.766935,0.37,street,Route de Saint-Thomas 12360 Brusque,12039_0018,G,ROUTE DE SAINT THOMAS,
300318334,00012,30031833400012,O,,,,,,true,1,,,,,,12360,BRUSQUE,,,12039,,,,,,,,,,,,,,,,,,,,F,,,,,55.71,NAP,N,,,0,,,,,,
303326508,00023,30332650800023,O,1987-01-01,NN,,,,false,3,,,,PL,DE LA POSTE,12360,BRUSQUE,,,12039,,,,,,,,,,,,,,,,,,,1996-06-30,F,BOUCHERIE CHARCUTERIE,,,,52.2C,NAF1993,N,2.950184,43.767185,0.82,street,Place de la Poste 12360 Brusque,12039_0100,G,PLACE DE LA POSTE,
304105703,00017,30410570300017,O,,NN,,,,true,1,,,,,,12360,BRUSQUE,,,12039,,,,,,,,,,,,,,,,,,,1984-12-31,F,,,,,55.73,NAP,N,,,0,,,,,,
305039265,00015,30503926500015,O,1964-01-01,NN,,,,true,1,,,,,,12360,BRUSQUE,,,12039,,,,,,,,,,,,,,,,,,,1999-09-30,F,,,,,45.4C,NAF1993,O,,,0,,,,,,
309006203,00017,30900620300017,O,1976-01-01,NN,,,2008-11-07T00:23:41,true,4,,,,PL,DE LA BASCULE,12360,BRUSQUE,,,12039,,,,,,,,,,,,,,,,,,,2003-06-30,F,,,,,45.3A,NAFRev1,N,2.923723,43.752383,0.45,street,Chemin de la Barraque 12360 Brusque,12039_jqn8vi,G,CHEMIN DE LA BARRAQUE,
309006211,00010,30900621100010,O,1976-01-01,NN,,,,true,1,,,,PL,DE LA BASCULE,12360,BRUSQUE,,,12039,,,,,,,,,,,,,,,,,,,1999-12-31,F,,,,,45.3A,NAF1993,N,2.923723,43.752383,0.45,street,Chemin de la Barraque 12360 Brusque,12039_jqn8vi,G,CHEMIN DE LA BARRAQUE,
312035157,00014,31203515700014,O,,,,,,true,1,,,,PL,DE LA BASCULE,12360,BRUSQUE,,,12039,,,,,,,,,,,,,,,,,,,1991-01-15,F,,,,,20.1A,NAF1993,N,2.923723,43.752383,0.45,street,Chemin de la Barraque 12360 Brusque,12039_jqn8vi,G,CHEMIN DE LA BARRAQUE,
316896760,00014,31689676000014,O,,,,,,true,1,,,,RTE,DE CAMARES,12360,BRUSQUE,,,12039,,,,,,,,,,,,,,,,,,,1984-12-25,F,,,,,55.72,NAP,N,2.945666,43.77264,0.82,street,Route de Camares. 12360 Brusque,12039_0030,G,ROUTE DE CAMARES ,
320181696,00016,32018169600016,O,,NN,,,,true,1,,,,,,12360,BRUSQUE,,,12039,,,,,,,,,,,,,,,,,,,,F,,,,,47.01,NAP,N,,,0,,,,,,
320761315,00011,32076131500011,O,1981-01-01,NN,,,2006-10-27T01:10:36,true,3,,,,RTE,CAMARES,12360,BRUSQUE,,,12039,,,,,,,,,,,,,,,,,,,2005-06-10,F,,,,,70.2C,NAFRev1,N,2.945666,43.77264,0.78,street,Route de Camares. 12360 Brusque,12039_0030,G,ROUTE DE CAMARES ,
320828205,00015,32082820500015,O,,NN,,,,true,1,,,,,,12360,BRUSQUE,,,12039,,,,,,,,,,,,,,,,,,,1988-12-31,F,,,,,62.11,NAP,N,,,0,,,,,,
321714255,00015,32171425500015,O,1981-01-20,NN,,,2008-04-05T00:21:38,true,3,,,,,MAIRIE,12360,BRUSQUE,,,12039,,,,,,,,,,,,,,,,,,,2008-01-01,A,,,,,02.40Z,NAFRev2,N,3.0709671,50.6304695,0.92,poi.townhall,Hôtel de Ville Lille,https://osm.org/way/40917078,G,,
321764482,00014,32176448200014,O,,,,,,true,1,,,,,,12360,BRUSQUE,,,12039,,,,,,,,,,,,,,,,,,,1985-12-25,F,,,,,00.20,NAP,N,,,0,,,,,,
325207348,00021,32520734800021,O,2002-07-01,NN,,,2014-07-08T00:29:47,false,4,,,,,,12360,BRUSQUE,,,12039,,,,,,,,,,,,,,,,,,,2009-04-06,F,,,,,49.32Z,NAFRev2,N,,,0,,,,,,
325571149,00021,32557114900021,O,1995-03-06,,,,,true,1,,,,AV,DU MIDI,12360,BRUSQUE,,,12039,,,,,,,,,,,,,,,,,,,2000-08-26,F,,,,,85.1C,NAF1993,N,2.949861,43.769534,0.77,street,Avenue du Midi 12360 Brusque,12039_0093,G,AVENUE DU MIDI,
325818797,00038,32581879700038,O,2013-09-01,,,,2017-12-12T04:43:49,false,2,,,,,CUSSES,12360,BRUSQUE,,,12039,,,,,,,,,,,,,,,,,,,2017-10-02,F,,,,,86.90E,NAFRev2,N,2.940213,43.790168,0.91,street,Chemin de Cusses 12360 Brusque,12039_gk8c7u,G,CHEMIN DE CUSSES,
326121605,00033,32612160500033,O,2018-05-15,00,2020,,2022-08-29T09:19:10,true,2,,,,PL,DE LA POSTE,12360,BRUSQUE,,,12039,,,,,,,,,,,,,,,,,,,2018-08-02,A,LA TABLE DE TONTON,,,LA TABLE DE TONTON,56.10A,NAFRev2,O,2.950184,43.767185,0.82,street,Place de la Poste 12360 Brusque,12039_0100,G,PLACE DE LA POSTE,
326125275,00015,32612527500015,O,1982-10-18,,,,,true,3,,,,,,12360,BRUSQUE,,,12039,,,,,,,,,,,,,,,,,,,1991-12-25,F,,,,,47.01,NAP,N,,,0,,,,,,
327218707,00013,32721870700013,O,1983-05-05,02,2020,,2022-08-29T09:19:42,true,4,BRUSQUE,,,RTE,DE CAMARES,12360,BRUSQUE,,,12039,,,,,,,,,,,,,,,,,,,2008-01-01,A,,,,,08.12Z,NAFRev2,O,2.945666,43.77264,0.82,street,Route de Camares. 12360 Brusque,12039_0030,G,ROUTE DE CAMARES ,
327425120,00018,32742512000018,O,,NN,,,,true,1,,,,,,12360,BRUSQUE,,,12039,,,,,,,,,,,,,,,,,,,1994-01-14,F,,,,,29.3C,NAF1993,O,,,0,,,,,,
327437901,00017,32743790100017,O,1983-05-31,,,,2008-11-07T00:45:04,true,4,,,,RTE,D ARNAC,12360,BRUSQUE,,,12039,,,,,,,,,,,,,,,,,,,2004-03-31,F,,,,,55.1A,NAFRev1,N,2.952025,43.760685,0.78,street,Route d’Arnac 12360 Brusque,12039_0005,G,ROUTE D ARNAC,
327437901,00033,32743790100033,O,1994-07-01,NN,,,2006-11-25T10:04:56,false,3,,,,,VILLAGE,12360,BRUSQUE,,,12039,,,,,,,,,,,,,,,,,,,2004-03-31,F,,,,,52.2P,NAFRev1,O,2.951221,43.767004,0.34,street,Chemin de la Côte Vieille 12360 Brusque,12039_z3to2d,G,CHEMIN DE LA COTE VIEILLE,
327439980,00019,32743998000019,O,1983-04-29,NN,,,,true,1,,,,LD,PRADMOS - RTE D'ARNAC,12360,BRUSQUE,,,12039,,,,,,,,,,,,,,,,,,,2001-03-31,F,,,,,70.2C,NAF1993,N,2.952025,43.760685,0.51,street,Route d’Arnac 12360 Brusque,12039_0005,G,ROUTE D ARNAC,
327439998,00011,32743999800011,O,1983-04-29,,,,2006-11-25T10:04:57,true,1,,,,LD,PRADMOS - RTE D'ARNAC,12360,BRUSQUE,,,12039,,,,,,,,,,,,,,,,,,,2002-07-01,F,,,,,74.1J,NAF1993,N,2.952025,43.760685,0.51,street,Route d’Arnac 12360 Brusque,12039_0005,G,ROUTE D ARNAC,
327440004,00015,32744000400015,O,1983-04-29,NN,,,,true,1,,,,LD,PRADMOS - RTE D'ARNAC,12360,BRUSQUE,,,12039,,,,,,,,,,,,,,,,,,,2001-03-31,F,,,,,70.2C,NAF1993,N,2.952025,43.760685,0.51,street,Route d’Arnac 12360 Brusque,12039_0005,G,ROUTE D ARNAC,
328230693,00017,32823069300017,O,1983-10-11,NN,,,2022-06-11T03:49:02,true,3,,,,LD,LAPRADE,12360,BRUSQUE,,,12039,,,,,,,,,,,,,,,,,,,2008-01-01,A,,,,,68.20B,NAFRev2,N,2.949816,43.76605,0.34,street,Route du Pradinas 12360 Brusque,12039_0110,G,ROUTE DU PRADINAS,
328558135,00013,32855813500013,O,1983-11-01,NN,,,2021-09-28T10:01:17,false,3,,,,LD,LA PRADE,12360,BRUSQUE,,,12039,,,,,,,,,,,,,,,,,,,2008-01-01,A,,,,,03.22Z,NAFRev2,N,2.94891,43.767161,0.51,street,Rue de la Poterne 12360 Brusque,12039_0102,G,RUE DE LA POTERNE,
331254771,00016,33125477100016,O,,,,,,true,1,,,,,,12360,BRUSQUE,,,12039,,,,,,,,,,,,,,,,,,,1992-09-30,F,,,,,15.8C,NAF1993,N,,,0,,,,,,
332164003,00011,33216400300011,O,1984-07-01,NN,,,2021-07-08T03:42:35,true,4,,,,,LABARRAQUE,12360,BRUSQUE,,,12039,,,,,,,,,,,,,,,,,,,2021-06-15,F,,,,,01.45Z,NAFRev2,N,2.923723,43.752383,0.76,street,Chemin de la Barraque 12360 Brusque,12039_jqn8vi,G,CHEMIN DE LA BARRAQUE,
332704550,00034,33270455000034,O,1998-11-02,NN,,,2018-08-24T12:34:40,false,4,,,,RTE,DE CAMARES,12360,BRUSQUE,,,12039,,,,,,,,,,,,,,,,,,,2009-04-30,F,,,,,45.20A,NAFRev2,N,2.945666,43.77264,0.82,street,Route de Camares. 12360 Brusque,12039_0030,G,ROUTE DE CAMARES ,
333886653,00018,33388665300018,O,,NN,,,,true,1,,,,,CRIBAS,12360,BRUSQUE,,,12039,,,,,,,,,,,,,,,,,,,1988-08-30,F,,,,,62.46,NAP,N,2.925549,43.761359,0.91,locality,Cribas le Bas 12360 Brusque,12039_B061,G,CRIBAS LE BAS,
334202124,00015,33420212400015,O,,,,,2006-11-25T10:25:17,true,1,,,,,,12360,BRUSQUE,,,12039,,,,,,,,,,,,,,,,,,,1989-06-15,F,,,,,92.12,NAP,N,,,0,,,,,,
334318649,00012,33431864900012,O,,,,,,true,1,,,,RTE,D'ARNAC,12360,BRUSQUE,,,12039,,,,,,,,,,,,,,,,,,,1987-07-29,F,,,,,06.01,NAP,N,2.952025,43.760685,0.78,street,Route d’Arnac 12360 Brusque,12039_0005,G,ROUTE D ARNAC,
334397296,00016,33439729600016,O,1986-01-02,12,2020,,2022-08-29T09:23:46,true,4,,,,,,12360,BRUSQUE,,,12039,,,,,,,,,,,,,,,,,,,2008-01-01,A,,,,,87.10A,NAFRev2,O,,,0,,,,,,
334712072,00050,33471207200050,O,2000-09-15,NN,,,2006-10-27T02:40:11,false,3,,,,AV,DU MIDI,12360,BRUSQUE,,,12039,,,,,,,,,,,,,,,,,,,2004-12-31,F,,,,,85.1C,NAFRev1,N,2.949861,43.769534,0.77,street,Avenue du Midi 12360 Brusque,12039_0093,G,AVENUE DU MIDI,
342087889,00057,34208788900057,O,2003-01-10,02,2020,,2022-08-29T09:27:24,false,5,,,,,PANORAMA ST THOMAS,12360,BRUSQUE,,,12039,,,,,,,,,,,,,,,,,,,2022-02-06,F,,,,,13.99Z,NAFRev2,O,2.950836,43.766935,0.41,street,Route de Saint-Thomas 12360 Brusque,12039_0018,G,ROUTE DE SAINT THOMAS,
342276128,00010,34227612800010,O,1987-07-29,NN,,,,true,1,,,,RTE,D'ARNAC,12360,BRUSQUE,,,12039,,,,,,,,,,,,,,,,,,,2002-04-11,F,,,,,40.1Z,NAF1993,O,2.952025,43.760685,0.78,street,Route d’Arnac 12360 Brusque,12039_0005,G,ROUTE D ARNAC,
343095352,00021,34309535200021,O,,NN,,,,true,1,,,,PL,DE LA POSTE,12360,BRUSQUE,,,12039,,,,,,,,,,,,,,,,,,,1996-12-31,F,,,,,52.2C,NAF1993,N,2.950184,43.767185,0.82,street,Place de la Poste 12360 Brusque,12039_0100,G,PLACE DE LA POSTE,
343649851,00064,34364985100064,O,2018-11-01,,,,2020-04-02T19:32:02,true,2,,,,,CUSSES,12360,BRUSQUE,,,12039,,,,,,,,,,,,,,,,,,,2020-01-10,F,,,,,32.99Z,NAFRev2,N,2.940213,43.790168,0.91,street,Chemin de Cusses 12360 Brusque,12039_gk8c7u,G,CHEMIN DE CUSSES,
345313126,00046,34531312600046,O,2015-11-01,,,,2017-05-12T19:30:18,false,2,,1,,RUE,DU CASTHELAT,12360,BRUSQUE,,,12039,,,,,,,,,,,,,,,,,,,2017-03-31,F,,,,,43.21A,NAFRev2,N,2.949281,43.76766,0.75,housenumber,1 Rue du Castellat. 12360 Brusque,12039_0040_00001,G,1 RUE DU CASTELLAT ,
347594640,00018,34759464000018,O,1988-07-01,NN,,,2018-01-30T11:42:14,false,4,,,,,,12360,BRUSQUE,,,12039,,,,,,,,,,,,,,,,,,,2008-01-01,F,,,,,46.31Z,NAFRev2,N,,,0,,,,,,
347648651,00011,34764865100011,O,1988-06-17,NN,,,2020-11-06T07:59:54,false,4,,,,,,12360,BRUSQUE,,,12039,,,,,,,,,,,,,,,,,,,2020-11-01,F,,,,,68.20A,NAFRev2,N,,,0,,,,,,
348852112,00013,34885211200013,O,1988-09-01,NN,,,2010-04-30T05:23:07,true,4,,,,,LA REGAGNERIE,12360,BRUSQUE,,,12039,,,,,,,,,,,,,,,,,,,2010-02-28,F,,,,,01.41Z,NAFRev2,N,2.985637,43.781885,0.92,street,Chemin de la Regagnerie 12360 Brusque,12039_a7xb2j,G,CHEMIN DE LA REGAGNERIE,
349898205,00027,34989820500027,O,1999-09-27,NN,,,2009-02-12T08:24:05,true,3,,,,,CASTELNOUVEL,12360,BRUSQUE,,,12039,,,,,,,,,,,,,,,,,,,2007-12-31,F,,,,,80.4C,NAFRev1,N,2.937054,43.789158,0.91,street,Chemin de Castelnouvel 12360 Brusque,12039_rb1p0l,G,CHEMIN DE CASTELNOUVEL,
350134417,00012,35013441700012,O,1989-01-18,NN,,,2017-12-21T08:05:13,true,4,BRUSQUE,,,,,12360,BRUSQUE,,,12039,,,,,,,,,,,,,,,,,,,2016-09-30,F,,,,,68.20B,NAFRev2,N,2.951431,43.769312,0.93,municipality,Brusque,12039,D,BRUSQUE,
352710925,00012,35271092500012,O,1990-01-02,NN,,,2013-10-02T14:48:44,false,4,,,,,,12360,BRUSQUE,,,12039,,,,,,,,,,,,,,,,,,,2000-12-31,F,,,,,74.7Z,NAF1993,N,,,0,,,,,,
353060452,00029,35306045200029,O,1997-01-01,NN,,,2014-04-18T10:30:43,false,4,,,,AV,DE SAINT AFFRIQUE,12360,BRUSQUE,,,12039,,,,,,,,,,,,,,,,,,,2014-03-07,F,,,,,47.26Z,NAFRev2,N,2.950836,43.766935,0.51,street,Route de Saint-Thomas 12360 Brusque,12039_0018,G,ROUTE DE SAINT THOMAS,
356000000,56686,35600000056686,O,2012-01-01,NN,,,2018-09-29T12:05:00,false,2,,5170,,PL,DE LA POSTE,12360,BRUSQUE,,,12039,,,,,,,,,,,,,,,,,,,2014-01-10,A,LA POSTE,,,,53.10Z,NAFRev2,O,2.950184,43.767185,0.62,street,Place de la Poste 12360 Brusque,12039_0100,G,PLACE DE LA POSTE,
356000737,00516,35600073700516,O,1991-01-01,NN,,,2009-10-17T13:18:22,false,4,,,,PL,BASCULES,12360,BRUSQUE,,,12039,,,,,,,,,,,,,,,,,,,2009-03-18,F,BUREAU DE POSTE,,,,53.10Z,NAFRev2,O,-0.5918614,46.9429591,0.73,poi.common,Place de la Bascule (Terrains communaux) Nueil-les-Aubiers,https://osm.org/way/127093790,G,,
378274633,00015,37827463300015,O,,NN,,,,true,1,,,,,,12360,BRUSQUE,,,12039,,,,,,,,,,,,,,,,,,,1992-12-31,F,,,,,55.3A,NAF1993,N,,,0,,,,,,
380148601,00012,38014860100012,O,1990-11-06,NN,,,2008-01-04T21:38:44,true,3,,,,,,12360,BRUSQUE,,,12039,,,,,,,,,,,,,,,,,,,2008-01-01,A,,,,,94.99Z,NAFRev2,N,,,0,,,,,,
380906552,00027,38090655200027,O,2020-09-01,,,,2021-02-23T11:09:22,true,1,,,,,LE PONT VIEUX,12360,BRUSQUE,,,12039,,,,,,,,,,,,,,,,,,,2020-09-01,A,,,,,01.49Z,NAFRev2,N,2.945784,43.771286,0.73,locality,Rue du Pont Vieux 12360 Brusque,12039_0099,G,RUE DU PONT VIEUX,
383577558,00018,38357755800018,O,,NN,,,,true,1,,,,,,12360,BRUSQUE,,,12039,,,,,,,,,,,,,,,,,,,1994-06-13,F,,,,,18.2D,NAF1993,N,,,0,,,,,,
383639564,00012,38363956400012,O,1991-10-01,02,2020,,2022-08-29T09:10:40,true,4,,,,AV,DU MIDI,12360,BRUSQUE,,,12039,,,,,,,,,,,,,,,,,,,2008-01-01,A,MIDI PRIX,,,,47.11B,NAFRev2,O,2.949861,43.769534,0.77,street,Avenue du Midi 12360 Brusque,12039_0093,G,AVENUE DU MIDI,
387877566,00027,38787756600027,O,,NN,,,,true,1,,,,RUE,DE PRADINAS,12360,BRUSQUE,,,12039,,,,,,,,,,,,,,,,,,,1996-12-07,F,,,,,45.2B,NAF1993,N,2.950573,43.763521,0.76,street,Rue du Pradinas 12360 Brusque,12039_uzt084,G,RUE DU PRADINAS,
387904295,00046,38790429500046,O,2009-12-08,,,,2021-02-23T11:13:55,true,1,CRIBAS LE HAUT,,,,,12360,BRUSQUE,,,12039,,,,,,,,,,,,,,,,,,,2009-12-08,A,,,,,01.13Z,NAFRev2,N,2.922797,43.762156,0.93,locality,Cribas le Haut 12360 Brusque,12039_B062,D,CRIBAS LE HAUT,
387904295,00053,38790429500053,O,2016-06-01,,,,2021-02-23T11:13:55,false,1,,,,,CRIBAS HAUT,12360,BRUSQUE,,,12039,,,,,,,,,,,,,,,,,,,2016-06-01,A,,,,,43.32A,NAFRev2,N,2.922797,43.762156,0.85,locality,Cribas le Haut 12360 Brusque,12039_B062,G,CRIBAS LE HAUT,
388067076,00025,38806707600025,O,2021-12-13,,,,2022-08-18T03:52:56,true,1,,,,DOM,DE MAURISSOL,12360,BRUSQUE,,,12039,,,,,,,,,,,,,,,,,,,2021-12-13,A,,,,,68.20B,NAFRev2,N,2.95514,43.766493,0.71,street,Chemin de Maurissol 12360 Brusque,12039_ztu5o0,G,CHEMIN DE MAURISSOL,
388694705,00012,38869470500012,O,,NN,,,,true,1,,,,,PENSIONNAT ST THOMAS,12360,BRUSQUE,,,12039,,,,,,,,,,,,,,,,,,,1994-09-30,F,,,,,93.0D,NAF1993,O,2.950836,43.766935,0.37,street,Route de Saint-Thomas 12360 Brusque,12039_0018,G,ROUTE DE SAINT THOMAS,
389046244,00015,38904624400015,O,1992-10-01,NN,,,2008-11-08T00:50:09,false,4,,,,PL,DE LA POSTE,12360,BRUSQUE,,,12039,,,,,,,,,,,,,,,,,,,2001-08-31,F,,,,,15.8C,NAF1993,O,2.950184,43.767185,0.82,street,Place de la Poste 12360 Brusque,12039_0100,G,PLACE DE LA POSTE,
390449163,00018,39044916300018,O,1993-03-01,NN,,,2020-11-09T08:22:05,false,4,,,,,,12360,BRUSQUE,,,12039,,,,,,,,,,,,,,,,,,,2020-11-01,F,,,,,68.20A,NAFRev2,N,,,0,,,,,,
390621951,00016,39062195100016,O,1992-01-01,NN,,,,true,1,,,,AV,DU MIDI,12360,BRUSQUE,,,12039,,,,,,,,,,,,,,,,,,,2001-12-31,F,,,,,70.2C,NAF1993,N,2.949861,43.769534,0.77,street,Avenue du Midi 12360 Brusque,12039_0093,G,AVENUE DU MIDI,
392148177,00018,39214817700018,O,1993-07-01,NN,,,,true,1,,,,,SOUBRAS,12360,BRUSQUE,,,12039,,,,,,,,,,,,,,,,,,,1999-12-31,F,,,,,01.2A,NAF1993,N,2.980522,43.754839,0.91,street,Chemin de Soubras 12360 Brusque,12039_fa1g1g,G,CHEMIN DE SOUBRAS,
392516407,00013,39251640700013,O,1975-02-06,NN,,,2008-01-05T00:05:50,true,3,,,,,CASTELNOUVEL,12360,BRUSQUE,,,12039,,,,,,,,,,,,,,,,,,,2008-01-01,A,,,,,68.20A,NAFRev2,N,2.937054,43.789158,0.91,street,Chemin de Castelnouvel 12360 Brusque,12039_rb1p0l,G,CHEMIN DE CASTELNOUVEL,
392695425,00026,39269542500026,O,2006-07-01,,,,2008-11-08T00:56:47,true,3,,,,,CUSSETTE,12360,BRUSQUE,,,12039,,,,,,,,,,,,,,,,,,,2008-08-27,F,LA GRANGE AUX BONHEURS,,,,16.29Z,NAFRev2,N,2.940213,43.790168,0.51,street,Chemin de Cusses 12360 Brusque,12039_gk8c7u,G,CHEMIN DE CUSSES,
393127014,00024,39312701400024,O,2021-01-01,,,,2021-02-23T11:18:54,true,1,,,,,MAURISSOL,12360,BRUSQUE,,,12039,,,,,,,,,,,,,,,,,,,2021-01-01,A,,,,,01.45Z,NAFRev2,N,2.95514,43.766493,0.91,street,Chemin de Maurissol 12360 Brusque,12039_ztu5o0,G,CHEMIN DE MAURISSOL,
394331797,00057,39433179700057,O,2021-07-01,,,,2021-07-16T09:46:55,false,1,,,,,LAPRADE,12360,BRUSQUE,,,12039,,,,,,,,,,,,,,,,,,,2021-07-01,A,,,,,03.22Z,NAFRev2,N,2.949816,43.76605,0.34,street,Route du Pradinas 12360 Brusque,12039_0110,G,ROUTE DU PRADINAS,
394775068,00015,39477506800015,O,1994-04-01,NN,,,2014-07-08T01:24:03,true,5,,,,,,12360,BRUSQUE,,,12039,,,,,,,,,,,,,,,,,,,2011-04-21,F,,,,,43.99C,NAFRev2,O,,,0,,,,,,
395223894,00019,39522389400019,O,1994-05-18,NN,,,2009-02-25T15:52:37,true,4,,,,,,12360,BRUSQUE,,,12039,,,,,,,,,,,,,,,,,,,2002-12-31,F,,,,,18.2J,NAF1993,O,,,0,,,,,,
399801968,00021,39980196800021,O,2012-06-28,,,,2016-10-02T03:57:31,true,1,,,,RUE,SANTUS,12360,BRUSQUE,,,12039,,,,,,,,,,,,,,,,,,,2012-06-28,A,,,,,47.82Z,NAFRev2,N,2.947054,43.768173,0.68,locality,Rue du Sanctus 12360 Brusque,12039_0122,G,RUE DU SANCTUS,
399829563,00010,39982956300010,O,1995-01-01,NN,,,,true,1,,,,,MIALET,12360,BRUSQUE,,,12039,,,,,,,,,,,,,,,,,,,1999-06-30,F,,,,,01.2A,NAF1993,N,2.946132,43.771324,0.91,street,Chemin de Mialet 12360 Brusque,12039_666bvy,G,CHEMIN DE MIALET,
400070181,00013,40007018100013,O,1994-01-01,NN,,,2008-01-04T19:21:55,true,3,,,,,PRESSOUYRES,12360,BRUSQUE,,,12039,,,,,,,,,,,,,,,,,,,2008-01-01,A,,,,,01.45Z,NAFRev2,N,2.928963,43.749527,0.92,street,Chemin de Pressouyres 12360 Brusque,12039_hnen7m,G,CHEMIN DE PRESSOUYRES,
400070181,00021,40007018100021,O,1998-09-01,NN,,1610AQ,2015-03-17T00:43:35,false,3,,,,,PRESSOUYRES,12360,BRUSQUE,,,12039,,,,,,,,,,,,,,,,,,,2008-01-01,A,,,,,16.10A,NAFRev2,N,2.928963,43.749527,0.92,street,Chemin de Pressouyres 12360 Brusque,12039_hnen7m,G,CHEMIN DE PRESSOUYRES,
400695862,00013,40069586200013,O,1995-04-10,NN,,,,true,1,,,,RTE,DE CAMARES,12360,BRUSQUE,,,12039,,,,,,,,,,,,,,,,,,,1998-06-30,F,,,,,50.2Z,NAF1993,O,2.945666,43.77264,0.82,street,Route de Camares. 12360 Brusque,12039_0030,G,ROUTE DE CAMARES ,
400928099,00029,40092809900029,O,2002-04-11,NN,,,2008-01-04T19:37:43,false,3,,,,RTE,D'ARNAC,12360,BRUSQUE,,,12039,,,,,,,,,,,,,,,,,,,2008-01-01,A,,,,,35.11Z,NAFRev2,N,2.952025,43.760685,0.78,street,Route d’Arnac 12360 Brusque,12039_0005,G,ROUTE D ARNAC,
400946257,00013,40094625700013,O,1995-04-12,NN,,,,true,1,,,,,,12360,BRUSQUE,,,12039,,,,,,,,,,,,,,,,,,,2001-12-31,F,,,,,74.1J,NAF1993,N,,,0,,,,,,
402291165,00015,40229116500015,O,1995-09-18,NN,,,2006-10-28T03:05:05,false,3,,,,,,12360,BRUSQUE,,,12039,,,,,,,,,,,,,,,,,,,2004-03-12,F,,,,,74.1J,NAFRev1,N,,,0,,,,,,
403955560,00012,40395556000012,O,1971-01-01,NN,,,,true,3,,,,,,12360,BRUSQUE,,,12039,,,,,,,,,,,,,,,,,,,2003-07-29,F,,,,,01.3Z,NAFRev1,N,,,0,,,,,,
403955578,00014,40395557800014,O,1978-05-01,NN,,,,true,4,,,,,MOULERGUES BRUSQUES,12360,BRUSQUE,,,12039,,,,,,,,,,,,,,,,,,,2000-12-26,F,,,,,01.3Z,NAF1993,N,2.95807,43.77851,0.92,street,Chemin de Moulergues 12360 Brusque,12039_fzphpr,G,CHEMIN DE MOULERGUES,
403955586,00017,40395558600017,O,1980-04-01,NN,,,,true,4,,,,,LA BOUFFIE,12360,BRUSQUE,,,12039,,,,,,,,,,,,,,,,,,,2003-11-30,F,,,,,01.3Z,NAFRev1,N,2.925131,43.763502,0.42,street,Impasse de la Bergerie 12360 Brusque,12039_r7cw6n,G,IMPASSE DE LA BERGERIE,
403955594,00011,40395559400011,O,1982-07-30,NN,,,2021-02-23T11:28:15,true,4,,,,,LE TANAT,12360,BRUSQUE,,,12039,,,,,,,,,,,,,,,,,,,2009-03-01,A,,,,,68.20B,NAFRev2,N,2.953134,43.783745,0.61,street,Chemin du Tanat 12360 Brusque,12039_9mjv09,G,CHEMIN DU TANAT,
403955602,00012,40395560200012,O,1985-06-01,NN,,,,true,1,,,,,CRIBAS,12360,BRUSQUE,,,12039,,,,,,,,,,,,,,,,,,,2000-07-31,F,,,,,01.3Z,NAF1993,N,2.925549,43.761359,0.91,locality,Cribas le Bas 12360 Brusque,12039_B061,G,CRIBAS LE BAS,
403955610,00015,40395561000015,O,1992-01-01,NN,,,2012-04-29T05:09:40,true,5,BREONNE,,,,BREONNE,12360,BRUSQUE,,,12039,,,,,,,,,,,,,,,,,,,2012-04-01,A,,,,,01.45Z,NAFRev2,N,2.948544,43.767465,0.45,street,Rue de la Coordonnerie 12360 Brusque,12039_0046,G,RUE DE LA COORDONNERIE,
407500891,00046,40750089100046,O,2000-09-15,NN,,,2006-10-28T03:28:31,false,3,,,,AV,DU MIDI,12360,BRUSQUE,,,12039,,,,,,,,,,,,,,,,,,,2004-12-31,F,SCP VERAN PELORJAS,,,,85.1C,NAFRev1,N,2.949861,43.769534,0.77,street,Avenue du Midi 12360 Brusque,12039_0093,G,AVENUE DU MIDI,
408458545,00014,40845854500014,O,1996-08-01,NN,,,,true,1,,,,,CUSSETTE,12360,BRUSQUE,,,12039,,,,,,,,,,,,,,,,,,,1996-09-20,F,,,,,55.3B,NAF1993,N,2.940213,43.790168,0.51,street,Chemin de Cusses 12360 Brusque,12039_gk8c7u,G,CHEMIN DE CUSSES,
409448073,00018,40944807300018,O,1996-10-01,NN,,,2014-11-10T02:51:52,true,2,,,,,BROX,12360,BRUSQUE,,,12039,,,,,,,,,,,,,,,,,,,1997-02-01,F,,,,,,,,2.96502,43.7731,0.91,street,Chemin de Brox 12360 Brusque,12039_h3c49y,G,CHEMIN DE BROX,
411880198,00014,41188019800014,O,1997-04-01,NN,,,2006-11-25T15:33:34,false,3,,,,,,12360,BRUSQUE,,,12039,,,,,,,,,,,,,,,,,,,2004-03-12,F,,,,,74.1G,NAFRev1,N,,,0,,,,,,
412208795,00010,41220879500010,O,1997-04-01,NN,,,2014-09-22T03:37:53,true,4,,,,RTE,DE CAMARES,12360,BRUSQUE,,,12039,,,,,,,,,,,,,,,,,,,2013-09-01,F,,,,,68.20B,NAFRev2,N,2.945666,43.77264,0.82,street,Route de Camares. 12360 Brusque,12039_0030,G,ROUTE DE CAMARES ,
412327629,00017,41232762900017,O,,,,,,true,1,,,,,BROX,12360,BRUSQUE,,,12039,,,,,,,,,,,,,,,,,,,1997-10-11,F,,,,,85.3A,NAF1993,N,2.96502,43.7731,0.91,street,Chemin de Brox 12360 Brusque,12039_h3c49y,G,CHEMIN DE BROX,