siren,nic,siret,statutDiffusionEtablissement,dateCreationEtablissement,trancheEffectifsEtablissement,anneeEffectifsEtablissement,activitePrincipaleRegistreMetiersEtablissement,dateDernierTraitementEtablissement,etablissementSiege,nombrePeriodesEtablissement,complementAdresseEtablissement,numeroVoieEtablissement,indiceRepetitionEtablissement,typeVoieEtablissement,libelleVoieEtablissement,codePostalEtablissement,libelleCommuneEtablissement,libelleCommuneEtrangerEtablissement,distributionSpecialeEtablissement,codeCommuneEtablissement,codeCedexEtablissement,libelleCedexEtablissement,codePaysEtrangerEtablissement,libellePaysEtrangerEtablissement,complementAdresse2Etablissement,numeroVoie2Etablissement,indiceRepetition2Etablissement,typeVoie2Etablissement,libelleVoie2Etablissement,codePostal2Etablissement,libelleCommune2Etablissement,libelleCommuneEtranger2Etablissement,distributionSpeciale2Etablissement,codeCommune2Etablissement,codeCedex2Etablissement,libelleCedex2Etablissement,codePaysEtranger2Etablissement,libellePaysEtranger2Etablissement,dateDebut,etatAdministratifEtablissement,enseigne1Etablissement,enseigne2Etablissement,enseigne3Etablissement,denominationUsuelleEtablissement,activitePrincipaleEtablissement,nomenclatureActivitePrincipaleEtablissement,caractereEmployeurEtablissement,longitude,latitude,geo_score,geo_type,geo_adresse,geo_id,geo_ligne,geo_l4,geo_l5
211404538,00012,21140453800012,O,1983-03-01,02,2020,,2022-08-29T09:06:02,true,4,,,,,LE BOURG,14400,MOSLES,,,14453,,,,,,,,,,,,,,,,,,,2008-01-01,A,MAIRIE,,,,84.11Z,NAFRev2,O,-0.8223,49.310356,0.3,street,Le Lavoir 14400 Mosles,14453_4gmx5a,G,LE LAVOIR,
261405823,00012,26140582300012,O,1995-12-25,,,,2016-11-20T14:08:28,true,3,MAIRIE,,,,LE BOURG,14400,MOSLES,,,14453,,,,,,,,,,,,,,,,,,,2016-01-01,F,CCAS,,,,88.99B,NAFRev2,N,-0.8223,49.310356,0.3,street,Le Lavoir 14400 Mosles,14453_4gmx5a,G,LE LAVOIR,
306604356,00015,30660435600015,O,1900-01-01,NN,,,,true,3,LE BOURG,,,,,14400,MOSLES,,,14453,,,,,,,,,,,,,,,,,,,2000-12-31,F,,,,,01.2A,NAF1993,N,-0.8223,49.310356,0.3,street,Le Lavoir 14400 Mosles,14453_4gmx5a,D,LE LAVOIR,
307673491,00022,30767349100022,O,,NN,,,,true,1,,,,,,14400,MOSLES,,,14453,,,,,,,,,,,,,,,,,,,1987-05-21,F,,,,,55.72,NAP,N,,,0,,,,,,
317068567,00039,31706856700039,O,2020-01-01,,,,2021-12-03T10:25:09,true,2,,2,,,LA COUR SOUVERAINE,14400,MOSLES,,,14453,,,,,,,,,,,,,,,,,,,2021-12-31,F,,,,,01.19Z,NAFRev2,N,-0.826737,49.308113,0.89,housenumber,2 Rue de la Cour Souveraine 14400 Mosles,14453_0009_00002,G,2 RUE DE LA COUR SOUVERAINE,
318668266,00055,31866826600055,O,2015-03-01,01,2020,,2022-08-29T09:16:01,true,1,,,,LD,LE COURTELAY,14400,MOSLES,,,14453,,,,,,,,,,,,,,,,,,,2015-03-01,A,,,,,01.43Z,NAFRev2,O,-0.811145,49.296917,0.78,street,Impasse de Courtelay 14400 Mosles,14453_0010,G,IMPASSE DE COURTELAY,
323008367,00043,32300836700043,O,2010-03-01,,,,2021-02-23T10:46:30,false,1,LES FORGES,,,,RN 13 BOURG,14400,MOSLES,,,14453,,,,,,,,,,,,,,,,,,,2010-03-01,A,,,,,47.99B,NAFRev2,N,-0.819091,49.308023,0.4,street,Route des Forges 14400 Mosles,14453_0023,D,ROUTE DES FORGES,
324286681,00063,32428668100063,O,2005-12-25,,,,2008-04-10T09:25:03,true,2,,,,LD,FUMICHON,14400,MOSLES,,,14453,,,,,,,,,,,,,,,,,,,2006-12-31,F,,,,,92.6C,NAFRev1,N,-0.799751,49.306793,0.94,street,Fumichon 14400 Mosles,14453_ex1lyg,G,FUMICHON,
325447563,00025,32544756300025,O,2009-01-02,NN,,4399CZ,2016-04-26T02:46:42,true,2,,,,CHE,DU LAVOIR,14400,MOSLES,,,14453,,,,,,,,,,,,,,,,,,,2014-08-31,F,,,,,43.99C,NAFRev2,O,-0.821222,49.310086,0.74,street,Rue du Lavoir 14400 Mosles,14453_0027,G,RUE DU LAVOIR,
326134418,00036,32613441800036,O,2022-02-01,,,9602AA,2022-10-18T08:56:45,true,1,,10,,IMP,DE LA SAUSSAYE,14400,MOSLES,,,14453,,,,,,,,,,,,,,,,,,,2022-02-01,A,,,,,47.99B,NAFRev2,N,-0.803856,49.30693,0.86,housenumber,10 Impasse de la Saussaye 14400 Mosles,14453_0066_00010,G,10 IMPASSE DE LA SAUSSAYE,
327549937,00016,32754993700016,O,,NN,,,,true,1,,,,,,14400,MOSLES,,,14453,,,,,,,,,,,,,,,,,,,1990-01-18,F,,,,,45.3E,NAF1993,N,,,0,,,,,,
328256045,00019,32825604500019,O,,NN,,,,true,1,,,,LD,COURTELAY,14400,MOSLES,,,14453,,,,,,,,,,,,,,,,,,,1990-12-31,F,,,,,41.07,NAP,N,-0.810354,49.297048,0.94,street,Courtelay 14400 Mosles,14453_pral40,G,COURTELAY,
329058333,00017,32905833300017,O,1984-01-01,NN,,,2016-04-26T02:58:52,true,3,,,,,,14400,MOSLES,,,14453,,,,,,,,,,,,,,,,,,,2008-01-01,A,,,,,01.41Z,NAFRev2,N,,,0,,,,,,
329734701,00017,32973470100017,O,,NN,,,,true,1,,,,,,14400,MOSLES,,,14453,,,,,,,,,,,,,,,,,,,1994-07-01,F,,,,,01.2A,NAF1993,N,,,0,,,,,,
330027251,00025,33002725100025,O,1984-11-13,NN,,,,true,3,,,,,,14400,MOSLES,,,14453,,,,,,,,,,,,,,,,,,,1992-11-03,F,,,,,52.2A,NAF1993,N,,,0,,,,,,
340362037,00020,34036203700020,O,1992-04-01,NN,,,2007-05-19T09:59:09,true,4,,,,RTE,NATIONALE 13,14400,MOSLES,,,14453,,,,,,,,,,,,,,,,,,,2005-12-30,F,,,,,55.3A,NAFRev1,O,,,0,,,,,,
341563161,00015,34156316100015,O,,NN,,,,true,1,,,,,,14400,MOSLES,,,14453,,,,,,,,,,,,,,,,,,,1995-12-31,F,,,,,01.2A,NAF1993,N,,,0,,,,,,
341858900,00044,34185890000044,O,2015-07-01,,,,2021-02-23T10:57:30,true,1,,,,,RD 613,14400,MOSLES,,,14453,,,,,,,,,,,,,,,,,,,2015-07-01,A,,,,,73.11Z,NAFRev2,N,3.4565437,43.4768609,0.88,poi.bus_stop,Emb. RD 613 (Arrêt de bus) Aumes,https://osm.org/node/4977119284,G,,
344526835,00022,34452683500022,O,2003-05-01,NN,,,2020-10-02T04:03:15,true,4,,,,,LES FORGES,14400,MOSLES,,,14453,,,,,,,,,,,,,,,,,,,2020-10-31,F,,,,,47.78C,NAFRev2,N,-0.819091,49.308023,0.83,street,Route des Forges 14400 Mosles,14453_0023,G,ROUTE DES FORGES,
345303275,00050,34530327500050,O,2006-09-25,,,,2009-11-04T10:46:38,false,5,,,,,RN 13,14400,MOSLES,,,14453,,,,,,,,,,,,,,,,,,,2009-10-29,F,,,,,47.89Z,NAFRev2,N,,,0,,,,,,
350599437,00018,35059943700018,O,,,,,,true,1,,,,CHE,DE L'EGLISE,14400,MOSLES,,,14453,,,,,,,,,,,,,,,,,,,1990-03-20,F,,,,,67.01,NAP,N,-0.819601,49.310184,0.7,street,Quartier de l’Eglise 14400 Mosles,14453_1yusx0,G,QUARTIER DE L EGLISE,
353961931,00014,35396193100014,O,1990-05-01,,,,,true,4,,,,RUE,N 13,14400,MOSLES,,,14453,,,,,,,,,,,,,,,,,,,1992-12-25,F,,,,,55.3A,NAF1993,N,-0.822271,49.310512,0.42,street,Rue du Moulin du Danu 14400 Mosles,14453_0030,G,RUE DU MOULIN DU DANU,
377756465,00011,37775646500011,O,1990-03-21,NN,,,,true,3,,,,CHE,DE L'EGLISE,14400,MOSLES,,,14453,,,,,,,,,,,,,,,,,,,1994-12-25,F,,,,,55.3A,NAF1993,N,-0.819601,49.310184,0.7,street,Quartier de l’Eglise 14400 Mosles,14453_1yusx0,G,QUARTIER DE L EGLISE,
387640956,00018,38764095600018,O,1973-12-25,NN,,,2015-08-27T03:48:41,true,3,,,,,COURTELAY,14400,MOSLES,,,14453,,,,,,,,,,,,,,,,,,,2013-12-05,F,,,,,01.41Z,NAFRev2,N,-0.810354,49.297048,0.94,street,Courtelay 14400 Mosles,14453_pral40,G,COURTELAY,
390447639,00019,39044763900019,O,1993-02-05,NN,,,2018-11-21T20:07:45,true,3,,,,,LA GRAINNERIE,14400,MOSLES,,,14453,,,,,,,,,,,,,,,,,,,2008-01-01,A,,,,,01.42Z,NAFRev2,N,-0.8272,49.307321,0.35,street,Rue de la Cour Souveraine 14400 Mosles,14453_0009,G,RUE DE LA COUR SOUVERAINE,
390866093,00011,39086609300011,O,1993-04-13,,,,2013-06-18T10:46:26,true,3,,,,,FERME DE LA GRAINERIE,14400,MOSLES,,,14453,,,,,,,,,,,,,,,,,,,2008-01-01,A,,,,,68.20B,NAFRev2,N,,,0,,,,,,
391070851,00012,39107085100012,O,1993-04-08,NN,,,2020-06-26T19:32:27,true,6,RN 13,,,,LA COUR SOUVERAINE,14400,MOSLES,,,14453,,,,,,,,,,,,,,,,,,,2012-11-15,A,EUROSTORES,TOUT L'UNIVERS DES STORES,,EUROSTORES-TOUT L'UNIVERS DES STORES,46.49Z,NAFRev2,N,-0.8272,49.307321,0.93,street,Rue de la Cour Souveraine 14400 Mosles,14453_0009,G,RUE DE LA COUR SOUVERAINE,
391913878,00016,39191387800016,O,1900-01-01,,,,2011-04-28T00:56:31,false,3,,,,,,14400,MOSLES,,,14453,,,,,,,,,,,,,,,,,,,1993-12-25,F,,,,,01.1A,NAF1993,N,,,0,,,,,,
391913878,00024,39191387800024,O,1999-03-31,NN,,,2020-02-26T14:49:10,true,4,LA SAUSSAYE,,,,LA SAUSSAYE,14400,MOSLES,,,14453,,,,,,,,,,,,,,,,,,,2018-10-27,F,,,,,01.11Z,NAFRev2,N,-0.80486,49.30582,0.92,street,Impasse de la Saussaye 14400 Mosles,14453_0066,G,IMPASSE DE LA SAUSSAYE,
391917416,00011,39191741600011,O,1993-06-12,NN,,,2022-02-08T03:36:43,true,3,,,,,,14400,MOSLES,,,14453,,,,,,,,,,,,,,,,,,,2008-01-01,A,,,,,68.20B,NAFRev2,N,,,0,,,,,,
392536850,00010,39253685000010,O,1991-01-01,NN,,,2008-01-05T00:06:03,true,3,,,,,,14400,MOSLES,,,14453,,,,,,,,,,,,,,,,,,,2008-01-01,A,,,,,94.91Z,NAFRev2,N,,,0,,,,,,
393466628,00012,39346662800012,O,1993-12-01,NN,,,2012-06-26T15:06:38,true,5,,,,,LA SAUSSAYE,14400,MOSLES,,,14453,,,,,,,,,,,,,,,,,,,2012-06-25,F,,,,,68.20B,NAFRev2,N,-0.80486,49.30582,0.92,street,Impasse de la Saussaye 14400 Mosles,14453_0066,G,IMPASSE DE LA SAUSSAYE,
393546593,00012,39354659300012,O,,NN,,,,true,1,,,,RUE,DE L'ECOLE,14400,MOSLES,,,14453,,,,,,,,,,,,,,,,,,,1997-12-31,F,,,,,01.4B,NAF1993,N,-0.81804,49.306622,0.63,street,Rue des Ecoles 14400 Mosles,14453_0015,G,RUE DES ECOLES,
393566930,00011,39356693000011,O,1994-01-01,NN,,,2020-10-13T03:39:31,true,8,,7,,HAM,HAMEAU MOULAGNY,14400,MOSLES,,,14453,,,,,,,,,,,,,,,,,,,2020-06-01,A,,,,,68.20B,NAFRev2,N,-0.825398,49.302482,0.53,housenumber,7 Route de Moulagny 14400 Mosles,14453_0028_00007,G,7 ROUTE DE MOULAGNY,
394288310,00011,39428831000011,O,1994-01-01,NN,,,2009-01-08T04:32:01,true,4,,,,,,14400,MOSLES,,,14453,,,,,,,,,,,,,,,,,,,2008-03-31,F,,,,,01.11Z,NAFRev2,N,,,0,,,,,,
398006742,00017,39800674200017,O,1994-08-04,NN,,,,true,3,,,,RTE,N 13,14400,MOSLES,,,14453,,,,,,,,,,,,,,,,,,,1994-12-30,F,,,,,52.6D,NAF1993,N,,,0,,,,,,
398201772,00017,39820177200017,O,1994-05-01,,,,2009-04-17T13:40:10,true,4,,,,,,14400,MOSLES,,,14453,,,,,,,,,,,,,,,,,,,2008-03-31,F,,,,,01.41Z,NAFRev2,N,,,0,,,,,,
398423640,00018,39842364000018,O,1994-06-27,NN,,,2017-05-04T04:40:58,true,5,LA SAUSSAYE,,,,LA SAUSSAYE,14400,MOSLES,,,14453,,,,,,,,,,,,,,,,,,,2012-12-31,A,,,,,01.41Z,NAFRev2,O,-0.80486,49.30582,0.92,street,Impasse de la Saussaye 14400 Mosles,14453_0066,G,IMPASSE DE LA SAUSSAYE,
398769240,00019,39876924000019,O,1994-01-01,NN,,,2012-10-01T03:38:15,true,4,,,,,,14400,MOSLES,,,14453,,,,,,,,,,,,,,,,,,,2011-04-30,F,,,,,68.20B,NAFRev2,N,,,0,,,,,,
399342963,00010,39934296300010,O,1994-12-05,NN,,,2021-04-21T08:52:43,false,5,,,,HAM,DE MOULAGNY,14400,MOSLES,,,14453,,,,,,,,,,,,,,,,,,,2015-10-22,F,,,,,01.50Z,NAFRev2,N,-0.826671,49.301558,0.93,street,Route de Moulagny 14400 Mosles,14453_0028,G,ROUTE DE MOULAGNY,
402123350,00025,40212335000025,O,1999-01-25,,,,,true,1,,,,,LA BUTTE,14400,MOSLES,,,14453,,,,,,,,,,,,,,,,,,,1999-01-25,F,,,,,51.1T,NAF1993,N,-0.8272,49.307321,0.31,street,Rue de la Cour Souveraine 14400 Mosles,14453_0009,G,RUE DE LA COUR SOUVERAINE,
403351307,00018,40335130700018,O,1995-12-11,NN,,,2015-01-11T03:30:51,true,7,,,,RUE,AUX PRETRES,14400,MOSLES,,,14453,,,,,,,,,,,,,,,,,,,2013-12-25,F,,,,,01.42Z,NAFRev2,N,-0.818267,49.309026,0.94,street,Rue aux Pretres 14400 Mosles,14453_0050,G,RUE AUX PRETRES,
403847593,00015,40384759300015,O,1995-12-20,NN,,,2008-02-24T05:45:33,true,3,,,,HAM,,14400,MOSLES,,,14453,,,,,,,,,,,,,,,,,,,2007-12-31,F,,,,,01.3Z,NAFRev1,N,,,0,,,,,,
408540607,00012,40854060700012,O,1996-08-08,NN,,,2008-01-05T20:23:26,true,3,,,,,FERME DE LA SAUSSAIE,14400,MOSLES,,,14453,,,,,,,,,,,,,,,,,,,2008-01-01,A,,,,,68.20B,NAFRev2,N,-0.80486,49.30582,0.59,street,Impasse de la Saussaye 14400 Mosles,14453_0066,G,IMPASSE DE LA SAUSSAYE,
409752631,00013,40975263100013,O,,NN,,,,true,1,,,,,,14400,MOSLES,,,14453,,,,,,,,,,,,,,,,,,,1995-12-25,F,,,,,01.1C,NAF1993,N,,,0,,,,,,
411324114,00015,41132411400015,O,1996-06-04,,,,,true,1,,,,,LA FERME DE LA FRESNEE,14400,MOSLES,,,14453,,,,,,,,,,,,,,,,,,,1998-12-30,F,,,,,01.2A,NAF1993,N,-0.808013,49.301777,0.69,street,Impasse de la Fresnée 14400 Mosles,14453_0024,G,IMPASSE DE LA FRESNEE,
411592587,00017,41159258700017,O,1997-04-02,00,2019,,2021-10-27T08:35:05,true,5,,,,,MOULAGNY,14400,MOSLES,,,14453,,,,,,,,,,,,,,,,,,,2018-06-26,A,,,,,43.29A,NAFRev2,N,-0.826671,49.301558,0.92,street,Route de Moulagny 14400 Mosles,14453_0028,G,ROUTE DE MOULAGNY,
413235169,00013,41323516900013,O,1982-12-31,NN,,,2015-03-04T04:36:01,true,4,,,,,,14400,MOSLES,,,14453,,,,,,,,,,,,,,,,,,,2014-07-10,F,,,,,01.42Z,NAFRev2,N,,,0,,,,,,
413235177,00016,41323517700016,O,1982-12-31,NN,,,2016-06-20T09:44:14,true,3,,,,,,14400,MOSLES,,,14453,,,,,,,,,,,,,,,,,,,2008-01-01,A,,,,,01.41Z,NAFRev2,N,,,0,,,,,,
413235185,00019,41323518500019,O,1982-12-31,NN,,,2012-03-04T06:15:42,true,5,,,,,LE DANU,14400,MOSLES,,,14453,,,,,,,,,,,,,,,,,,,2011-06-30,F,,,,,01.41Z,NAFRev2,N,-0.822271,49.310512,0.68,street,Rue du Moulin du Danu 14400 Mosles,14453_0030,G,RUE DU MOULIN DU DANU,
413235193,00013,41323519300013,O,1992-12-31,NN,,,2021-02-23T11:35:33,true,3,,,,RUE,DU LAVOIR,14400,MOSLES,,,14453,,,,,,,,,,,,,,,,,,,2008-01-01,A,,,,,01.42Z,NAFRev2,N,-0.821222,49.310086,0.94,street,Rue du Lavoir 14400 Mosles,14453_0027,G,RUE DU LAVOIR,
413235201,00014,41323520100014,O,1983-12-31,NN,,,2006-10-28T04:08:48,true,4,,,,,LES FORGES,14400,MOSLES,,,14453,,,,,,,,,,,,,,,,,,,2005-12-31,F,,,,,01.2A,NAFRev1,N,-0.819091,49.308023,0.83,street,Route des Forges 14400 Mosles,14453_0023,G,ROUTE DES FORGES,
414903690,00017,41490369000017,O,1984-12-31,NN,,,,true,1,,,,,FERME DE COURTELAY,14400,MOSLES,,,14453,,,,,,,,,,,,,,,,,,,2002-08-17,F,,,,,01.1A,NAF1993,N,-0.811145,49.296917,0.69,street,Impasse de Courtelay 14400 Mosles,14453_0010,G,IMPASSE DE COURTELAY,
418558326,00017,41855832600017,O,1997-07-31,NN,,,,true,4,,,,,LA SAUSSAYE,14400,MOSLES,,,14453,,,,,,,,,,,,,,,,,,,2000-12-31,F,,,,,01.1A,NAF1993,N,-0.80486,49.30582,0.92,street,Impasse de la Saussaye 14400 Mosles,14453_0066,G,IMPASSE DE LA SAUSSAYE,
420958787,00012,42095878700012,O,1998-11-02,NN,,,2020-06-30T04:26:02,true,3,,,,,MOULAGNY,14400,MOSLES,,,14453,,,,,,,,,,,,,,,,,,,2008-01-01,A,,,,,68.20B,NAFRev2,N,-0.826671,49.301558,0.92,street,Route de Moulagny 14400 Mosles,14453_0028,G,ROUTE DE MOULAGNY,
427838800,00014,42783880000014,O,1988-01-01,NN,,,2018-09-29T12:08:27,true,4,,,,,,14400,MOSLES,,,14453,,,,,,,,,,,,,,,,,,,2015-12-07,A,,,,,93.29Z,NAFRev2,O,,,0,,,,,,
427864269,00019,42786426900019,O,1990-01-01,,,,,true,1,,,,,LE PETIT CHATEAU,14400,MOSLES,,,14453,,,,,,,,,,,,,,,,,,,1999-12-25,F,,,,,01.1A,NAF1993,N,-0.5017179,46.4746355,0.91,poi.castle,Le Petit Château Béceleuf,https://osm.org/node/921177212,G,,
430927491,00018,43092749100018,O,1992-01-01,NN,,,2008-01-05T01:57:21,true,3,,,,,,14400,MOSLES,,,14453,,,,,,,,,,,,,,,,,,,2008-01-01,A,,,,,68.20B,NAFRev2,N,,,0,,,,,,
430927509,00017,43092750900017,O,1992-01-01,NN,,,2008-01-05T01:57:21,true,3,,,,,,14400,MOSLES,,,14453,,,,,,,,,,,,,,,,,,,2008-01-01,A,,,,,68.20B,NAFRev2,N,,,0,,,,,,
430928382,00018,43092838200018,O,1968-01-01,NN,,,2008-01-05T01:57:21,true,3,,,,,,14400,MOSLES,,,14453,,,,,,,,,,,,,,,,,,,2008-01-01,A,,,,,01.42Z,NAFRev2,N,,,0,,,,,,
430928838,00019,43092883800019,O,,NN,,,,true,1,,,,,,14400,MOSLES,,,14453,,,,,,,,,,,,,,,,,,,1984-01-01,F,,,,,01.3Z,NAF1993,N,,,0,,,,,,
432922185,00017,43292218500017,O,2000-09-01,NN,,,2014-01-21T12:49:47,false,5,,,,,LA FERME DE LA FRESNEE,14400,MOSLES,,,14453,,,,,,,,,,,,,,,,,,,2008-01-01,A,,,,,68.20A,NAFRev2,N,-0.808013,49.301777,0.69,street,Impasse de la Fresnée 14400 Mosles,14453_0024,G,IMPASSE DE LA FRESNEE,
432922185,00041,43292218500041,O,2014-01-01,,,,2021-02-23T13:14:17,true,1,,,,,FERME DE LA FRESNEE,14400,MOSLES,,,14453,,,,,,,,,,,,,,,,,,,2014-01-01,A,,,,,01.29Z,NAFRev2,N,-0.808013,49.301777,0.7,street,Impasse de la Fresnée 14400 Mosles,14453_0024,G,IMPASSE DE LA FRESNEE,
433375086,00017,43337508600017,O,1993-01-01,NN,,,2008-01-04T19:02:03,true,3,,,,,LA MALADRERIE,14400,MOSLES,,,14453,,,,,,,,,,,,,,,,,,,2008-01-01,A,,,,,55.20Z,NAFRev2,N,-0.8256255,48.7765073,0.9,poi,Pont de la Maladrerie Vire Normandie,https://osm.org/way/176706740,G,,
435380159,00036,43538015900036,O,2021-02-01,,,,2021-04-07T10:01:11,true,1,,,,QUA,DE COURLETAY,14400,MOSLES,,,14453,,,,,,,,,,,,,,,,,,,2021-02-01,A,,,,,68.20B,NAFRev2,N,-0.811145,49.296917,0.46,street,Impasse de Courtelay 14400 Mosles,14453_0010,G,IMPASSE DE COURTELAY,
440887552,00022,44088755200022,O,2008-07-10,,,,2013-10-28T19:23:32,false,2,,,,,LA FERME DE LA FRESNEE,14400,MOSLES,,,14453,,,,,,,,,,,,,,,,,,,2011-04-23,F,LA BALADE EN L'AIR,,,,93.29Z,NAFRev2,N,-0.808013,49.301777,0.69,street,Impasse de la Fresnée 14400 Mosles,14453_0024,G,IMPASSE DE LA FRESNEE,
440994382,00016,44099438200016,O,2000-01-01,NN,,,2008-01-04T21:09:40,true,3,,,,,,14400,MOSLES,,,14453,,,,,,,,,,,,,,,,,,,2008-01-01,A,,,,,68.20B,NAFRev2,N,,,0,,,,,,
442331526,00016,44233152600016,O,2002-05-25,NN,,,2009-01-27T07:28:48,true,3,,,,,CHATEAU D ARGOUGES,14400,MOSLES,,,14453,,,,,,,,,,,,,,,,,,,2008-01-01,A,,,,,68.20A,NAFRev2,N,-0.828895,49.3133,0.57,street,Rue d’Argouges 14400 Mosles,14453_0005,G,RUE D ARGOUGES,
442393211,00028,44239321100028,O,2009-04-01,,,,2012-11-09T01:23:35,true,2,,,,,LE BOURG,14400,MOSLES,,,14453,,,,,,,,,,,,,,,,,,,2011-06-20,F,,,,,31.09B,NAFRev2,N,-0.8223,49.310356,0.3,street,Le Lavoir 14400 Mosles,14453_4gmx5a,G,LE LAVOIR,
443684543,00012,44368454300012,O,2002-08-18,,,,,true,1,,,,,,14400,MOSLES,,,14453,,,,,,,,,,,,,,,,,,,2002-12-31,F,,,,,01.1A,NAF1993,N,,,0,,,,,,
444175582,00014,44417558200014,O,2002-06-21,,,,2009-09-16T16:35:54,false,4,,,,,LES FORGES,14400,MOSLES,,,14453,,,,,,,,,,,,,,,,,,,2009-07-13,F,,,,,03.11Z,NAFRev2,O,-0.819091,49.308023,0.83,street,Route des Forges 14400 Mosles,14453_0023,G,ROUTE DES FORGES,
448099879,00026,44809987900026,O,2009-03-09,,,4333ZZ,2021-02-23T13:29:35,true,1,,,,LD,LES FORGES,14400,MOSLES,,,14453,,,,,,,,,,,,,,,,,,,2009-03-09,A,,,,,43.33Z,NAFRev2,N,-0.819091,49.308023,0.83,street,Route des Forges 14400 Mosles,14453_0023,G,ROUTE DES FORGES,
450509245,00012,45050924500012,O,2003-10-08,NN,,4331ZB,2015-03-17T01:15:22,true,4,,,,HAM,DE HOUTTEVILLE,14400,MOSLES,,,14453,,,,,,,,,,,,,,,,,,,2010-09-08,F,,,,,43.31Z,NAFRev2,N,-0.83398,49.319155,0.93,street,Rue de Houtteville 14400 Mosles,14453_0026,G,RUE DE HOUTTEVILLE,
451803050,00017,45180305000017,O,2001-01-02,NN,,,2008-07-27T05:45:30,true,3,,,,,HAMEAU DE MOULAGNY,14400,MOSLES,,,14453,,,,,,,,,,,,,,,,,,,2008-01-01,A,,,,,90.01Z,NAFRev2,N,-0.826671,49.301558,0.6,street,Route de Moulagny 14400 Mosles,14453_0028,G,ROUTE DE MOULAGNY,
451961049,00017,45196104900017,O,2004-01-21,NN,,,2013-05-18T02:42:57,true,3,,,,,LA FRESNEE,14400,MOSLES,,,14453,,,,,,,,,,,,,,,,,,,2008-01-01,A,,,,,94.99Z,NAFRev2,N,-0.806493,49.301262,0.93,street,La Fresnee 14400 Mosles,14453_69ulxf,G,LA FRESNEE,
453976748,00013,45397674800013,O,2003-01-01,NN,,,2008-01-05T03:16:07,true,3,,,,RTE,N 2013,14400,MOSLES,,,14453,,,,,,,,,,,,,,,,,,,2008-01-01,A,,,,,90.01Z,NAFRev2,N,,,0,,,,,,
478634132,00037,47863413200037,O,2008-02-01,NN,,4334ZC,2021-02-23T13:40:40,true,5,,,,,LA COUR SOUVERAINE,14400,MOSLES,,,14453,,,,,,,,,,,,,,,,,,,2014-10-31,A,,,,,43.34Z,NAFRev2,N,-0.8272,49.307321,0.93,street,Rue de la Cour Souveraine 14400 Mosles,14453_0009,G,RUE DE LA COUR SOUVERAINE,
478759103,00011,47875910300011,O,2003-07-01,NN,,,2014-01-09T10:32:00,false,5,,,,RTE,ARGOUGES,14400,MOSLES,,,14453,,,,,,,,,,,,,,,,,,,2013-12-31,F,,,,,55.20Z,NAFRev2,N,-0.828895,49.3133,0.66,street,Rue d’Argouges 14400 Mosles,14453_0005,G,RUE D ARGOUGES,
478759103,00037,47875910300037,O,2014-01-01,00,2020,,2022-08-29T09:11:43,true,1,,,,RTE,DE RUSSY,14400,MOSLES,,,14453,,,,,,,,,,,,,,,,,,,2014-01-01,A,,,,,55.20Z,NAFRev2,O,-0.826671,49.301558,0.38,street,Route de Moulagny 14400 Mosles,14453_0028,G,ROUTE DE MOULAGNY,
479549354,00021,47954935400021,O,2007-10-01,NN,,,2011-04-23T13:39:38,false,5,LE DANU,,,,,14400,MOSLES,,,14453,,,,,,,,,,,,,,,,,,,2009-10-15,F,,,,,71.12B,NAFRev2,N,-0.822271,49.310512,0.68,street,Rue du Moulin du Danu 14400 Mosles,14453_0030,D,RUE DU MOULIN DU DANU,
482037215,00019,48203721500019,O,2005-04-26,NN,,,2009-07-05T12:06:25,false,2,,,,,LE BOURG,14400,MOSLES,,,14453,,,,,,,,,,,,,,,,,,,2007-06-01,F,,,,,60.2G,NAFRev1,O,-0.8223,49.310356,0.3,street,Le Lavoir 14400 Mosles,14453_4gmx5a,G,LE LAVOIR,
482779972,00025,48277997200025,O,2010-10-01,,,,2013-04-24T19:25:15,true,3,,,,RUE,AU PRETRE,14400,MOSLES,,,14453,,,,,,,,,,,,,,,,,,,2012-10-31,F,,,,,66.19B,NAFRev2,N,-0.818267,49.309026,0.75,street,Rue aux Pretres 14400 Mosles,14453_0050,G,RUE AUX PRETRES,
486040843,00014,48604084300014,O,,,,,,true,1,,,,,R.N 13,14400,MOSLES,,,14453,,,,,,,,,,,,,,,,,,,1987-04-01,F,,,,,67.05,NAP,N,,,0,,,,,,
488742156,00018,48874215600018,O,2006-01-09,NN,,,2013-05-18T03:58:43,true,3,,,,,RN 13,14400,MOSLES,,,14453,,,,,,,,,,,,,,,,,,,2011-08-24,F,RESTAURANT DE LA POSTE,,,,56.10A,NAFRev2,O,,,0,,,,,,
491216297,00029,49121629700029,O,2007-09-01,,,,2009-11-02T11:16:30,false,3,,,,CHE,LE DANU,14400,MOSLES,,,14453,,,,,,,,,,,,,,,,,,,2009-10-15,F,,,,,41.10D,NAFRev2,N,-0.822271,49.310512,0.48,street,Rue du Moulin du Danu 14400 Mosles,14453_0030,G,RUE DU MOULIN DU DANU,
492086186,00029,49208618600029,O,2007-10-01,,,,2008-09-09T16:53:38,false,2,,,,,LE DANU,14400,MOSLES,,,14453,,,,,,,,,,,,,,,,,,,2008-01-01,F,,,,,41.10D,NAFRev2,N,-0.822271,49.310512,0.68,street,Rue du Moulin du Danu 14400 Mosles,14453_0030,G,RUE DU MOULIN DU DANU,
492713672,00011,49271367200011,O,2006-11-08,,,,2015-04-05T04:09:14,true,2,,,,,FERME DE LA SAUSSAYE,14400,MOSLES,,,14453,,,,,,,,,,,,,,,,,,,2008-01-01,A,,,,,70.10Z,NAFRev2,N,-0.80486,49.30582,0.72,street,Impasse de la Saussaye 14400 Mosles,14453_0066,G,IMPASSE DE LA SAUSSAYE,
494268907,00024,49426890700024,O,2013-05-31,NN,,,2017-05-04T06:56:40,true,1,,,,,LE BOURG,14400,MOSLES,,,14453,,,,,,,,,,,,,,,,,,,2013-05-31,A,,,,,94.99Z,NAFRev2,O,-0.8223,49.310356,0.3,street,Le Lavoir 14400 Mosles,14453_4gmx5a,G,LE LAVOIR,
495376758,00019,49537675800019,O,2007-04-01,01,2020,,2022-08-29T09:29:00,true,3,,,,,FERME DE LA SAUSSAYE,14400,MOSLES,,,14453,,,,,,,,,,,,,,,,,,,2014-12-31,A,,,,,01.41Z,NAFRev2,O,-0.80486,49.30582,0.72,street,Impasse de la Saussaye 14400 Mosles,14453_0066,G,IMPASSE DE LA SAUSSAYE,
501309249,00016,50130924900016,O,2007-06-03,,,,2011-09-23T09:49:40,false,3,,,,,CHEMIN DU DANU,14400,MOSLES,,,14453,,,,,,,,,,,,,,,,,,,2008-11-03,F,,,,,86.22C,NAFRev2,N,-0.822271,49.310512,0.63,street,Rue du Moulin du Danu 14400 Mosles,14453_0030,G,RUE DU MOULIN DU DANU,
501692115,00014,50169211500014,O,2008-01-02,,,4333ZZ,2015-03-18T00:13:40,true,3,,,,LD,LA CAMPAGNE,14400,MOSLES,,,14453,,,,,,,,,,,,,,,,,,,2011-04-04,A,,,,FREDERIC BATON,43.33Z,NAFRev2,N,-0.811135,49.305411,0.94,street,La Campagne 14400 Mosles,14453_6pypf8,G,LA CAMPAGNE,
502947252,00016,50294725200016,O,2008-03-01,NN,,,2020-02-20T19:34:49,true,5,,,,,LA SAUSSAYE,14400,MOSLES,,,14453,,,,,,,,,,,,,,,,,,,2015-04-12,F,,,,,49.41B,NAFRev2,N,-0.80486,49.30582,0.92,street,Impasse de la Saussaye 14400 Mosles,14453_0066,G,IMPASSE DE LA SAUSSAYE,
503566317,00023,50356631700023,O,2008-08-01,,,,2021-02-23T14:15:32,true,1,RN 13,,,LD,LES FORGES,14400,MOSLES,,,14453,,,,,,,,,,,,,,,,,,,2008-08-01,A,,,,WWW.MINIYOO.COM,47.91A,NAFRev2,N,-0.819091,49.308023,0.83,street,Route des Forges 14400 Mosles,14453_0023,G,ROUTE DES FORGES,
509074993,00015,50907499300015,O,2008-10-01,,,,2020-09-17T19:34:40,false,2,,,,,FERME DE LA FRESNEE,14400,MOSLES,,,14453,,,,,,,,,,,,,,,,,,,2020-06-29,F,,,,,01.61Z,NAFRev2,N,-0.808013,49.301777,0.7,street,Impasse de la Fresnée 14400 Mosles,14453_0024,G,IMPASSE DE LA FRESNEE,
517649869,00024,51764986900024,O,2014-07-20,,,,2017-10-10T09:46:21,false,2,,,,,LA GRAINERIE,14400,MOSLES,,,14453,,,,,,,,,,,,,,,,,,,2017-07-30,F,,,,,68.20A,NAFRev2,N,-0.8272,49.307321,0.44,street,Rue de la Cour Souveraine 14400 Mosles,14453_0009,G,RUE DE LA COUR SOUVERAINE,
517728440,00036,51772844000036,O,2015-09-15,,,2370ZZ,2022-10-10T11:51:11,true,2,,,,,LA COUR SOUVERAINE,14400,MOSLES,,,14453,,,,,,,,,,,,,,,,,,,2022-10-03,A,,,,JEAN-CHRISTOPHE YVON,23.70Z,NAFRev2,N,-0.8272,49.307321,0.93,street,Rue de la Cour Souveraine 14400 Mosles,14453_0009,G,RUE DE LA COUR SOUVERAINE,
521537969,00029,52153796900029,O,2013-01-01,,,4339ZZ,2016-01-12T12:11:56,false,2,LE BOURG,,,,RN 13,14400,MOSLES,,,14453,,,,,,,,,,,,,,,,,,,2015-01-01,F,,,,,96.09Z,NAFRev2,N,,,0,,,,,,