siren,nic,siret,statutDiffusionEtablissement,dateCreationEtablissement,trancheEffectifsEtablissement,anneeEffectifsEtablissement,activitePrincipaleRegistreMetiersEtablissement,dateDernierTraitementEtablissement,etablissementSiege,nombrePeriodesEtablissement,complementAdresseEtablissement,numeroVoieEtablissement,indiceRepetitionEtablissement,typeVoieEtablissement,libelleVoieEtablissement,codePostalEtablissement,libelleCommuneEtablissement,libelleCommuneEtrangerEtablissement,distributionSpecialeEtablissement,codeCommuneEtablissement,codeCedexEtablissement,libelleCedexEtablissement,codePaysEtrangerEtablissement,libellePaysEtrangerEtablissement,complementAdresse2Etablissement,numeroVoie2Etablissement,indiceRepetition2Etablissement,typeVoie2Etablissement,libelleVoie2Etablissement,codePostal2Etablissement,libelleCommune2Etablissement,libelleCommuneEtranger2Etablissement,distributionSpeciale2Etablissement,codeCommune2Etablissement,codeCedex2Etablissement,libelleCedex2Etablissement,codePaysEtranger2Etablissement,libellePaysEtranger2Etablissement,dateDebut,etatAdministratifEtablissement,enseigne1Etablissement,enseigne2Etablissement,enseigne3Etablissement,denominationUsuelleEtablissement,activitePrincipaleEtablissement,nomenclatureActivitePrincipaleEtablissement,caractereEmployeurEtablissement,longitude,latitude,geo_score,geo_type,geo_adresse,geo_id,geo_ligne,geo_l4,geo_l5
211601059,00010,21160105900010,O,1983-03-01,03,2020,,2022-08-29T09:06:05,true,4,,,,,,16360,CONDEON,,,16105,,,,,,,,,,,,,,,,,,,2008-01-01,A,MAIRIE,,,,84.11Z,NAFRev2,O,,,0,,,,,,
211601059,00028,21160105900028,O,1983-03-16,NN,,,2008-01-04T18:26:46,false,3,,,,,,16360,CONDEON,,,16105,,,,,,,,,,,,,,,,,,,2008-01-01,A,CANTINE SCOLAIRE,,,,56.29B,NAFRev2,N,,,0,,,,,,
211601059,00036,21160105900036,O,1983-12-21,02,2020,,2022-08-29T09:06:05,false,3,,,,,LE BOURG,16360,CONDEON,,,16105,,,,,,,,,,,,,,,,,,,2008-01-01,A,ECOLE PRIMAIRE PUBLIQUE,,,,85.20Z,NAFRev2,N,-0.129562,45.383822,0.51,street,Route de Rouille Bouc 16360 Condéon,16105_lz5el5,G,ROUTE DE ROUILLE BOUC,
211601059,00044,21160105900044,O,2005-04-19,,,,2008-01-04T18:26:46,false,2,MAIRIE,,,,LE BOURG,16360,CONDEON,,,16105,,,,,,,,,,,,,,,,,,,2008-01-01,A,LOTISSEMENT,,,,42.99Z,NAFRev2,N,-0.129562,45.383822,0.51,street,Route de Rouille Bouc 16360 Condéon,16105_lz5el5,G,ROUTE DE ROUILLE BOUC,
251600177,00017,25160017700017,O,1983-03-01,NN,,,2018-09-29T12:07:37,true,4,MAIRIE,,,,,16360,CONDEON,,,16105,,,,,,,,,,,,,,,,,,,2017-01-01,F,,,,,36.00Z,NAFRev2,N,-0.157741,45.400315,0.38,street,Chemin de la Thibauderie 16360 Condéon,16105_1790,D,CHEMIN DE LA THIBAUDERIE,
261610000,00018,26161000000018,O,1995-12-25,NN,,,2017-08-06T14:08:36,true,3,MAIRIE,,,,,16360,CONDEON,,,16105,,,,,,,,,,,,,,,,,,,2017-08-01,F,CCAS,,,,88.99B,NAFRev2,N,-0.157741,45.400315,0.38,street,Chemin de la Thibauderie 16360 Condéon,16105_1790,D,CHEMIN DE LA THIBAUDERIE,
291600401,00017,29160040100017,O,,NN,,,2006-11-25T09:10:25,true,1,,,,,MAIRIE,16360,CONDEON,,,16105,,,,,,,,,,,,,,,,,,,1994-12-25,F,,,,,70.1C,NAF1993,N,3.0709671,50.6304695,0.92,poi.townhall,Hôtel de Ville Lille,https://osm.org/way/40917078,G,,
291601813,00012,29160181300012,O,1996-01-01,NN,,,2008-01-04T19:06:02,true,3,MAIRIE,,,,,16360,CONDEON,,,16105,,,,,,,,,,,,,,,,,,,2008-01-01,A,,,,,42.99Z,NAFRev2,N,-0.157741,45.400315,0.38,street,Chemin de la Thibauderie 16360 Condéon,16105_1790,D,CHEMIN DE LA THIBAUDERIE,
297901878,00019,29790187800019,O,,NN,,,2006-11-25T09:11:07,true,1,,,,,MAIRIE,16360,CONDEON,,,16105,,,,,,,,,,,,,,,,,,,1996-01-01,F,,,,,70.1C,NAF1993,N,3.0709671,50.6304695,0.92,poi.townhall,Hôtel de Ville Lille,https://osm.org/way/40917078,G,,
305478067,00021,30547806700021,O,1992-06-01,NN,,4322AZ,2017-05-04T01:58:33,true,5,,,,,LES CHARMILLES,16360,CONDEON,,,16105,,,,,,,,,,,,,,,,,,,2015-12-31,F,,,,,43.22A,NAFRev2,O,-0.15284,45.410947,0.37,street,Route des Demoiselles 16360 Condéon,16105_0790,G,ROUTE DES DEMOISELLES,
306205048,00029,30620504800029,O,,NN,,,,true,1,,,,LD,LA RIVIERE,16360,CONDEON,,,16105,,,,,,,,,,,,,,,,,,,1990-07-31,F,,,,,66.04,NAP,N,-0.113014,45.388827,0.92,street,Chemin de la Rivière 16360 Condéon,16105_1600,G,CHEMIN DE LA RIVIERE,
307353805,00012,30735380500012,O,,NN,,,,true,1,,,,,LE LAC DES BRUYERES,16360,CONDEON,,,16105,,,,,,,,,,,,,,,,,,,1987-12-02,F,,,,,67.04,NAP,N,-1.4584532,49.2139507,0.76,poi.track,Chemin du Lac des Bruyères Millières,https://osm.org/way/188960357,G,,
311234959,00014,31123495900014,O,,NN,,,,true,1,,,,,,16360,CONDEON,,,16105,,,,,,,,,,,,,,,,,,,1989-09-07,F,,,,,22.02,NAP,N,,,0,,,,,,
311235006,00013,31123500600013,O,,NN,,,,true,1,,,,,,16360,CONDEON,,,16105,,,,,,,,,,,,,,,,,,,,F,,,,,55.71,NAP,N,,,0,,,,,,
315986372,00029,31598637200029,O,1984-01-01,NN,,,2014-04-04T08:56:03,true,5,,,,,LES AUBINAUDS,16360,CONDEON,,,16105,,,,,,,,,,,,,,,,,,,2013-12-31,F,,,,,01.11Z,NAFRev2,N,-0.146188,45.40117,0.79,street,Chemin des Aubinauds 16360 Condéon,16105_0030,G,CHEMIN DES AUBINAUDS,
318749322,00026,31874932200026,O,,NN,,,,true,1,,,,,GUIMBERT,16360,CONDEON,,,16105,,,,,,,,,,,,,,,,,,,,F,,,,,64.46,NAP,N,-0.109618,45.418005,0.91,street,Chemin de Chez Guimbert 16360 Condéon,16105_0550,G,CHEMIN DE CHEZ GUIMBERT,
319433033,00010,31943303300010,O,,,,,,true,1,,,,,CHEZ CARTIER,16360,CONDEON,,,16105,,,,,,,,,,,,,,,,,,,1984-12-25,F,,,,,00.10,NAP,N,-0.116047,45.392039,0.93,street,Chemin de Chez Cartier 16360 Condéon,16105_0410,G,CHEMIN DE CHEZ CARTIER,
319441192,00014,31944119200014,O,,NN,,,,true,1,,,,,,16360,CONDEON,,,16105,,,,,,,,,,,,,,,,,,,,F,,,,,01.80,NAP,N,,,0,,,,,,
319963971,00019,31996397100019,O,,NN,,,,true,1,,,,,,16360,CONDEON,,,16105,,,,,,,,,,,,,,,,,,,1994-05-31,F,,,,,28.4A,NAF1993,N,,,0,,,,,,
320731789,00014,32073178900014,O,1980-12-15,NN,,4520AB,2015-03-18T01:00:28,false,5,,,,,LE BOIS,16360,CONDEON,,,16105,,,,,,,,,,,,,,,,,,,2014-12-31,F,,,,,45.20A,NAFRev2,N,-0.126488,45.40203,0.57,street,Chemin du Bois Videau 16360 Condéon,16105_0160,G,CHEMIN DU BOIS VIDEAU,
320731789,00022,32073178900022,O,2002-10-01,NN,,,2016-01-12T00:11:16,true,5,,,,,CHEZ BONNIN,16360,CONDEON,,,16105,,,,,,,,,,,,,,,,,,,2014-12-31,A,,,,,01.11Z,NAFRev2,N,-0.102609,45.418994,0.93,street,Chemin de Chez Bonnin 16360 Condéon,16105_0370,G,CHEMIN DE CHEZ BONNIN,
322583790,00017,32258379000017,O,,NN,,,,true,1,,,,,LES MICHAUDS,16360,CONDEON,,,16105,,,,,,,,,,,,,,,,,,,,F,,,,,01.70,NAP,N,-0.115645,45.414319,0.78,street,Chemin des Michauds 16360 Condéon,16105_1290,G,CHEMIN DES MICHAUDS,
326532868,00014,32653286800014,O,1983-01-26,NN,,,2021-10-26T12:27:49,true,4,,,,,,16360,CONDEON,,,16105,,,,,,,,,,,,,,,,,,,2021-07-21,F,,,,,01.61Z,NAFRev2,N,,,0,,,,,,
328043567,00010,32804356700010,O,1983-09-01,NN,,,2014-12-19T04:14:55,true,4,,,,,MAINE NEUF,16360,CONDEON,,,16105,,,,,,,,,,,,,,,,,,,2014-12-31,F,,,,,93.29Z,NAFRev2,N,-0.140076,45.415861,0.92,street,Chemin du Maine Neuf 16360 Condéon,16105_1250,G,CHEMIN DU MAINE NEUF,
328043567,00028,32804356700028,O,1984-12-31,NN,,,2010-06-03T08:46:16,false,5,,,,,LE MAINE NEUF,16360,CONDEON,,,16105,,,,,,,,,,,,,,,,,,,2008-12-31,F,,,,,01.11Z,NAFRev2,N,-0.140076,45.415861,0.73,street,Chemin du Maine Neuf 16360 Condéon,16105_1250,G,CHEMIN DU MAINE NEUF,
328236724,00014,32823672400014,O,1982-11-01,NN,,,2020-01-29T09:17:08,true,4,,,,LD,LA THIBAUDERIE,16360,CONDEON,,,16105,,,,,,,,,,,,,,,,,,,2019-12-31,A,,,,,68.20B,NAFRev2,N,-0.157741,45.400315,0.92,street,Chemin de la Thibauderie 16360 Condéon,16105_1790,G,CHEMIN DE LA THIBAUDERIE,
328852066,00054,32885206600054,O,2000-10-01,NN,,,2009-06-27T04:46:07,true,3,,,,LD,LA TORTE,16360,CONDEON,,,16105,,,,,,,,,,,,,,,,,,,2007-01-31,F,,,,,15.8C,NAFRev1,O,-0.147469,45.408769,0.92,street,Chemin de la Torte 16360 Condéon,16105_1810,G,CHEMIN DE LA TORTE,
329037964,00015,32903796400015,O,,NN,,,,true,1,,,,LD,LA CROIX BELLET,16360,CONDEON,,,16105,,,,,,,,,,,,,,,,,,,1995-10-12,F,,,,,50.1Z,NAF1993,N,-0.124843,45.400493,0.42,street,Impasse de la Croisée 16360 Condéon,16105_0770,G,IMPASSE DE LA CROISEE,
329047922,00011,32904792200011,O,,,,,,true,1,,,,LD,LA CROIX BELLET,16360,CONDEON,,,16105,,,,,,,,,,,,,,,,,,,1988-06-30,F,,,,,65.03,NAP,N,-0.124843,45.400493,0.42,street,Impasse de la Croisée 16360 Condéon,16105_0770,G,IMPASSE DE LA CROISEE,
330321878,00010,33032187800010,O,1984-07-02,NN,,,2017-06-15T14:41:22,true,3,,,,LD,CHEZ CHAGNAUD,16360,CONDEON,,,16105,,,,,,,,,,,,,,,,,,,2008-01-01,A,,,,,68.20B,NAFRev2,N,-0.12643,45.427831,0.51,street,Chemin de Chez Charpentier 16360 Condéon,16105_0430,G,CHEMIN DE CHEZ CHARPENTIER,
330321878,00028,33032187800028,O,1984-12-31,NN,,,2017-06-15T14:41:22,false,5,,,,,CHEZ CHAGNAUD,16360,CONDEON,,,16105,,,,,,,,,,,,,,,,,,,2015-12-31,F,,,,,01.11Z,NAFRev2,N,-0.12643,45.427831,0.51,street,Chemin de Chez Charpentier 16360 Condéon,16105_0430,G,CHEMIN DE CHEZ CHARPENTIER,
331723452,00016,33172345200016,O,1985-01-01,NN,,,2017-04-28T11:38:00,true,3,,,,LD,LES BERTHERAUX,16360,CONDEON,,,16105,,,,,,,,,,,,,,,,,,,2008-01-01,A,,,,,01.11Z,NAFRev2,N,-0.122411,45.41863,0.62,street,Chemin des Berteraux 16360 Condéon,16105_0140,G,CHEMIN DES BERTERAUX,
331981878,00019,33198187800019,O,1985-02-15,NN,,,2022-02-05T13:34:36,true,3,,,,,LA BARDE,16360,CONDEON,,,16105,,,,,,,,,,,,,,,,,,,2008-01-01,A,,,,,01.41Z,NAFRev2,N,-0.160291,45.37796,0.51,street,Chemin des Landes a Baret 16360 Condéon,16105_1200,G,CHEMIN DES LANDES A BARET,
332724319,00022,33272431900022,O,2021-10-12,,,,2022-02-05T13:39:23,true,1,,2,,CHE,DE CHEZ NADEAU,16360,CONDEON,,,16105,,,,,,,,,,,,,,,,,,,2021-10-12,A,,,,,68.20B,NAFRev2,N,-0.146196,45.410849,0.84,housenumber,2 Chemin de Chez Nadeau 16360 Condéon,16105_0610_00002,G,2 CHEMIN DE CHEZ NADEAU,
333289627,00015,33328962700015,O,1977-06-24,01,2020,,2022-08-29T09:23:06,true,5,,,,,LES MICHAUX,16360,CONDEON,,,16105,,,,,,,,,,,,,,,,,,,2020-12-31,F,,,,,01.11Z,NAFRev2,O,-0.115645,45.414319,0.62,street,Chemin des Michauds 16360 Condéon,16105_1290,G,CHEMIN DES MICHAUDS,
333522738,00025,33352273800025,O,,NN,,,,true,1,,,,LD,CHAMPAGNE,16360,CONDEON,,,16105,,,,,,,,,,,,,,,,,,,1994-06-30,F,,,,,93.0D,NAF1993,N,-0.143365,45.403592,0.92,street,Chemin de Champagne 16360 Condéon,16105_0310,G,CHEMIN DE CHAMPAGNE,
334627718,00011,33462771800011,O,,NN,,,,true,1,,,,LD,LE GRAND MAINE,16360,CONDEON,,,16105,,,,,,,,,,,,,,,,,,,1987-11-26,F,,,,,81.21,NAP,N,-0.122836,45.396836,0.75,street,Chemin du Grand Maine 16360 Condéon,16105_1120,G,CHEMIN DU GRAND MAINE,
334633328,00011,33463332800011,O,1986-01-01,NN,,,2008-06-20T06:39:59,true,4,,,,LD,LE GRAND MAINE,16360,CONDEON,,,16105,,,,,,,,,,,,,,,,,,,2007-12-31,F,,,,,01.1G,NAFRev1,N,-0.122836,45.396836,0.75,street,Chemin du Grand Maine 16360 Condéon,16105_1120,G,CHEMIN DU GRAND MAINE,
334633344,00018,33463334400018,O,,NN,,,,true,1,,,,LD,LE GRAND MAINE,16360,CONDEON,,,16105,,,,,,,,,,,,,,,,,,,1987-11-26,F,,,,,81.21,NAP,N,-0.122836,45.396836,0.75,street,Chemin du Grand Maine 16360 Condéon,16105_1120,G,CHEMIN DU GRAND MAINE,
338223571,00021,33822357100021,O,1987-11-27,NN,,,2008-11-07T00:57:14,false,4,,,,,LES GRIPPES,16360,CONDEON,,,16105,,,,,,,,,,,,,,,,,,,1994-12-25,F,,,,,45.3A,NAF1993,N,-0.127056,45.40957,0.35,street,Chemin des Grandes Versennes 16360 Condéon,16105_1150,G,CHEMIN DES GRANDES VERSENNES,
338223571,00054,33822357100054,O,2015-06-01,,,,2015-06-29T08:58:20,true,1,,,,,LE MAS,16360,CONDEON,,,16105,,,,,,,,,,,,,,,,,,,2015-06-01,A,,,,,68.31Z,NAFRev2,N,-0.148154,45.413421,0.52,street,Chemin du Mas 16360 Condéon,16105_1260,G,CHEMIN DU MAS,
340627199,00011,34062719900011,O,1965-01-01,NN,,,2008-01-04T21:44:07,true,3,,,,,,16360,CONDEON,,,16105,,,,,,,,,,,,,,,,,,,2008-01-01,A,,,,,01.21Z,NAFRev2,N,,,0,,,,,,
340926831,00017,34092683100017,O,1987-03-01,NN,,,2008-01-04T21:47:23,true,3,,,,LD,LA FONTAINE ROUILLEE,16360,CONDEON,,,16105,,,,,,,,,,,,,,,,,,,2008-01-01,A,,,,,01.11Z,NAFRev2,N,-0.155716,45.393842,0.92,street,Chemin de la Fontaine Rouillée 16360 Condéon,16105_0930,G,CHEMIN DE LA FONTAINE ROUILLEE,
348565193,00029,34856519300029,O,2018-11-01,01,2020,,2022-08-29T09:30:37,true,1,,,,,CHEZ BAZOIN,16360,CONDEON,,,16105,,,,,,,,,,,,,,,,,,,2018-11-01,A,,,,,01.11Z,NAFRev2,O,-0.102818,45.406111,0.92,street,Route de Chez Bazoin 16360 Condéon,16105_0350,G,ROUTE DE CHEZ BAZOIN,
349194340,00023,34919434000023,O,2004-07-01,NN,,,2006-11-25T11:00:28,true,3,,,,,LE BOIS DES PRETRES,16360,CONDEON,,,16105,,,,,,,,,,,,,,,,,,,2006-09-30,F,,,,,52.4P,NAFRev1,N,-0.15284,45.410947,0.32,street,Route des Demoiselles 16360 Condéon,16105_0790,G,ROUTE DES DEMOISELLES,
351363932,00028,35136393200028,O,1990-07-02,NN,,,2008-11-08T00:27:40,false,4,,,,,LE NOUGEAT,16360,CONDEON,,,16105,,,,,,,,,,,,,,,,,,,1995-12-25,F,,,,,45.4D,NAF1993,O,-0.140867,45.414306,0.67,street,Chemin du Nougeat 16360 Condéon,16105_1370,G,CHEMIN DU NOUGEAT,
352708762,00021,35270876200021,O,2006-01-01,NN,,,2021-02-23T11:05:07,true,2,,,,,LE FERRON,16360,CONDEON,,,16105,,,,,,,,,,,,,,,,,,,2008-01-01,A,ELEVAGE DU FERRON,,,,01.43Z,NAFRev2,N,1.0729797,46.8511877,0.89,poi.community_centre,(Salle des fêtes) Azay-le-Ferron,https://osm.org/way/165948614,G,,
352957567,00014,35295756700014,O,1990-01-01,NN,,,2011-04-28T00:42:56,false,4,,,,,LE PENILLON,16360,CONDEON,,,16105,,,,,,,,,,,,,,,,,,,2001-12-31,F,,,,,01.1G,NAF1993,N,-0.156113,45.409343,0.7,street,Chemin du Penillon 16360 Condéon,16105_1470,G,CHEMIN DU PENILLON,
352957567,00030,35295756700030,O,2010-07-19,,,,2015-01-13T08:21:12,false,2,,,,,CHEZ FEVRIER,16360,CONDEON,,,16105,,,,,,,,,,,,,,,,,,,2015-01-12,F,,,,,86.90D,NAFRev2,N,-0.116047,45.392039,0.51,street,Chemin de Chez Cartier 16360 Condéon,16105_0410,G,CHEMIN DE CHEZ CARTIER,
353097736,00014,35309773600014,O,1990-01-01,NN,,,2012-11-30T08:43:05,true,6,,,,,LE MAINE GARRAUD,16360,CONDEON,,,16105,,,,,,,,,,,,,,,,,,,2012-01-01,F,,,,,69.10Z,NAFRev2,N,-0.111073,45.399554,0.46,street,Chemin Garraud 16360 Condéon,16105_1030,G,CHEMIN GARRAUD,
353245145,00019,35324514500019,O,1989-10-23,01,2020,,2022-08-29T09:03:44,true,6,,,,,LE MONCENY,16360,CONDEON,,,16105,,,,,,,,,,,,,,,,,,,2021-12-31,F,,,,,68.20A,NAFRev2,N,,,0,,,,,,
353420821,00012,35342082100012,O,1990-01-01,NN,,,2018-03-21T19:34:51,true,6,,,,LD,LA CROIX BELET,16360,CONDEON,,,16105,,,,,,,,,,,,,,,,,,,2018-02-28,F,,,,,02.40Z,NAFRev2,N,-0.124843,45.400493,0.45,street,Impasse de la Croisée 16360 Condéon,16105_0770,G,IMPASSE DE LA CROISEE,
356000547,03927,35600054703927,O,1991-01-01,NN,,,2006-10-28T00:11:47,false,3,,,,PL,DE L'EGLISE,16360,CONDEON,,,16105,,,,,,,,,,,,,,,,,,,2006-01-01,F,BUREAU DE POSTE,,,,64.1A,NAFRev1,N,-0.137851,45.407772,0.75,street,Rue de l’Eglise 16360 Condéon,16105_0860,G,RUE DE L EGLISE,
377879465,00013,37787946500013,O,1990-04-01,NN,,,2019-01-18T08:47:47,true,3,,,,LD,MAINE LIONCELLE,16360,CONDEON,,,16105,,,,,,,,,,,,,,,,,,,2008-01-01,A,,,,,68.20B,NAFRev2,N,-0.122836,45.396836,0.37,street,Chemin du Grand Maine 16360 Condéon,16105_1120,G,CHEMIN DU GRAND MAINE,
378519797,00021,37851979700021,O,2017-02-21,,,,2021-02-23T11:07:13,true,1,,,,,LE MAS,16360,CONDEON,,,16105,,,,,,,,,,,,,,,,,,,2017-02-21,A,,,,,01.11Z,NAFRev2,O,-0.148154,45.413421,0.52,street,Chemin du Mas 16360 Condéon,16105_1260,G,CHEMIN DU MAS,
378765655,00014,37876565500014,O,1990-01-01,NN,,,2008-01-04T21:20:39,true,3,,,,LD,LE PENILLON,16360,CONDEON,,,16105,,,,,,,,,,,,,,,,,,,2008-01-01,A,,,,,68.20B,NAFRev2,N,-0.156113,45.409343,0.7,street,Chemin du Penillon 16360 Condéon,16105_1470,G,CHEMIN DU PENILLON,
379924889,00015,37992488900015,O,1990-11-01,NN,,,2008-01-04T21:35:15,true,3,,,,,,16360,CONDEON,,,16105,,,,,,,,,,,,,,,,,,,2008-01-01,A,,,,,01.11Z,NAFRev2,N,,,0,,,,,,
380085944,00011,38008594400011,O,1990-11-16,NN,,,2022-03-21T11:41:47,true,3,,4,,CHE,DU MAS,16360,CONDEON,,,16105,,,,,,,,,,,,,,,,,,,2008-01-01,A,,,,,68.20B,NAFRev2,N,-0.147455,45.41377,0.8,housenumber,4 Chemin du Mas 16360 Condéon,16105_1260_00004,G,4 CHEMIN DU MAS,
380284836,00018,38028483600018,O,,NN,,,,true,1,,,,,LES FAURIENS,16360,CONDEON,,,16105,,,,,,,,,,,,,,,,,,,1993-03-31,F,,,,,93.0N,NAF1993,N,-0.17154,45.383783,0.79,street,Chemin des Fauriens 16360 Condéon,16105_0880,G,CHEMIN DES FAURIENS,
380570127,00015,38057012700015,O,1991-01-01,NN,,,,true,1,,,,,LE COURET,16360,CONDEON,,,16105,,,,,,,,,,,,,,,,,,,2000-08-17,F,,,,,02.0B,NAF1993,N,-0.12423,45.401309,0.38,street,Route de la Gourdine 16360 Condéon,16105_1090,G,ROUTE DE LA GOURDINE,
381140144,00019,38114014400019,O,1990-10-01,NN,,,2010-04-18T05:49:22,true,5,,,,LD,CHEZ CHAGNAUD,16360,CONDEON,,,16105,,,,,,,,,,,,,,,,,,,2008-09-19,F,,,,,43.12A,NAFRev2,O,-0.12643,45.427831,0.51,street,Chemin de Chez Charpentier 16360 Condéon,16105_0430,G,CHEMIN DE CHEZ CHARPENTIER,
384769766,00013,38476976600013,O,1992-03-01,NN,,,2019-06-24T13:14:08,true,4,,,,,LA FONTAINE ROUILLEE,16360,CONDEON,,,16105,,,,,,,,,,,,,,,,,,,2014-12-31,A,,,,,01.41Z,NAFRev2,O,-0.155716,45.393842,0.92,street,Chemin de la Fontaine Rouillée 16360 Condéon,16105_0930,G,CHEMIN DE LA FONTAINE ROUILLEE,
389860362,00018,38986036200018,O,1993-01-01,NN,,,2016-10-18T09:59:40,false,4,,,,,CHEZ NADAUD,16360,CONDEON,,,16105,,,,,,,,,,,,,,,,,,,2016-09-30,F,,,,,01.11Z,NAFRev2,N,-0.1462,45.410857,0.62,street,Chemin de Chez Nadeau 16360 Condéon,16105_0610,G,CHEMIN DE CHEZ NADEAU,
389860362,00026,38986036200026,O,2014-05-14,01,2020,,2022-08-29T09:14:25,true,3,,,,LD,LE GRAND FIEF,16360,CONDEON,,,16105,,,,,,,,,,,,,,,,,,,2022-02-01,F,,,,,43.99C,NAFRev2,O,-0.122836,45.396836,0.42,street,Chemin du Grand Maine 16360 Condéon,16105_1120,G,CHEMIN DU GRAND MAINE,
390478899,00011,39047889900011,O,1993-03-01,NN,,,2019-01-17T09:50:36,true,3,,,,LD,MAINE LIONCELLE,16360,CONDEON,,,16105,,,,,,,,,,,,,,,,,,,2008-01-01,A,,,,,68.20A,NAFRev2,N,-0.122836,45.396836,0.37,street,Chemin du Grand Maine 16360 Condéon,16105_1120,G,CHEMIN DU GRAND MAINE,
391210499,00011,39121049900011,O,1993-04-01,NN,,,2009-03-13T10:39:31,true,4,,,,,CHEZ MAILLOCHAUD,16360,CONDEON,,,16105,,,,,,,,,,,,,,,,,,,2008-12-31,F,,,,,68.20B,NAFRev2,N,-0.152705,45.409295,0.4,street,Chemin de Chez Maurin 16360 Condéon,16105_0580,G,CHEMIN DE CHEZ MAURIN,
391843273,00015,39184327300015,O,1993-04-01,,,,2010-07-01T05:03:27,true,3,,,,,CHEZ MAILLOCHAUD,16360,CONDEON,,,16105,,,,,,,,,,,,,,,,,,,2006-12-31,F,,,,,01.1G,NAFRev1,N,-0.152705,45.409295,0.4,street,Chemin de Chez Maurin 16360 Condéon,16105_0580,G,CHEMIN DE CHEZ MAURIN,
393870266,00011,39387026600011,O,1994-02-10,NN,,,2020-02-20T19:35:48,true,3,MME NAU MADELEINE,,,LD,LE COURET,16360,CONDEON,,,16105,,,,,,,,,,,,,,,,,,,2008-01-01,A,,,,,02.20Z,NAFRev2,N,-0.12423,45.401309,0.38,street,Route de la Gourdine 16360 Condéon,16105_1090,G,ROUTE DE LA GOURDINE,
397595943,00010,39759594300010,O,1981-01-01,NN,,,,true,1,,,,,CHEZ CARTIER,16360,CONDEON,,,16105,,,,,,,,,,,,,,,,,,,2002-09-30,F,,,,,01.1G,NAF1993,N,-0.116047,45.392039,0.93,street,Chemin de Chez Cartier 16360 Condéon,16105_0410,G,CHEMIN DE CHEZ CARTIER,
398560102,00012,39856010200012,O,1994-10-01,NN,,,2016-03-03T08:02:30,true,4,,,,,PUYBON,16360,CONDEON,,,16105,,,,,,,,,,,,,,,,,,,2015-12-31,F,,,,,01.11Z,NAFRev2,N,-0.126758,45.409124,0.92,street,Route de Puybon 16360 Condéon,16105_1570,G,ROUTE DE PUYBON,
399829761,00010,39982976100010,O,1995-01-02,NN,,,,true,4,,,,,LES HAUTS VIGNONS,16360,CONDEON,,,16105,,,,,,,,,,,,,,,,,,,2001-11-22,F,,,,,70.2B,NAF1993,N,-0.105543,45.433023,0.53,street,Chemin des Bas Vignons 16360 Condéon,16105_0100,G,CHEMIN DES BAS VIGNONS,
400274262,00015,40027426200015,O,1995-01-01,01,2020,,2022-08-29T09:21:20,true,3,GRANDS NADAUDS,,,,GRANDS NADAUDS,16360,CONDEON,,,16105,,,,,,,,,,,,,,,,,,,2008-01-01,A,,,,,01.11Z,NAFRev2,N,-0.127056,45.40957,0.35,street,Chemin des Grandes Versennes 16360 Condéon,16105_1150,G,CHEMIN DES GRANDES VERSENNES,
400519120,00010,40051912000010,O,1995-01-02,NN,,,2006-11-25T13:55:01,true,1,,,,LD,LES HAUTS VIGNONS,16360,CONDEON,,,16105,,,,,,,,,,,,,,,,,,,2001-11-22,F,,,,,74.1J,NAF1993,N,-0.105543,45.433023,0.53,street,Chemin des Bas Vignons 16360 Condéon,16105_0100,G,CHEMIN DES BAS VIGNONS,
400893947,00012,40089394700012,O,1995-04-01,02,2019,,2021-10-27T08:27:16,true,3,,,,LD,CHEZ BRAUD,16360,CONDEON,,,16105,,,,,,,,,,,,,,,,,,,2008-01-01,A,,,,,01.21Z,NAFRev2,N,-0.144662,45.417448,0.92,street,Chemin de Chez Braud 16360 Condéon,16105_0390,G,CHEMIN DE CHEZ BRAUD,
401094800,00018,40109480000018,O,1995-04-01,NN,,,2013-06-12T09:05:26,true,4,,,,,CHEZ BRAUD,16360,CONDEON,,,16105,,,,,,,,,,,,,,,,,,,2012-12-31,F,,,,,68.20B,NAFRev2,N,-0.144662,45.417448,0.92,street,Chemin de Chez Braud 16360 Condéon,16105_0390,G,CHEMIN DE CHEZ BRAUD,
401202429,00015,40120242900015,O,1995-01-01,NN,,,2007-08-17T08:15:14,true,3,,,,LD,LA SERVANTE,16360,CONDEON,,,16105,,,,,,,,,,,,,,,,,,,2006-01-30,F,,,,,01.1G,NAFRev1,N,-0.122776,45.404204,0.92,street,Chemin de la Servante 16360 Condéon,16105_1730,G,CHEMIN DE LA SERVANTE,
402116537,00018,40211653700018,O,1995-07-31,NN,,,2022-03-23T04:06:34,true,3,,,,LD,LE MAINE A BARRET,16360,CONDEON,,,16105,,,,,,,,,,,,,,,,,,,2008-01-01,A,,,,,68.20A,NAFRev2,N,-0.160291,45.37796,0.39,street,Chemin des Landes a Baret 16360 Condéon,16105_1200,G,CHEMIN DES LANDES A BARET,
403766918,00029,40376691800029,O,2000-01-01,NN,,,,false,3,,,,,BOIS DE MAURE,16360,CONDEON,,,16105,,,,,,,,,,,,,,,,,,,2003-12-31,F,,,,,55.2E,NAFRev1,N,-0.152705,45.409295,0.42,street,Chemin de Chez Maurin 16360 Condéon,16105_0580,G,CHEMIN DE CHEZ MAURIN,
403912975,00014,40391297500014,O,1900-01-01,NN,,,2019-06-27T09:19:29,false,3,,,,LD,LA THIBEAUDERIE,16360,CONDEON,,,16105,,,,,,,,,,,,,,,,,,,1997-11-30,F,,,,,01.4B,NAF1993,N,-0.157741,45.400315,0.76,street,Chemin de la Thibauderie 16360 Condéon,16105_1790,G,CHEMIN DE LA THIBAUDERIE,
404674723,00014,40467472300014,O,1995-06-01,NN,,,2010-11-29T11:17:28,true,3,,,,,LA THIBAUDERIE,16360,CONDEON,,,16105,,,,,,,,,,,,,,,,,,,2005-12-31,F,,,,,74.5A,NAFRev1,N,-0.157741,45.400315,0.92,street,Chemin de la Thibauderie 16360 Condéon,16105_1790,G,CHEMIN DE LA THIBAUDERIE,
404919235,00022,40491923500022,O,1999-06-10,NN,,3240ZZ,2015-03-17T00:47:13,true,3,,,,LD,CHEZ JEAN DE GRANGE,16360,CONDEON,,,16105,,,,,,,,,,,,,,,,,,,2008-01-01,A,,,,,32.40Z,NAFRev2,N,-0.116047,45.392039,0.4,street,Chemin de Chez Cartier 16360 Condéon,16105_0410,G,CHEMIN DE CHEZ CARTIER,
405002072,00016,40500207200016,O,1996-03-11,,,,2008-07-29T11:50:09,true,3,,,,,LE MEDILLON,16360,CONDEON,,,16105,,,,,,,,,,,,,,,,,,,2004-12-31,F,,,,,74.5A,NAFRev1,N,-0.156113,45.409343,0.4,street,Chemin du Penillon 16360 Condéon,16105_1470,G,CHEMIN DU PENILLON,
405386368,00014,40538636800014,O,1996-04-20,NN,,,2010-04-22T16:56:55,false,4,,,,,FERME DE L'ETANG VERT,16360,CONDEON,,,16105,,,,,,,,,,,,,,,,,,,2010-02-09,F,,,,,68.20A,NAFRev2,N,6.4004145,49.003453,0.71,poi.farmyard,Ferme de l'Étang (Corps de ferme) Rémilly,https://osm.org/way/108692906,G,,
408024396,00017,40802439600017,O,1996-07-01,01,2020,,2022-08-29T09:25:43,true,4,,,,,CHEZ REAUD,16360,CONDEON,,,16105,,,,,,,,,,,,,,,,,,,2012-11-30,A,,,,,01.21Z,NAFRev2,O,-0.129709,45.423593,0.75,street,Chemin de Chez Réau 16360 Condéon,16105_0660,G,CHEMIN DE CHEZ REAU,
408058618,00013,40805861800013,O,1996-07-01,NN,,,2008-01-04T21:03:49,true,5,,,,,,16360,CONDEON,,,16105,,,,,,,,,,,,,,,,,,,2008-01-01,A,,,,,68.20B,NAFRev2,N,,,0,,,,,,
408716991,00018,40871699100018,O,1996-08-27,NN,,,2012-11-28T09:47:43,true,4,,,,,CHEZ REAU,16360,CONDEON,,,16105,,,,,,,,,,,,,,,,,,,2012-05-03,F,,,,,68.20B,NAFRev2,N,-0.129709,45.423593,0.92,street,Chemin de Chez Réau 16360 Condéon,16105_0660,G,CHEMIN DE CHEZ REAU,
409666245,00017,40966624500017,O,,NN,,,,true,1,,,,,CHEZ BEQUET,16360,CONDEON,,,16105,,,,,,,,,,,,,,,,,,,1997-10-12,F,,,,,01.3Z,NAF1993,N,-0.102609,45.418994,0.47,street,Chemin de Chez Bonnin 16360 Condéon,16105_0370,G,CHEMIN DE CHEZ BONNIN,
409666252,00013,40966625200013,O,1984-12-31,NN,,,2010-01-12T08:44:34,true,4,,,,,LES FORETS,16360,CONDEON,,,16105,,,,,,,,,,,,,,,,,,,2009-11-30,F,,,,,01.11Z,NAFRev2,N,4.371904,44.7040971,0.89,poi.forest,Les Palets (Forêt) Genestelle,https://osm.org/relation/281517,G,,
409666260,00016,40966626000016,O,1982-12-31,NN,,,,true,4,,,,,CHEZ RENARD,16360,CONDEON,,,16105,,,,,,,,,,,,,,,,,,,2003-03-31,F,,,,,01.1A,NAFRev1,N,-0.113565,45.385047,0.92,street,Chemin de Chez Renard 16360 Condéon,16105_0670,G,CHEMIN DE CHEZ RENARD,