siren,nic,siret,statutDiffusionEtablissement,dateCreationEtablissement,trancheEffectifsEtablissement,anneeEffectifsEtablissement,activitePrincipaleRegistreMetiersEtablissement,dateDernierTraitementEtablissement,etablissementSiege,nombrePeriodesEtablissement,complementAdresseEtablissement,numeroVoieEtablissement,indiceRepetitionEtablissement,typeVoieEtablissement,libelleVoieEtablissement,codePostalEtablissement,libelleCommuneEtablissement,libelleCommuneEtrangerEtablissement,distributionSpecialeEtablissement,codeCommuneEtablissement,codeCedexEtablissement,libelleCedexEtablissement,codePaysEtrangerEtablissement,libellePaysEtrangerEtablissement,complementAdresse2Etablissement,numeroVoie2Etablissement,indiceRepetition2Etablissement,typeVoie2Etablissement,libelleVoie2Etablissement,codePostal2Etablissement,libelleCommune2Etablissement,libelleCommuneEtranger2Etablissement,distributionSpeciale2Etablissement,codeCommune2Etablissement,codeCedex2Etablissement,libelleCedex2Etablissement,codePaysEtranger2Etablissement,libellePaysEtranger2Etablissement,dateDebut,etatAdministratifEtablissement,enseigne1Etablissement,enseigne2Etablissement,enseigne3Etablissement,denominationUsuelleEtablissement,activitePrincipaleEtablissement,nomenclatureActivitePrincipaleEtablissement,caractereEmployeurEtablissement,longitude,latitude,geo_score,geo_type,geo_adresse,geo_id,geo_ligne,geo_l4,geo_l5
180070039,01175,18007003901175,O,1983-11-21,21,2020,,2022-08-29T09:04:06,false,3,,,,,STATION DE MAGNERAUD,17700,SAINT PIERRE D'AMILLY,,,17382,,,,,,,,,,,,,,,,,,,2008-01-01,A,DOMAINE EXPERIMENTAL DU MAGNERAUD,,,,72.19Z,NAFRev2,O,-0.694688,46.1699,0.35,street,Rue de la Panification 17700 Saint-Pierre-d'Amilly,17382_0030,G,RUE DE LA PANIFICATION,
180089286,00033,18008928600033,O,1991-10-01,12,2020,,2022-08-29T09:04:07,false,4,UNITE EXPERIMENTALE DU MAGNERAUD,,,,,17700,SAINT PIERRE D'AMILLY,,BP 52,17382,,,,,,,,,,,,,,,,,,,2008-01-01,A,GEVES LE MAGNERAUD,,,,72.19Z,NAFRev2,N,,,0,,,,,,
211703822,00018,21170382200018,O,1983-03-01,02,2020,,2022-08-29T09:06:09,true,4,,,,PL,DE LA MAIRIE,17700,SAINT PIERRE D'AMILLY,,,17382,,,,,,,,,,,,,,,,,,,2008-01-01,A,MAIRIE,,,,84.11Z,NAFRev2,O,-0.690326,46.16775,0.82,street,Place de la Mairie 17700 Saint-Pierre-d'Amilly,17382_0021,G,PLACE DE LA MAIRIE,
211703822,00026,21170382200026,O,1983-12-21,01,2019,,2021-10-27T08:07:04,false,4,HAMEAU LA REVETIZON,,,RUE,DE L'ECOLE,17700,SAINT PIERRE D'AMILLY,,,17382,,,,,,,,,,,,,,,,,,,2008-11-20,A,ECOLE ELEMENTAIRE,,,,85.20Z,NAFRev2,N,-0.688178,46.16688,0.94,street,Rue de l’Ecole 17700 Saint-Pierre-d'Amilly,17382_0012,G,RUE DE L ECOLE,
211703822,00034,21170382200034,O,2000-06-01,NN,,,2008-01-04T18:27:09,false,3,,,,,LA VARENNE,17700,SAINT PIERRE D'AMILLY,,,17382,,,,,,,,,,,,,,,,,,,2008-01-01,A,LOTISSEMENT LA VARENNE,,,,42.99Z,NAFRev2,N,-0.664594,46.173247,0.92,street,Impasse de la Varenne 17700 Saint-Pierre-d'Amilly,17382_0054,G,IMPASSE DE LA VARENNE,
211703822,00042,21170382200042,O,2003-11-27,NN,,,2013-10-05T12:23:49,false,4,MAIRIE,,,PL,DE LA MAIRIE,17700,SAINT PIERRE D'AMILLY,,,17382,,,,,,,,,,,,,,,,,,,2012-12-25,F,LOTISSEMENT COMMUNAL R DE MORTAGNE,,,,42.99Z,NAFRev2,N,-0.690326,46.16775,0.82,street,Place de la Mairie 17700 Saint-Pierre-d'Amilly,17382_0021,G,PLACE DE LA MAIRIE,
261704134,00012,26170413400012,O,1984-03-20,NN,,,2020-11-30T12:04:25,true,4,MAIRIE,,,,,17700,SAINT PIERRE D'AMILLY,,,17382,,,,,,,,,,,,,,,,,,,2020-07-10,F,CCAS,,,,88.99B,NAFRev2,N,-0.686707,46.166589,0.92,street,Rue de la Mairie 17700 Saint-Pierre-d'Amilly,17382_0024,D,RUE DE LA MAIRIE,
291702843,00017,29170284300017,O,,NN,,,2006-11-25T09:10:27,true,1,,,,,MAIRIE,17700,SAINT PIERRE D'AMILLY,,,17382,,,,,,,,,,,,,,,,,,,1988-06-29,F,,,,,90.12,NAP,N,-0.686707,46.166589,0.92,street,Rue de la Mairie 17700 Saint-Pierre-d'Amilly,17382_0024,G,RUE DE LA MAIRIE,
303604508,00018,30360450800018,O,,NN,,,,true,1,,,,,COURDEAULT,17700,SAINT PIERRE D'AMILLY,,,17382,,,,,,,,,,,,,,,,,,,1988-12-31,F,,,,,87.07,NAP,N,-0.69897,46.186126,0.92,locality,Grand Courdeault 17700 Saint-Pierre-d'Amilly,17382_B050,G,GRAND COURDEAULT,
304764301,00038,30476430100038,O,1900-01-01,NN,,,2008-01-04T19:32:11,false,3,,,,,CENTRE LOISIRS LE MAGNERAU,17700,SAINT PIERRE D'AMILLY,,,17382,,,,,,,,,,,,,,,,,,,2008-01-01,A,,,,,94.99Z,NAFRev2,N,,,0,,,,,,
310636535,00059,31063653500059,O,2003-01-01,01,2019,,2021-10-27T08:17:17,false,4,,,,,DOMAINE DE MAGNERAUD,17700,SAINT PIERRE D'AMILLY,,,17382,,,,,,,,,,,,,,,,,,,2013-01-13,A,,,,,94.12Z,NAFRev2,O,-0.687779,46.169762,0.43,street,Rue de Mortagne 17700 Saint-Pierre-d'Amilly,17382_0042,G,RUE DE MORTAGNE,
311045884,00021,31104588400021,O,1993-01-31,NN,,,2008-01-04T20:04:56,true,3,,,,,,17700,SAINT PIERRE D'AMILLY,,,17382,,,,,,,,,,,,,,,,,,,2008-01-01,A,,,,,01.11Z,NAFRev2,N,,,0,,,,,,
313292393,00052,31329239300052,O,2012-09-01,,,,2021-02-23T10:40:05,true,1,,12,,RUE,DE LA MAIRIE,17700,SAINT PIERRE D'AMILLY,,,17382,,,,,,,,,,,,,,,,,,,2012-09-01,A,,,,,16.29Z,NAFRev2,N,-0.688361,46.167398,0.95,housenumber,12 Rue de la Mairie 17700 Saint-Pierre-d'Amilly,17382_0024_00012,G,12 RUE DE LA MAIRIE,
313472565,00024,31347256500024,O,,NN,,,,true,1,,,,,,17700,SAINT PIERRE D'AMILLY,,,17382,,,,,,,,,,,,,,,,,,,,F,,,,,55.60,NAP,N,,,0,,,,,,
313472722,00013,31347272200013,O,,NN,,,,true,1,,,,LD,LORIAS,17700,SAINT PIERRE D'AMILLY,,,17382,,,,,,,,,,,,,,,,,,,,F,,,,,55.72,NAP,N,-0.696268,46.169568,0.92,street,Fief Lorias 17700 Saint-Pierre-d'Amilly,17382_B035,G,FIEF LORIAS,
317062347,00024,31706234700024,O,2015-11-20,,,,2021-02-23T10:42:09,true,1,,,,,BOIS JOLY,17700,SAINT PIERRE D'AMILLY,,,17382,,,,,,,,,,,,,,,,,,,2015-11-20,A,,,,,01.11Z,NAFRev2,N,-0.723505,46.194452,0.94,locality,Bois Joly 17700 Saint-Pierre-d'Amilly,17382_B007,G,BOIS JOLY,
317805331,00012,31780533100012,O,,,,,,true,1,,,,,SIMOUSSAIS,17700,SAINT PIERRE D'AMILLY,,,17382,,,,,,,,,,,,,,,,,,,1986-12-25,F,,,,,69.12,NAP,N,,,0,,,,,,
318238706,00028,31823870600028,O,,,,,,true,1,,,,LD,SIMOUSSAIS,17700,SAINT PIERRE D'AMILLY,,,17382,,,,,,,,,,,,,,,,,,,1985-12-25,F,,,,,55.60,NAP,N,,,0,,,,,,
318588142,00030,31858814200030,O,2010-01-04,,,,2012-11-09T00:18:46,true,2,,10,,RUE,DU SATDE,17700,SAINT PIERRE D'AMILLY,,,17382,,,,,,,,,,,,,,,,,,,2011-05-30,F,,,,,70.22Z,NAFRev2,N,-0.69077,46.168944,0.76,housenumber,10 Rue du Stade 17700 Saint-Pierre-d'Amilly,17382_0045_00010,G,10 RUE DU STADE,
320184161,00026,32018416100026,O,1991-01-01,NN,,,,true,1,,,,,,17700,SAINT PIERRE D'AMILLY,,,17382,,,,,,,,,,,,,,,,,,,1997-10-17,F,,,,,55.3A,NAF1993,O,,,0,,,,,,
322095621,00015,32209562100015,O,1981-06-19,NN,,,2022-08-26T04:07:55,true,4,,,,LD,BOIS JOLI,17700,SAINT PIERRE D'AMILLY,,,17382,,,,,,,,,,,,,,,,,,,2022-08-25,F,,,,,68.20B,NAFRev2,N,-0.723505,46.194452,0.74,locality,Bois Joly 17700 Saint-Pierre-d'Amilly,17382_B007,G,BOIS JOLY,
323028522,00015,32302852200015,O,,NN,,,,true,1,,,,,,17700,SAINT PIERRE D'AMILLY,,,17382,,,,,,,,,,,,,,,,,,,,F,,,,,55.60,NAP,N,,,0,,,,,,
324249747,00019,32424974700019,O,,NN,,,2022-08-13T04:00:16,true,1,,,,,MAIRIE,17700,SAINT PIERRE D'AMILLY,,,17382,,,,,,,,,,,,,,,,,,,1994-03-01,F,,,,,01.4A,NAF1993,N,-0.686707,46.166589,0.92,street,Rue de la Mairie 17700 Saint-Pierre-d'Amilly,17382_0024,G,RUE DE LA MAIRIE,
324973973,00013,32497397300013,O,1982-07-01,NN,,,,true,1,,,,,,17700,SAINT PIERRE D'AMILLY,,,17382,,,,,,,,,,,,,,,,,,,2002-06-30,F,,,,,26.1C,NAF1993,N,,,0,,,,,,
325156461,00015,32515646100015,O,1982-07-20,NN,,,2008-01-04T19:04:00,true,3,,,,,,17700,SAINT PIERRE D'AMILLY,,,17382,,,,,,,,,,,,,,,,,,,2008-01-01,A,,,,,49.39A,NAFRev2,N,,,0,,,,,,
325384824,00018,32538482400018,O,,,,,,true,1,,,,,SIMOUSSAIS,17700,SAINT PIERRE D'AMILLY,,,17382,,,,,,,,,,,,,,,,,,,1984-12-25,F,,,,,55.60,NAP,N,,,0,,,,,,
328377148,00015,32837714800015,O,1983-09-17,NN,,,2012-12-09T05:39:31,true,3,,,,,LA FUIE,17700,SAINT PIERRE D'AMILLY,,,17382,,,,,,,,,,,,,,,,,,,2008-01-01,A,,,,,68.20B,NAFRev2,N,-0.686707,46.166589,0.46,street,Rue de la Mairie 17700 Saint-Pierre-d'Amilly,17382_0024,G,RUE DE LA MAIRIE,
328817598,00027,32881759800027,O,,NN,,,,true,1,,,,,,17700,SAINT PIERRE D'AMILLY,,,17382,,,,,,,,,,,,,,,,,,,1989-06-26,F,,,,,62.11,NAP,N,,,0,,,,,,
329447775,00019,32944777500019,O,1984-03-13,NN,,,2008-11-07T00:47:32,false,3,,,,LD,SIMOUSSAIS,17700,SAINT PIERRE D'AMILLY,,,17382,,,,,,,,,,,,,,,,,,,1993-05-09,F,,,,,45.4A,NAF1993,N,,,0,,,,,,
331722314,00019,33172231400019,O,1984-10-14,NN,,,2008-01-04T20:16:43,true,3,,,,,BELLEVUE,17700,SAINT PIERRE D'AMILLY,,,17382,,,,,,,,,,,,,,,,,,,2008-01-01,A,,,,,01.11Z,NAFRev2,N,2.5461995,48.9185233,0.9,poi.park,Parc Bellevue Livry-Gargan,https://osm.org/relation/5658381,G,,
331894345,00015,33189434500015,O,,,,,,true,1,,,,,,17700,SAINT PIERRE D'AMILLY,,,17382,,,,,,,,,,,,,,,,,,,1990-12-31,F,,,,,67.01,NAP,N,,,0,,,,,,
332379502,00013,33237950200013,O,,NN,,,,true,1,,,,LD,SIMOUSSAIS,17700,SAINT PIERRE D'AMILLY,,,17382,,,,,,,,,,,,,,,,,,,1992-09-30,F,,,,,45.2V,NAF1993,N,,,0,,,,,,
332980556,00010,33298055600010,O,1985-04-01,NN,,,2008-01-04T20:33:04,true,3,,,,RUE,DU STADE,17700,SAINT PIERRE D'AMILLY,,,17382,,,,,,,,,,,,,,,,,,,2008-01-01,A,,,,,01.49Z,NAFRev2,N,-0.691562,46.169679,0.95,street,Rue du Stade 17700 Saint-Pierre-d'Amilly,17382_0045,G,RUE DU STADE,
338812977,00027,33881297700027,O,1997-10-13,NN,,,2014-10-31T09:12:19,false,4,,4,,RUE,DU STADE,17700,SAINT PIERRE D'AMILLY,,,17382,,,,,,,,,,,,,,,,,,,2014-10-01,F,,,,,68.20B,NAFRev2,N,-0.690065,46.168393,0.95,housenumber,4 Rue du Stade 17700 Saint-Pierre-d'Amilly,17382_0045_00004,G,4 RUE DU STADE,
340351394,00010,34035139400010,O,1987-01-20,NN,,,2010-03-09T03:57:33,true,1,,,,RUE,DE LA MARE,17700,SAINT PIERRE D'AMILLY,,,17382,,,,,,,,,,,,,,,,,,,1998-03-31,F,,,,,01.1A,NAF1993,N,-0.692434,46.167984,0.94,street,Rue de la Mare 17700 Saint-Pierre-d'Amilly,17382_0027,G,RUE DE LA MARE,
343979613,00019,34397961300019,O,1987-09-29,NN,,,2020-12-04T03:42:33,true,6,,,,,,17700,SAINT PIERRE D'AMILLY,,,17382,,,,,,,,,,,,,,,,,,,2020-12-31,F,,,,,01.13Z,NAFRev2,N,,,0,,,,,,
343979613,00027,34397961300027,O,2017-02-21,,,,2020-12-04T03:42:33,false,2,,,,,AMILLY,17700,SAINT PIERRE D'AMILLY,,,17382,,,,,,,,,,,,,,,,,,,2020-12-31,F,,,,,01.13Z,NAFRev2,N,-0.686707,46.166589,0.91,street,Rue de la Mairie 17700 Saint-Pierre-d'Amilly,17382_0024,G,RUE DE LA MAIRIE,
347821431,00058,34782143100058,O,2004-03-01,NN,,7410ZP,2021-02-23T11:00:41,true,3,,36,T,RUE,DE LA MAIRIE,17700,SAINT PIERRE D'AMILLY,,,17382,,,,,,,,,,,,,,,,,,,2008-01-01,A,,,,,82.99Z,NAFRev2,N,-0.686205,46.166495,0.95,housenumber,36t Rue de la Mairie 17700 Saint-Pierre-d'Amilly,17382_0024_00036_t,G,36T RUE DE LA MAIRIE,
348725896,00016,34872589600016,O,1988-07-10,NN,,,2021-02-23T11:01:42,true,3,,,,LD,BOIS JOLY,17700,SAINT PIERRE D'AMILLY,,,17382,,,,,,,,,,,,,,,,,,,2008-01-01,A,,,,,01.11Z,NAFRev2,N,-0.723505,46.194452,0.94,locality,Bois Joly 17700 Saint-Pierre-d'Amilly,17382_B007,G,BOIS JOLY,
349502591,00010,34950259100010,O,1989-01-01,01,2020,,2022-08-29T09:31:21,true,4,,,,,LE GRAND COURDEAULT,17700,SAINT PIERRE D'AMILLY,,,17382,,,,,,,,,,,,,,,,,,,2012-12-31,A,,,,,01.50Z,NAFRev2,O,-0.69897,46.186126,0.81,locality,Grand Courdeault 17700 Saint-Pierre-d'Amilly,17382_B050,G,GRAND COURDEAULT,
351931274,00044,35193127400044,O,2019-12-12,,,,2022-09-30T09:12:26,true,2,,10,,RUE,DE LA MAIRIE,17700,SAINT PIERRE D'AMILLY,,,17382,,,,,,,,,,,,,,,,,,,2021-12-31,F,,,,SILVER 925 COMPAGNY,47.89Z,NAFRev2,N,-0.688564,46.167531,0.95,housenumber,10 Rue de la Mairie 17700 Saint-Pierre-d'Amilly,17382_0024_00010,G,10 RUE DE LA MAIRIE,
379694052,00026,37969405200026,O,2011-04-05,,,,2013-09-30T19:24:39,true,1,,16,,RUE,DES NOYERS,17700,SAINT PIERRE D'AMILLY,,,17382,,,,,,,,,,,,,,,,,,,2011-04-05,F,,,,,47.81Z,NAFRev2,N,-0.666372,46.174952,0.95,housenumber,16 Rue des Noyers 17700 Saint-Pierre-d'Amilly,17382_0006_00016,G,16 RUE DES NOYERS,
380471185,00039,38047118500039,O,2013-01-01,01,2019,,2022-10-01T04:58:54,true,2,,,,LD,PEGON,17700,SAINT PIERRE D'AMILLY,,,17382,,,,,,,,,,,,,,,,,,,2013-08-14,A,SOTECMER,,,SOTECMER,46.42Z,NAFRev2,O,,,0,,,,,,
381297498,00010,38129749800010,O,1980-01-01,NN,,,,true,4,,,,LD,LA CHEVALERIE,17700,SAINT PIERRE D'AMILLY,,,17382,,,,,,,,,,,,,,,,,,,2001-02-28,F,,,,,01.1A,NAF1993,N,-0.694953,46.167406,0.41,street,Rue de la Goronnerie 17700 Saint-Pierre-d'Amilly,17382_0018,G,RUE DE LA GORONNERIE,
381822568,00022,38182256800022,O,2003-11-13,NN,,,2014-07-08T01:06:17,true,8,,,,,LE ROSEAU,17700,SAINT PIERRE D'AMILLY,,,17382,,,,,,,,,,,,,,,,,,,2009-02-28,F,P A C T,,,,43.31Z,NAFRev2,O,-0.711264,46.162377,0.94,street,Le Roseau 17700 Saint-Pierre-d'Amilly,17382_1llwfo,G,LE ROSEAU,
381963487,00016,38196348700016,O,1991-01-01,NN,,,2008-01-04T22:02:53,true,3,,,,,BOIS JOLY,17700,SAINT PIERRE D'AMILLY,,,17382,,,,,,,,,,,,,,,,,,,2008-01-01,A,,,,,68.20B,NAFRev2,N,-0.723505,46.194452,0.94,locality,Bois Joly 17700 Saint-Pierre-d'Amilly,17382_B007,G,BOIS JOLY,
382749372,00019,38274937200019,O,1991-05-28,NN,,,2022-07-21T08:37:31,true,4,,,,,LE GRAND COURDEAULT,17700,SAINT PIERRE D'AMILLY,,,17382,,,,,,,,,,,,,,,,,,,2021-10-31,F,,,,,01.11Z,NAFRev2,N,-0.69897,46.186126,0.81,locality,Grand Courdeault 17700 Saint-Pierre-d'Amilly,17382_B050,G,GRAND COURDEAULT,
383316585,00025,38331658500025,O,2005-01-01,,,,2014-05-21T10:27:13,true,2,,36,B,RUE,DE LA MAIRIE,17700,SAINT PIERRE D'AMILLY,,,17382,,,,,,,,,,,,,,,,,,,2008-01-01,A,,,,,90.03B,NAFRev2,N,-0.686421,46.166586,0.95,housenumber,36b Rue de la Mairie 17700 Saint-Pierre-d'Amilly,17382_0024_00036_b,G,36B RUE DE LA MAIRIE,
383448560,00011,38344856000011,O,1991-10-01,NN,,,2018-09-29T12:12:25,true,3,,,,,LE MOULIN DE LA MOTTE,17700,SAINT PIERRE D'AMILLY,,,17382,,,,,,,,,,,,,,,,,,,2008-01-01,A,,,,,01.50Z,NAFRev2,N,-0.68748,46.190177,0.82,locality,Moulin de la Motte 17700 Saint-Pierre-d'Amilly,17382_B061,G,MOULIN DE LA MOTTE,
383572609,00022,38357260900022,O,2012-09-28,,,,2021-02-23T11:11:46,true,1,,24,,RUE,DES NOYERS,17700,SAINT PIERRE D'AMILLY,,,17382,,,,,,,,,,,,,,,,,,,2012-09-28,A,,,,,35.11Z,NAFRev2,N,-0.667258,46.1761,0.95,housenumber,24 Rue des Noyers 17700 Saint-Pierre-d'Amilly,17382_0006_00024,G,24 RUE DES NOYERS,
383993797,00018,38399379700018,O,1991-12-17,NN,,,2015-01-18T04:57:51,false,4,,,,RUE,DES QUATRE VENTS,17700,SAINT PIERRE D'AMILLY,,,17382,,,,,,,,,,,,,,,,,,,2014-09-30,F,,,,,01.11Z,NAFRev2,N,-0.66682,46.173162,0.63,street,Rue des 4 Vents 17700 Saint-Pierre-d'Amilly,17382_0036,G,RUE DES 4 VENTS,
387544224,00018,38754422400018,O,1991-01-01,NN,,,2012-10-24T04:51:28,true,4,SIMOUSSAIS,,,RTE,DE BOISSE,17700,SAINT PIERRE D'AMILLY,,,17382,,,,,,,,,,,,,,,,,,,2012-09-30,F,,,,,01.11Z,NAFRev2,N,-0.68697,46.16761,0.43,street,Rue de Bossay 17700 Saint-Pierre-d'Amilly,17382_0008,G,RUE DE BOSSAY,
387790348,00016,38779034800016,O,1992-05-30,NN,,,2008-01-04T22:59:18,true,3,,,,LD,LE MOULIN DE LA MOTTE,17700,SAINT PIERRE D'AMILLY,,,17382,,,,,,,,,,,,,,,,,,,2008-01-01,A,,,,,68.20B,NAFRev2,N,-0.68748,46.190177,0.82,locality,Moulin de la Motte 17700 Saint-Pierre-d'Amilly,17382_B061,G,MOULIN DE LA MOTTE,
387933823,00016,38793382300016,O,,NN,,,,true,1,,,,LD,SEMOUSSAIS,17700,SAINT PIERRE D'AMILLY,,,17382,,,,,,,,,,,,,,,,,,,1991-01-01,F,,,,,01.00,NAP,N,-0.623986,45.386613,0.72,poi.place_of_worship,Église Saint-Pierre (Lieu de culte) Semoussac,https://osm.org/way/120771062,G,,
388601049,00066,38860104900066,O,2002-07-10,00,2019,4321AB,2021-10-27T08:16:03,true,9,,39,,RUE,DE LA MAIRIE,17700,SAINT PIERRE D'AMILLY,,,17382,,,,,,,,,,,,,,,,,,,2017-10-01,A,,,,,43.21A,NAFRev2,N,-0.685273,46.165897,0.95,housenumber,39 Rue de la Mairie 17700 Saint-Pierre-d'Amilly,17382_0024_00039,G,39 RUE DE LA MAIRIE,
388709297,00781,38870929700781,O,2013-03-01,,,,2014-07-25T19:26:07,false,2,,,,LD,LA METAIRIE,17700,SAINT PIERRE D'AMILLY,,,17382,,,,,,,,,,,,,,,,,,,2014-07-01,F,,,,,35.11Z,NAFRev2,N,-0.665113,46.172679,0.92,street,Rue de la Métairie 17700 Saint-Pierre-d'Amilly,17382_0028,G,RUE DE LA METAIRIE,
391859923,00024,39185992300024,O,2001-07-01,NN,,,2009-12-10T20:05:08,true,5,,,,,LE MAGNERAUD,17700,SAINT PIERRE D'AMILLY,,,17382,,,,,,,,,,,,,,,,,,,2008-09-30,F,,,,,46.32C,NAFRev2,O,,,0,,,,,,
399363365,00012,39936336500012,O,1964-01-01,NN,,,2022-10-27T03:36:44,true,3,,,,,MAIRIE,17700,SAINT PIERRE D'AMILLY,,,17382,,,,,,,,,,,,,,,,,,,2008-01-01,A,,,,,77.31Z,NAFRev2,N,-0.686707,46.166589,0.92,street,Rue de la Mairie 17700 Saint-Pierre-d'Amilly,17382_0024,G,RUE DE LA MAIRIE,
401845847,00052,40184584700052,O,2006-01-01,,,,2011-10-09T05:58:13,true,3,LE ROSEAU,,,,,17700,SAINT PIERRE D'AMILLY,,,17382,,,,,,,,,,,,,,,,,,,2011-09-01,F,,,,,90.03B,NAFRev2,N,-0.711264,46.162377,0.94,street,Le Roseau 17700 Saint-Pierre-d'Amilly,17382_1llwfo,D,LE ROSEAU,
403199797,00016,40319979700016,O,1995-12-15,NN,,,2016-03-04T07:46:12,false,4,,,,LD,BELLEVUE,17700,SAINT PIERRE D'AMILLY,,,17382,,,,,,,,,,,,,,,,,,,2015-11-20,F,,,,,01.11Z,NAFRev2,N,2.5461995,48.9185233,0.9,poi.park,Parc Bellevue Livry-Gargan,https://osm.org/relation/5658381,G,,
403199797,00024,40319979700024,O,2015-11-20,,,,2016-04-20T13:49:16,true,1,,,,,BOIS JOLY,17700,SAINT PIERRE D'AMILLY,,,17382,,,,,,,,,,,,,,,,,,,2015-11-20,A,,,,,01.11Z,NAFRev2,N,-0.723505,46.194452,0.94,locality,Bois Joly 17700 Saint-Pierre-d'Amilly,17382_B007,G,BOIS JOLY,
404189979,00010,40418997900010,O,1996-02-01,NN,,,2008-01-04T20:36:00,true,3,,,,RUE,DES QUATRES VENTS,17700,SAINT PIERRE D'AMILLY,,,17382,,,,,,,,,,,,,,,,,,,2008-01-01,A,,,,,68.20B,NAFRev2,N,-0.66682,46.173162,0.62,street,Rue des 4 Vents 17700 Saint-Pierre-d'Amilly,17382_0036,G,RUE DES 4 VENTS,
404294795,00020,40429479500020,O,2006-10-15,,,,2022-10-21T04:24:43,true,3,,24,,RUE,DES NOYERS SIMOUSSAIS,17700,SAINT PIERRE D'AMILLY,,,17382,,,,,,,,,,,,,,,,,,,2009-12-31,A,,,,,68.20A,NAFRev2,N,-0.667258,46.1761,0.66,housenumber,24 Rue des Noyers 17700 Saint-Pierre-d'Amilly,17382_0006_00024,G,24 RUE DES NOYERS,
409054913,00028,40905491300028,O,2003-02-19,NN,,,2006-11-25T15:19:29,false,3,,6,,RUE,DE LA MAIRIE,17700,SAINT PIERRE D'AMILLY,,,17382,,,,,,,,,,,,,,,,,,,2004-03-19,F,,,,,52.6G,NAFRev1,N,-0.68906,46.167801,0.95,housenumber,6 Rue de la Mairie 17700 Saint-Pierre-d'Amilly,17382_0024_00006,G,6 RUE DE LA MAIRIE,
409972874,00054,40997287400054,O,2019-09-01,00,2020,,2022-08-29T09:27:04,true,1,,,,,RUE DES ECOLES,17700,SAINT PIERRE D'AMILLY,,,17382,,,,,,,,,,,,,,,,,,,2019-09-01,A,,,,,90.01Z,NAFRev2,O,-0.688178,46.16688,0.67,street,Rue de l’Ecole 17700 Saint-Pierre-d'Amilly,17382_0012,G,RUE DE L ECOLE,
412587123,00016,41258712300016,O,1987-12-31,NN,,,2021-02-23T11:34:55,true,4,LA REVETIZON,27,,RUE,DE LA MAIRIE,17700,SAINT PIERRE D'AMILLY,,,17382,,,,,,,,,,,,,,,,,,,2008-01-01,A,,,,,68.20B,NAFRev2,N,-0.686853,46.166845,0.95,housenumber,27 Rue de la Mairie 17700 Saint-Pierre-d'Amilly,17382_0024_00027,G,27 RUE DE LA MAIRIE,
412591422,00016,41259142200016,O,1991-09-29,NN,,,2008-01-04T22:19:14,true,3,,,,,SIMOUSSAIS,17700,SAINT PIERRE D'AMILLY,,,17382,,,,,,,,,,,,,,,,,,,2008-01-01,A,,,,,01.11Z,NAFRev2,N,,,0,,,,,,
412596074,00010,41259607400010,O,1987-12-31,NN,,,2008-01-04T22:19:19,true,3,,,,,LE ROSEAU,17700,SAINT PIERRE D'AMILLY,,,17382,,,,,,,,,,,,,,,,,,,2008-01-01,A,,,,,01.11Z,NAFRev2,N,-0.711264,46.162377,0.94,street,Le Roseau 17700 Saint-Pierre-d'Amilly,17382_1llwfo,G,LE ROSEAU,
412596397,00015,41259639700015,O,1987-12-31,NN,,,2008-01-04T22:19:19,true,3,,,,,SIMOUSSAIS,17700,SAINT PIERRE D'AMILLY,,,17382,,,,,,,,,,,,,,,,,,,2008-01-01,A,,,,,01.11Z,NAFRev2,N,,,0,,,,,,
412596496,00015,41259649600015,O,1987-12-31,NN,,,,true,1,,,,,L OUJARDERIE,17700,SAINT PIERRE D'AMILLY,,,17382,,,,,,,,,,,,,,,,,,,1998-03-01,F,,,,,01.1A,NAF1993,N,-0.694953,46.167406,0.31,street,Rue de la Goronnerie 17700 Saint-Pierre-d'Amilly,17382_0018,G,RUE DE LA GORONNERIE,
417601291,00012,41760129100012,O,,,,,,true,1,,,,,LE COURDAULT,17700,SAINT PIERRE D'AMILLY,,,17382,,,,,,,,,,,,,,,,,,,1997-11-30,F,,,,,01.1A,NAF1993,N,-0.69897,46.186126,0.58,locality,Grand Courdeault 17700 Saint-Pierre-d'Amilly,17382_B050,G,GRAND COURDEAULT,
417642626,00010,41764262600010,O,1998-01-27,NN,,,2008-01-04T23:08:15,true,3,,,,,LE PAVILLON,17700,SAINT PIERRE D'AMILLY,,,17382,,,,,,,,,,,,,,,,,,,2008-01-01,A,,,,,68.20A,NAFRev2,N,-0.694688,46.1699,0.33,street,Rue de la Panification 17700 Saint-Pierre-d'Amilly,17382_0030,G,RUE DE LA PANIFICATION,
418202800,00011,41820280000011,O,1998-03-01,NN,,,2015-06-16T03:32:58,true,3,,,,,L'OUJARDERIE,17700,SAINT PIERRE D'AMILLY,,,17382,,,,,,,,,,,,,,,,,,,2008-01-01,A,,,,,01.11Z,NAFRev2,N,-0.694953,46.167406,0.31,street,Rue de la Goronnerie 17700 Saint-Pierre-d'Amilly,17382_0018,G,RUE DE LA GORONNERIE,
418301297,00010,41830129700010,O,1998-04-06,NN,,4120AZ,2017-01-18T04:44:13,true,6,SIMOUSSAIS,10,,RUE,DE LA CROIX,17700,SAINT PIERRE D'AMILLY,,,17382,,,,,,,,,,,,,,,,,,,2017-01-10,F,,,,,43.99C,NAFRev2,N,-0.66759,46.174874,0.95,housenumber,10 Rue de la Croix 17700 Saint-Pierre-d'Amilly,17382_0009_00010,G,10 RUE DE LA CROIX,
418644399,00010,41864439900010,O,1998-04-23,02,2020,,2022-08-29T09:32:41,true,5,LE PAVILLON,911,,RTE,DEPARTEMENTALE,17700,SAINT PIERRE D'AMILLY,,,17382,,,,,,,,,,,,,,,,,,,2021-06-01,F,,,,,56.10A,NAFRev2,N,6.2322097,48.3888613,0.85,poi.track,Route Départementale (Chemin) Avrainville,https://osm.org/way/492497059,G,,
418688826,00019,41868882600019,O,1997-11-30,NN,,,2009-03-10T05:19:48,true,4,,,,,LE COURDAULT,17700,SAINT PIERRE D'AMILLY,,,17382,,,,,,,,,,,,,,,,,,,2009-01-31,F,,,,,01.11Z,NAFRev2,N,-0.69897,46.186126,0.58,locality,Grand Courdeault 17700 Saint-Pierre-d'Amilly,17382_B050,G,GRAND COURDEAULT,
418828513,00014,41882851300014,O,1998-04-24,NN,,,2011-04-23T09:54:37,false,4,,7,,RUE,DE LA MARE,17700,SAINT PIERRE D'AMILLY,,,17382,,,,,,,,,,,,,,,,,,,2009-06-29,F,,,,,01.50Z,NAFRev2,N,-0.692888,46.167874,0.94,housenumber,7 Rue de la Mare 17700 Saint-Pierre-d'Amilly,17382_0027_00007,G,7 RUE DE LA MARE,
418828513,00022,41882851300022,O,2009-06-29,NN,,,2022-01-19T15:34:28,true,2,,1,,,FIEF DE LA RAMEE,17700,SAINT PIERRE D'AMILLY,,,17382,,,,,,,,,,,,,,,,,,,2012-12-31,A,,,,,01.11Z,NAFRev2,O,-0.696646,46.166112,0.85,locality,Fief de la Ramée 17700 Saint-Pierre-d'Amilly,17382_B034,G,FIEF DE LA RAMEE,
418840781,00011,41884078100011,O,1998-04-30,,,,2016-04-26T04:20:56,false,5,,,,,LE MAGNERAUD,17700,SAINT PIERRE D'AMILLY,,,17382,,,,,,,,,,,,,,,,,,,2014-05-05,F,,,,,10.12Z,NAFRev2,O,,,0,,,,,,
419372370,00033,41937237000033,O,2003-10-01,NN,,,2020-02-20T16:55:47,false,5,BIOPROTEIN TECHNOLOGIES-IN,,,,DOMAINE DU MAGNERAUD,17700,SAINT PIERRE D'AMILLY,,,17382,,,,,,,,,,,,,,,,,,,2020-01-10,F,,,,,72.11Z,NAFRev2,N,-0.687779,46.169762,0.31,street,Rue de Mortagne 17700 Saint-Pierre-d'Amilly,17382_0042,G,RUE DE MORTAGNE,
427895040,00017,42789504000017,O,1998-01-01,NN,,,,true,3,,,,,,17700,SAINT PIERRE D'AMILLY,,,17382,,,,,,,,,,,,,,,,,,,2003-12-31,F,,,,,70.2C,NAFRev1,N,,,0,,,,,,
432390920,00010,43239092000010,O,2000-07-07,NN,,,2009-06-27T09:46:00,true,3,SIMOUSSAIS,24,,RUE,DES NOYERS,17700,SAINT PIERRE D'AMILLY,,,17382,,,,,,,,,,,,,,,,,,,2007-09-30,F,,,,,45.1A,NAFRev1,O,-0.667258,46.1761,0.95,housenumber,24 Rue des Noyers 17700 Saint-Pierre-d'Amilly,17382_0006_00024,G,24 RUE DES NOYERS,
432751550,00018,43275155000018,O,1998-01-01,NN,,,2013-11-27T19:40:06,true,4,,,,,PEGON,17700,SAINT PIERRE D'AMILLY,,,17382,,,,,,,,,,,,,,,,,,,2012-01-31,F,,,,,55.20Z,NAFRev2,N,,,0,,,,,,
434553947,00012,43455394700012,O,2001-02-05,NN,,,2006-12-15T01:18:02,false,3,,6,,RUE,DU STADE,17700,SAINT PIERRE D'AMILLY,,,17382,,,,,,,,,,,,,,,,,,,2004-01-23,F,,,,,01.4B,NAFRev1,N,-0.690379,46.168588,0.95,housenumber,6 Rue du Stade 17700 Saint-Pierre-d'Amilly,17382_0045_00006,G,6 RUE DU STADE,
435086855,00010,43508685500010,O,2001-03-01,NN,,,2017-10-06T03:32:46,true,3,LA CHEVALERIE,,,,LA CHEVALERIE,17700,SAINT PIERRE D'AMILLY,,,17382,,,,,,,,,,,,,,,,,,,2008-01-01,A,,,,,01.11Z,NAFRev2,N,-0.694953,46.167406,0.41,street,Rue de la Goronnerie 17700 Saint-Pierre-d'Amilly,17382_0018,G,RUE DE LA GORONNERIE,