siren,nic,siret,statutDiffusionEtablissement,dateCreationEtablissement,trancheEffectifsEtablissement,anneeEffectifsEtablissement,activitePrincipaleRegistreMetiersEtablissement,dateDernierTraitementEtablissement,etablissementSiege,nombrePeriodesEtablissement,complementAdresseEtablissement,numeroVoieEtablissement,indiceRepetitionEtablissement,typeVoieEtablissement,libelleVoieEtablissement,codePostalEtablissement,libelleCommuneEtablissement,libelleCommuneEtrangerEtablissement,distributionSpecialeEtablissement,codeCommuneEtablissement,codeCedexEtablissement,libelleCedexEtablissement,codePaysEtrangerEtablissement,libellePaysEtrangerEtablissement,complementAdresse2Etablissement,numeroVoie2Etablissement,indiceRepetition2Etablissement,typeVoie2Etablissement,libelleVoie2Etablissement,codePostal2Etablissement,libelleCommune2Etablissement,libelleCommuneEtranger2Etablissement,distributionSpeciale2Etablissement,codeCommune2Etablissement,codeCedex2Etablissement,libelleCedex2Etablissement,codePaysEtranger2Etablissement,libellePaysEtranger2Etablissement,dateDebut,etatAdministratifEtablissement,enseigne1Etablissement,enseigne2Etablissement,enseigne3Etablissement,denominationUsuelleEtablissement,activitePrincipaleEtablissement,nomenclatureActivitePrincipaleEtablissement,caractereEmployeurEtablissement,longitude,latitude,geo_score,geo_type,geo_adresse,geo_id,geo_ligne,geo_l4,geo_l5
026044735,00038,02604473500038,O,,NN,,,,true,1,,,,,LE BEAU QUEZIN,22980,LA LANDEC,,,22097,,,,,,,,,,,,,,,,,,,,F,,,,,69.12,NAP,N,-2.177999,48.424993,0.58,street,Le Beau Guérin 22980 La Landec,22097_B012,G,LE BEAU GUERIN,
027250240,00044,02725024000044,O,2014-07-25,,,,2017-03-07T03:18:55,false,2,ZA DE BEAUVENT,,,,,22980,LA LANDEC,,,22097,,,,,,,,,,,,,,,,,,,2016-07-31,F,,,,,43.99C,NAFRev2,N,-2.191762,48.4287,0.75,street,Butte de Beauvent 22980 La Landec,22097_ys6zxw,D,BUTTE DE BEAUVENT,
212200976,00018,21220097600018,O,1983-03-01,03,2020,,2022-08-29T09:06:19,true,3,,,,,LE BOURG,22980,LA LANDEC,,,22097,,,,,,,,,,,,,,,,,,,2008-01-01,A,MAIRIE,,,,84.11Z,NAFRev2,O,-2.179458,48.435746,0.95,street,Le Bourg 22980 La Landec,22097_ftpiax,G,LE BOURG,
212200976,00026,21220097600026,O,1998-01-01,NN,,,2021-12-16T09:37:08,false,4,MAIRIE,,,,LE BOURG,22980,LA LANDEC,,,22097,,,,,,,,,,,,,,,,,,,2021-11-25,F,LOTISSEMENT COMMUNAL,,,,42.99Z,NAFRev2,N,-2.179458,48.435746,0.95,street,Le Bourg 22980 La Landec,22097_ftpiax,G,LE BOURG,
212200976,00034,21220097600034,O,2000-12-25,NN,,,2009-08-06T11:33:51,false,3,MAIRIE,,,,LE BOURG,22980,LA LANDEC,,,22097,,,,,,,,,,,,,,,,,,,2008-12-25,F,LOGEMENTS SOCIAUX,,,,68.20A,NAFRev2,N,-2.179458,48.435746,0.95,street,Le Bourg 22980 La Landec,22097_ftpiax,G,LE BOURG,
212200976,00042,21220097600042,O,2002-01-01,NN,,,2009-08-06T14:13:31,false,4,MAIRIE,,,,LE BOURG,22980,LA LANDEC,,,22097,,,,,,,,,,,,,,,,,,,2008-12-25,F,LOTISSEMENT LES CHATAIGNIERS,,,,42.99Z,NAFRev2,N,-2.179458,48.435746,0.95,street,Le Bourg 22980 La Landec,22097_ftpiax,G,LE BOURG,
212200976,00059,21220097600059,O,2003-05-05,NN,,,2009-08-06T14:22:39,false,3,MAIRIE,,,,LE BOURG,22980,LA LANDEC,,,22097,,,,,,,,,,,,,,,,,,,2008-01-01,F,LOTISSEMENT RESIDENCELE BASTAQUIN,,,,42.99Z,NAFRev2,N,-2.179458,48.435746,0.95,street,Le Bourg 22980 La Landec,22097_ftpiax,G,LE BOURG,
212200976,00067,21220097600067,O,2005-04-11,,,,2013-03-30T12:05:12,false,3,MAIRIE,,,,LE BOURG,22980,LA LANDEC,,,22097,,,,,,,,,,,,,,,,,,,2011-09-23,F,LOTISSEMENT RESIDENCE DE LA VALLEE,,,,42.99Z,NAFRev2,N,-2.179458,48.435746,0.95,street,Le Bourg 22980 La Landec,22097_ftpiax,G,LE BOURG,
262203128,00018,26220312800018,O,1984-09-17,NN,,,2010-06-26T03:06:35,true,3,MAIRIE,,,,LE BOURG,22980,LA LANDEC,,,22097,,,,,,,,,,,,,,,,,,,2008-01-01,A,CCAS,,,,88.99B,NAFRev2,N,-2.179458,48.435746,0.95,street,Le Bourg 22980 La Landec,22097_ftpiax,G,LE BOURG,
300801610,00035,30080161000035,O,,NN,,,,true,1,,,,LD,LE VAUGLAIS,22980,LA LANDEC,,,22097,,,,,,,,,,,,,,,,,,,1993-12-25,F,,,,,50.2Z,NAF1993,N,-2.170442,48.432771,0.79,street,Le Veauglais 22980 La Landec,22097_58w0a0,G,LE VEAUGLAIS,
308956820,00036,30895682000036,O,1992-12-01,NN,,,2008-01-04T19:52:16,true,3,,,,,PORTE AU BARBIER,22980,LA LANDEC,,,22097,,,,,,,,,,,,,,,,,,,2008-01-01,A,,,,,01.43Z,NAFRev2,N,-2.177509,48.42352,0.94,street,La Porte au Barbier 22980 La Landec,22097_B509,G,LA PORTE AU BARBIER,
309475556,00028,30947555600028,O,1900-01-01,NN,,,2010-11-03T06:05:34,true,4,,,,,LE BEAU GUERIN,22980,LA LANDEC,,,22097,,,,,,,,,,,,,,,,,,,2010-09-16,F,,,,,49.41B,NAFRev2,N,-2.177999,48.424993,0.94,street,Le Beau Guérin 22980 La Landec,22097_B012,G,LE BEAU GUERIN,
312498678,00019,31249867800019,O,,NN,,,,true,1,,,,LD,LE BAU GUERIN,22980,LA LANDEC,,,22097,,,,,,,,,,,,,,,,,,,,F,,,,,55.70,NAP,N,-2.177999,48.424993,0.81,street,Le Beau Guérin 22980 La Landec,22097_B012,G,LE BEAU GUERIN,
313847162,00028,31384716200028,O,1990-07-02,NN,,,,true,1,,,,,LA TOMBE,22980,LA LANDEC,,,22097,,,,,,,,,,,,,,,,,,,2001-09-30,F,,,,,55.3A,NAF1993,N,-2.180656,48.429722,0.94,street,La Tombe 22980 La Landec,22097_1ezhwo,G,LA TOMBE,
315591487,00022,31559148700022,O,1981-07-16,NN,,4331ZB,2015-03-18T00:59:53,true,5,,,,,LE BEAU GUERIN,22980,LA LANDEC,,,22097,,,,,,,,,,,,,,,,,,,2014-04-30,F,,,,,43.31Z,NAFRev2,O,-2.177999,48.424993,0.94,street,Le Beau Guérin 22980 La Landec,22097_B012,G,LE BEAU GUERIN,
320127160,00036,32012716000036,O,1995-04-01,NN,,,2008-11-07T00:36:08,true,2,,,,,LE VAUGLAIS,22980,LA LANDEC,,,22097,,,,,,,,,,,,,,,,,,,1995-09-08,F,,,,,,,,-2.170442,48.432771,0.79,street,Le Veauglais 22980 La Landec,22097_58w0a0,G,LE VEAUGLAIS,
320259781,00013,32025978100013,O,,NN,,,,true,1,,,,,LA METTRIE,22980,LA LANDEC,,,22097,,,,,,,,,,,,,,,,,,,,F,,,,,01.07,NAP,N,-2.183982,48.410294,0.94,street,La Mettrie 22980 La Landec,22097_lagcyi,G,LA METTRIE,
321988388,00021,32198838800021,O,,,,,,true,1,,,,,ZONE ARTISANALE,22980,LA LANDEC,,,22097,,,,,,,,,,,,,,,,,,,1990-11-20,F,,,,,49.01,NAP,N,-2.191911,48.427083,0.92,locality,Zone Artisanale de Beauven 22980 La Landec,22097_B647,G,ZONE ARTISANALE DE BEAUVEN,
322317132,00031,32231713200031,O,2013-06-28,NN,,4321AB,2021-04-28T19:36:08,true,2,,,,,ZA BEAUVENT,22980,LA LANDEC,,,22097,,,,,,,,,,,,,,,,,,,2018-11-30,F,,,,AM ENERGIES 22,43.21A,NAFRev2,O,-2.187461,48.427956,0.73,street,Beauvent 22980 La Landec,22097_5br22n,G,BEAUVENT,
322762576,00013,32276257600013,O,,NN,,,2008-02-15T04:58:59,true,1,,,,LD,LE BEAU GUERIN,22980,LA LANDEC,,,22097,,,,,,,,,,,,,,,,,,,1990-02-15,F,,,,,45.2T,NAF1993,N,-2.177999,48.424993,0.94,street,Le Beau Guérin 22980 La Landec,22097_B012,G,LE BEAU GUERIN,
322907981,00052,32290798100052,O,1994-10-01,NN,,,2008-11-07T00:39:24,true,4,,,,LD,ZA DE BEAUVENT,22980,LA LANDEC,,,22097,,,,,,,,,,,,,,,,,,,2003-03-31,F,,,,,45.2V,NAFRev1,O,-2.191762,48.4287,0.75,street,Butte de Beauvent 22980 La Landec,22097_ys6zxw,G,BUTTE DE BEAUVENT,
323039941,00014,32303994100014,O,,NN,,,,true,1,,,,,LA RETAUDIERE,22980,LA LANDEC,,,22097,,,,,,,,,,,,,,,,,,,1981-01-01,F,,,,,92.3A,NAF1993,N,-2.191232,48.409694,0.94,street,La Retaudiere 22980 La Landec,22097_98649d,G,LA RETAUDIERE,
323143297,00014,32314329700014,O,,NN,,,,true,1,,,,,LA TOMBE,22980,LA LANDEC,,,22097,,,,,,,,,,,,,,,,,,,,F,,,,,67.07,NAP,N,-2.180656,48.429722,0.94,street,La Tombe 22980 La Landec,22097_1ezhwo,G,LA TOMBE,
323915868,00018,32391586800018,O,1981-01-01,NN,,,2008-01-04T18:51:25,true,3,,,,RTE,DE TREBEDAN,22980,LA LANDEC,,,22097,,,,,,,,,,,,,,,,,,,2008-01-01,A,,,,,68.20A,NAFRev2,N,-2.178375,48.429117,0.32,street,Impasse de la Route des Chenes 22980 La Landec,22097_xljtjj,G,IMPASSE DE LA ROUTE DES CHENES,
324582063,00032,32458206300032,O,2012-05-11,,,,2017-07-27T09:55:55,true,2,,,,,ZA DE BEAUVENT,22980,LA LANDEC,,,22097,,,,,,,,,,,,,,,,,,,2017-07-27,F,,,,MECASERVICES,70.10Z,NAFRev2,N,-2.191762,48.4287,0.75,street,Butte de Beauvent 22980 La Landec,22097_ys6zxw,G,BUTTE DE BEAUVENT,
324604511,00018,32460451100018,O,1982-06-01,,,,,true,3,,,,LD,ZONE ARTISANALE,22980,LA LANDEC,,,22097,,,,,,,,,,,,,,,,,,,1991-12-25,F,,,,,50.2Z,NAF1993,N,-2.191911,48.427083,0.92,locality,Zone Artisanale de Beauven 22980 La Landec,22097_B647,G,ZONE ARTISANALE DE BEAUVEN,
325567774,00014,32556777400014,O,,NN,,,,true,1,,,,,KER ANNE,22980,LA LANDEC,,,22097,,,,,,,,,,,,,,,,,,,,F,,,,,01.80,NAP,N,-4.568538,48.4695041,0.88,poi.bus_stop,Ker Anne (Arrêt de bus) Milizac-Guipronvel,https://osm.org/node/2188960140,G,,
326932787,00012,32693278700012,O,,NN,,,,true,1,,,,,Z A DE BEAUVENT,22980,LA LANDEC,,,22097,,,,,,,,,,,,,,,,,,,2002-02-22,F,,,,,70.2C,NAF1993,N,-2.191762,48.4287,0.7,street,Butte de Beauvent 22980 La Landec,22097_ys6zxw,G,BUTTE DE BEAUVENT,
327450722,00027,32745072200027,O,1983-12-01,NN,,,,true,4,,,,,ZA DE BEAUVENT,22980,LA LANDEC,,,22097,,,,,,,,,,,,,,,,,,,1999-06-01,F,,,,,18.2A,NAF1993,O,-2.191762,48.4287,0.75,street,Butte de Beauvent 22980 La Landec,22097_ys6zxw,G,BUTTE DE BEAUVENT,
329667794,00013,32966779400013,O,1984-04-01,NN,,,2008-05-27T07:49:14,true,1,,,,,LA TOMBE,22980,LA LANDEC,,,22097,,,,,,,,,,,,,,,,,,,2002-06-30,F,,,,,70.2C,NAF1993,N,-2.180656,48.429722,0.94,street,La Tombe 22980 La Landec,22097_1ezhwo,G,LA TOMBE,
329891824,00024,32989182400024,O,,NN,,,,true,1,,,,,ZA DE BEAUVENT,22980,LA LANDEC,,,22097,,,,,,,,,,,,,,,,,,,1996-01-16,F,,,,,60.2M,NAF1993,O,-2.191762,48.4287,0.75,street,Butte de Beauvent 22980 La Landec,22097_ys6zxw,G,BUTTE DE BEAUVENT,
330306358,00012,33030635800012,O,,NN,,,,true,1,,,,,CAYENNE,22980,LA LANDEC,,,22097,,,,,,,,,,,,,,,,,,,,F,,,,,36.10,NAP,N,7.2735922,43.696367,0.9,poi.cafe,Cayenne Café Nice,https://osm.org/node/1867139329,G,,
330592957,00022,33059295700022,O,2006-02-06,,,,2010-12-05T04:28:33,false,3,,,,LD,LA ROSE DES VENTS,22980,LA LANDEC,,,22097,,,,,,,,,,,,,,,,,,,2010-11-25,F,,,,,43.34Z,NAFRev2,N,-2.167348,48.43593,0.63,street,Residence des 4 Vents 22980 La Landec,22097_29nt8h,G,RESIDENCE DES 4 VENTS,
331733261,00019,33173326100019,O,1984-10-01,NN,,,2008-04-05T00:33:36,true,3,,,,,ZONE ARTISANALE BEAUVENT,22980,LA LANDEC,,,22097,,,,,,,,,,,,,,,,,,,2008-01-01,A,,,,,68.20B,NAFRev2,N,-2.191911,48.427083,0.86,locality,Zone Artisanale de Beauven 22980 La Landec,22097_B647,G,ZONE ARTISANALE DE BEAUVEN,
332350990,00013,33235099000013,O,1982-06-01,,,,2008-10-02T10:07:44,true,5,,,,,KER ANNE,22980,LA LANDEC,,,22097,,,,,,,,,,,,,,,,,,,2008-01-01,F,,,,,01.61Z,NAFRev2,N,-4.568538,48.4695041,0.88,poi.bus_stop,Ker Anne (Arrêt de bus) Milizac-Guipronvel,https://osm.org/node/2188960140,G,,
332351089,00021,33235108900021,O,1995-10-16,NN,,,2012-11-27T10:09:38,false,4,,,,,CHANTELOUP,22980,LA LANDEC,,,22097,,,,,,,,,,,,,,,,,,,2003-04-15,F,,,,,01.3Z,NAFRev1,N,-2.18516,48.430018,0.92,locality,Le Clos Chanteloup 22980 La Landec,22097_B111,G,LE CLOS CHANTELOUP,
332351089,00039,33235108900039,O,2012-11-23,,,,2021-02-23T10:52:09,true,1,,4,,,BOUBAN,22980,LA LANDEC,,,22097,,,,,,,,,,,,,,,,,,,2012-11-23,A,,,,,35.11Z,NAFRev2,N,-2.193382,48.42893,0.91,street,La Chênaie de Bouban 22980 La Landec,22097_B093,G,LA CHENAIE DE BOUBAN,
332351097,00024,33235109700024,O,1995-10-17,NN,,,2008-01-29T13:45:23,true,4,,,,,LA TOURBE,22980,LA LANDEC,,,22097,,,,,,,,,,,,,,,,,,,2007-12-31,F,,,,,01.1A,NAFRev1,N,-2.180656,48.429722,0.57,street,La Tombe 22980 La Landec,22097_1ezhwo,G,LA TOMBE,
332570324,00035,33257032400035,O,1993-10-18,NN,,4399CZ,2015-05-14T06:40:37,true,5,ZONE ARTISANALE,,,LD,CAYENNE,22980,LA LANDEC,,,22097,,,,,,,,,,,,,,,,,,,2014-01-01,A,,,,,68.20B,NAFRev2,N,-2.191911,48.427083,0.63,locality,Zone Artisanale de Beauven 22980 La Landec,22097_B647,D,ZONE ARTISANALE DE BEAUVEN,
333559029,00017,33355902900017,O,,,,,,true,1,,,,,LA METTRIE,22980,LA LANDEC,,,22097,,,,,,,,,,,,,,,,,,,1997-01-31,F,,,,,01.3Z,NAF1993,N,-2.183982,48.410294,0.94,street,La Mettrie 22980 La Landec,22097_lagcyi,G,LA METTRIE,
338057466,00017,33805746600017,O,,NN,,,,true,1,,,,LD,LE VIEUX BOURG,22980,LA LANDEC,,,22097,,,,,,,,,,,,,,,,,,,1987-09-29,F,,,,,55.73,NAP,N,-2.181722,48.438596,0.95,street,Le Vieux Bourg 22980 La Landec,22097_B635,G,LE VIEUX BOURG,
338969595,00010,33896959500010,O,,NN,,,,true,1,,,,,LA TOMBE,22980,LA LANDEC,,,22097,,,,,,,,,,,,,,,,,,,1987-02-06,F,,,,,67.01,NAP,N,-2.180656,48.429722,0.94,street,La Tombe 22980 La Landec,22097_1ezhwo,G,LA TOMBE,
340511260,00028,34051126000028,O,2011-01-01,,,4399CZ,2016-04-26T03:35:04,false,3,ZA DE BEAUVENT,,,,,22980,LA LANDEC,,,22097,,,,,,,,,,,,,,,,,,,2014-07-25,F,,,,,43.99C,NAFRev2,N,-2.191762,48.4287,0.75,street,Butte de Beauvent 22980 La Landec,22097_ys6zxw,D,BUTTE DE BEAUVENT,
343169843,00012,34316984300012,O,,NN,,,,true,1,,,,LD,LA TOMBE,22980,LA LANDEC,,,22097,,,,,,,,,,,,,,,,,,,1990-02-28,F,,,,,67.01,NAP,N,-2.180656,48.429722,0.94,street,La Tombe 22980 La Landec,22097_1ezhwo,G,LA TOMBE,
344500756,00038,34450075600038,O,1993-06-01,NN,,,,true,3,,,,,LE DOUETEL,22980,LA LANDEC,,,22097,,,,,,,,,,,,,,,,,,,1993-12-25,F,,,,,52.6E,NAF1993,N,-2.182645,48.41318,0.94,street,Le Douetel 22980 La Landec,22097_tkaakm,G,LE DOUETEL,
344902838,00012,34490283800012,O,1900-01-01,NN,,,2011-04-28T00:37:31,false,3,,,,,LA GIRAUDAIS,22980,LA LANDEC,,,22097,,,,,,,,,,,,,,,,,,,1988-12-25,F,,,,,62.46,NAP,N,-2.195901,48.414978,0.94,street,La Giraudais 22980 La Landec,22097_t0wlb7,G,LA GIRAUDAIS,
350103768,00015,35010376800015,O,1989-04-01,,,,,true,3,,,,,Z A DE BEAUVENT,22980,LA LANDEC,,,22097,,,,,,,,,,,,,,,,,,,1991-12-25,F,,,,,65.03,NAP,N,-2.191762,48.4287,0.7,street,Butte de Beauvent 22980 La Landec,22097_ys6zxw,G,BUTTE DE BEAUVENT,
351279690,00025,35127969000025,O,2009-06-02,,,,2012-11-09T00:41:51,false,2,,,,LD,LE CHESNAY CHEL,22980,LA LANDEC,,,22097,,,,,,,,,,,,,,,,,,,2009-07-06,F,,,,,74.20Z,NAFRev2,N,-2.185598,48.41711,0.95,street,Le Chesnay Chel 22980 La Landec,22097_B101,G,LE CHESNAY CHEL,
351279690,00033,35127969000033,O,2009-07-06,,,,2021-02-23T11:03:54,true,1,,,,LD,LAUNAY ARO,22980,LA LANDEC,,,22097,,,,,,,,,,,,,,,,,,,2009-07-06,A,,,,,74.20Z,NAFRev2,N,-2.178578,48.405943,0.85,locality,Launay Arot 22980 La Landec,22097_B422,G,LAUNAY AROT,
351858345,00025,35185834500025,O,2012-04-24,12,2020,,2022-08-29T09:02:23,true,3,,,,,ZA DE BEAUVENT,22980,LA LANDEC,,,22097,,,,,,,,,,,,,,,,,,,2018-12-31,A,,,,,49.41A,NAFRev2,O,-2.191762,48.4287,0.75,street,Butte de Beauvent 22980 La Landec,22097_ys6zxw,G,BUTTE DE BEAUVENT,
377876198,00021,37787619800021,O,2010-10-01,,,,2021-12-21T11:43:31,true,3,,2,,,BEL AIR,22980,LA LANDEC,,,22097,,,,,,,,,,,,,,,,,,,2021-12-01,A,,,,FRANCOIS PINSAULT,70.22Z,NAFRev2,N,-2.191379,48.434612,0.94,housenumber,2 Bel Air 22980 La Landec,22097_b015_00002,G,2 BEL AIR,
384458535,00018,38445853500018,O,1992-01-20,NN,,,,true,1,,,,,CAYENNE,22980,LA LANDEC,,,22097,,,,,,,,,,,,,,,,,,,1998-12-15,F,,,,,50.1Z,NAF1993,O,7.2735922,43.696367,0.9,poi.cafe,Cayenne Café Nice,https://osm.org/node/1867139329,G,,
387531841,00014,38753184100014,O,1992-04-30,NN,,,2010-04-18T06:07:13,false,5,,,,,KER ANNE,22980,LA LANDEC,,,22097,,,,,,,,,,,,,,,,,,,2009-12-31,F,,,,,01.46Z,NAFRev2,N,-4.568538,48.4695041,0.88,poi.bus_stop,Ker Anne (Arrêt de bus) Milizac-Guipronvel,https://osm.org/node/2188960140,G,,
387531841,00022,38753184100022,O,2009-12-31,,,,2021-02-23T11:13:35,true,1,LA TOMBE,3,,RTE,DES CHENES,22980,LA LANDEC,,,22097,,,,,,,,,,,,,,,,,,,2009-12-31,A,,,,,01.46Z,NAFRev2,N,-2.177618,48.430198,0.83,housenumber,3 Route des Chenes 22980 La Landec,22097_0666_00003,G,3 ROUTE DES CHENES,
388043283,00026,38804328300026,O,1993-12-13,NN,,,,false,3,,,,,BOURG,22980,LA LANDEC,,,22097,,,,,,,,,,,,,,,,,,,1996-01-01,F,,,,,85.1C,NAF1993,N,-2.179458,48.435746,0.93,street,Le Bourg 22980 La Landec,22097_ftpiax,G,LE BOURG,
390903839,00012,39090383900012,O,1993-02-01,00,2020,,2022-08-29T09:15:19,true,5,,20,,,LE CHESNAY CHEL,22980,LA LANDEC,,,22097,,,,,,,,,,,,,,,,,,,2016-01-01,A,,,,,01.46Z,NAFRev2,O,-2.187138,48.416055,0.95,housenumber,20 Le Chesnay Chel 22980 La Landec,22097_b101_00020,G,20 LE CHESNAY CHEL,
391270303,00012,39127030300012,O,1993-03-15,NN,,,2008-01-04T23:50:48,true,3,,,,,BOUBAN,22980,LA LANDEC,,,22097,,,,,,,,,,,,,,,,,,,2008-01-01,A,,,,,01.47Z,NAFRev2,N,-2.193382,48.42893,0.91,street,La Chênaie de Bouban 22980 La Landec,22097_B093,G,LA CHENAIE DE BOUBAN,
392067955,00014,39206795500014,O,,NN,,,,true,1,,,,,LE DOUETEL,22980,LA LANDEC,,,22097,,,,,,,,,,,,,,,,,,,1993-11-07,F,,,,,52.6E,NAF1993,N,-2.182645,48.41318,0.94,street,Le Douetel 22980 La Landec,22097_tkaakm,G,LE DOUETEL,
392769865,00065,39276986500065,O,2015-08-05,,,,2022-06-04T03:48:17,false,2,,3,,RUE,LE VIEUX BOURG,22980,LA LANDEC,,,22097,,,,,,,,,,,,,,,,,,,2022-04-01,F,,,,,32.13Z,NAFRev2,N,-2.181386,48.438659,0.75,housenumber,3 Le Vieux Bourg 22980 La Landec,22097_b635_00003,G,3 LE VIEUX BOURG,
393153135,00016,39315313500016,O,1994-01-01,NN,,,2014-12-07T03:48:14,true,3,,,,,ZONE DE BEAUVENT,22980,LA LANDEC,,,22097,,,,,,,,,,,,,,,,,,,2008-01-01,A,,,,,68.20B,NAFRev2,N,-2.191911,48.427083,0.81,locality,Zone Artisanale de Beauven 22980 La Landec,22097_B647,G,ZONE ARTISANALE DE BEAUVEN,
398676957,00010,39867695700010,O,1994-10-03,NN,,,2008-11-08T01:05:12,true,3,,,,LD,LE CHAMP SORIN,22980,LA LANDEC,,,22097,,,,,,,,,,,,,,,,,,,2006-04-18,F,,,,,36.1K,NAFRev1,N,-2.18516,48.430018,0.39,locality,Le Clos Chanteloup 22980 La Landec,22097_B111,G,LE CLOS CHANTELOUP,
400235677,00020,40023567700020,O,2005-06-13,,,,2014-07-08T01:29:45,true,3,,,,LD,LE CHESNAY CHEL,22980,LA LANDEC,,,22097,,,,,,,,,,,,,,,,,,,2008-09-29,F,,,,,43.34Z,NAFRev2,N,-2.185598,48.41711,0.95,street,Le Chesnay Chel 22980 La Landec,22097_B101,G,LE CHESNAY CHEL,
402504500,00016,40250450000016,O,1972-03-01,NN,,,,true,4,,,,,LA TOUCHE,22980,LA LANDEC,,,22097,,,,,,,,,,,,,,,,,,,1998-12-25,F,,,,,01.3Z,NAF1993,N,-2.180415,48.440543,0.92,street,La Touche Divers 22980 La Landec,22097_f8bgn8,G,LA TOUCHE DIVERS,
402508089,00016,40250808900016,O,1986-01-01,NN,,,2006-11-25T14:57:29,true,3,,,,LD,LA TOMBE,22980,LA LANDEC,,,22097,,,,,,,,,,,,,,,,,,,2006-10-31,F,,,,,01.2E,NAFRev1,N,-2.180656,48.429722,0.94,street,La Tombe 22980 La Landec,22097_1ezhwo,G,LA TOMBE,
408841401,00016,40884140100016,O,1980-01-01,NN,,,2014-07-08T08:17:51,true,4,,,,,GRE DU VENT,22980,LA LANDEC,,,22097,,,,,,,,,,,,,,,,,,,2013-12-31,F,,,,,01.11Z,NAFRev2,N,-2.167348,48.43593,0.4,street,Residence des 4 Vents 22980 La Landec,22097_29nt8h,G,RESIDENCE DES 4 VENTS,
408841419,00018,40884141900018,O,1979-01-01,NN,,,2008-01-04T21:17:29,true,3,,,,,BOUBAN,22980,LA LANDEC,,,22097,,,,,,,,,,,,,,,,,,,2008-01-01,A,,,,,01.11Z,NAFRev2,N,-2.193382,48.42893,0.91,street,La Chênaie de Bouban 22980 La Landec,22097_B093,G,LA CHENAIE DE BOUBAN,
408841427,00011,40884142700011,O,1986-10-01,NN,,,2011-10-28T05:11:35,true,5,,,,,BEAUVANT,22980,LA LANDEC,,,22097,,,,,,,,,,,,,,,,,,,2011-10-31,F,,,,,01.46Z,NAFRev2,N,-2.187461,48.427956,0.62,street,Beauvent 22980 La Landec,22097_5br22n,G,BEAUVENT,
408959245,00015,40895924500015,O,1996-08-26,NN,,,2006-12-15T01:03:18,false,4,,,,,LA TOMBE,22980,LA LANDEC,,,22097,,,,,,,,,,,,,,,,,,,1999-06-03,F,,,,,67.2Z,NAF1993,N,-2.180656,48.429722,0.94,street,La Tombe 22980 La Landec,22097_1ezhwo,G,LA TOMBE,
409024346,00036,40902434600036,O,1998-10-09,,,,,false,2,,,,,LE VIEUX BOURG,22980,LA LANDEC,,,22097,,,,,,,,,,,,,,,,,,,1998-12-25,F,,,,,85.1G,NAF1993,N,-2.181722,48.438596,0.95,street,Le Vieux Bourg 22980 La Landec,22097_B635,G,LE VIEUX BOURG,
410810204,00017,41081020400017,O,,NN,,,,true,1,,,,,LA TOMBE,22980,LA LANDEC,,,22097,,,,,,,,,,,,,,,,,,,1995-10-17,F,,,,,01.4A,NAF1993,N,-2.180656,48.429722,0.94,street,La Tombe 22980 La Landec,22097_1ezhwo,G,LA TOMBE,
411312218,00018,41131221800018,O,1997-02-01,00,2020,,2022-08-29T09:28:14,true,3,,2,,IMP,DE LA METTRIE,22980,LA LANDEC,,,22097,,,,,,,,,,,,,,,,,,,2008-01-01,A,,,,,01.41Z,NAFRev2,N,-2.187583,48.411753,0.74,street,Impasse de la Mettrie 22980 La Landec,22097_b5mx4n,G,IMPASSE DE LA METTRIE,
412229270,00019,41222927000019,O,1996-01-01,NN,,,2006-10-28T04:02:23,true,3,,,,,LA ROSE DES VENTS,22980,LA LANDEC,,,22097,,,,,,,,,,,,,,,,,,,2004-12-31,F,,,,,92.3A,NAFRev1,N,-2.167348,48.43593,0.63,street,Residence des 4 Vents 22980 La Landec,22097_29nt8h,G,RESIDENCE DES 4 VENTS,
414136622,00019,41413662200019,O,1997-01-01,,,,,true,1,,,,,LA BASSE TOUCHE,22980,LA LANDEC,,,22097,,,,,,,,,,,,,,,,,,,2000-09-30,F,,,,,01.1A,NAF1993,N,-2.189037,48.413736,0.94,street,La Basse Touche 22980 La Landec,22097_B008,G,LA BASSE TOUCHE,
421927633,00014,42192763300014,O,1999-01-21,NN,,,2014-05-20T04:30:59,true,3,,,,,LE CHESNAY CHEL,22980,LA LANDEC,,,22097,,,,,,,,,,,,,,,,,,,2008-01-01,A,,,,,68.20B,NAFRev2,N,-2.185598,48.41711,0.95,street,Le Chesnay Chel 22980 La Landec,22097_B101,G,LE CHESNAY CHEL,
422357772,00025,42235777200025,O,1999-03-19,NN,,,,false,4,ZA DE BEAUVENT,,,,CAYENNE,22980,LA LANDEC,,,22097,,,,,,,,,,,,,,,,,,,2001-12-04,F,BELVIEW MARKETING FRANCE,,,,50.1Z,NAF1993,O,7.2735922,43.696367,0.9,poi.cafe,Cayenne Café Nice,https://osm.org/node/1867139329,G,,
422619288,00018,42261928800018,O,1999-04-13,NN,,,2008-11-08T01:41:57,false,4,,,,LD,LA TOMBE,22980,LA LANDEC,,,22097,,,,,,,,,,,,,,,,,,,2002-04-12,F,BATISTORE FERMETURES,,,,45.4C,NAF1993,N,-2.180656,48.429722,0.94,street,La Tombe 22980 La Landec,22097_1ezhwo,G,LA TOMBE,
424563294,00018,42456329400018,O,1999-10-01,NN,,,2014-02-07T11:45:19,true,4,,,,,LE VAUGLAIS,22980,LA LANDEC,,,22097,,,,,,,,,,,,,,,,,,,2013-09-02,F,,,,,82.99Z,NAFRev2,N,-2.170442,48.432771,0.79,street,Le Veauglais 22980 La Landec,22097_58w0a0,G,LE VEAUGLAIS,
429897622,00016,42989762200016,O,1999-03-19,,,,2006-11-25T16:50:43,true,1,,,,,CAYENNE,22980,LA LANDEC,,,22097,,,,,,,,,,,,,,,,,,,1999-03-19,F,,,,,74.1J,NAF1993,N,7.2735922,43.696367,0.9,poi.cafe,Cayenne Café Nice,https://osm.org/node/1867139329,G,,
432611218,00012,43261121800012,O,2000-07-21,NN,,,2008-01-05T20:56:06,true,3,,,,,ZA DE BEAUVENT,22980,LA LANDEC,,,22097,,,,,,,,,,,,,,,,,,,2008-01-01,A,,,,,68.20B,NAFRev2,N,-2.191762,48.4287,0.75,street,Butte de Beauvent 22980 La Landec,22097_ys6zxw,G,BUTTE DE BEAUVENT,
435114350,00026,43511435000026,O,2013-04-05,,,,2018-05-30T12:40:03,true,2,,11,,,RESIDENCE LES NOISETIERS,22980,LA LANDEC,,,22097,,,,,,,,,,,,,,,,,,,2016-07-05,F,,,,,43.99C,NAFRev2,N,-2.178142,48.437421,0.85,housenumber,11 Résidence des Noisetiers 22980 La Landec,22097_a007_00011,G,11 RESIDENCE DES NOISETIERS,
439641291,00026,43964129100026,O,2004-11-02,12,2020,4520AA,2022-08-29T09:15:42,true,5,,11,,,ZONE ARTISANALE DE BEAUVEN,22980,LA LANDEC,,,22097,,,,,,,,,,,,,,,,,,,2021-11-30,A,,,,,45.20A,NAFRev2,N,-2.191911,48.427083,0.86,locality,Zone Artisanale de Beauven 22980 La Landec,22097_B647,G,ZONE ARTISANALE DE BEAUVEN,
439641291,00034,43964129100034,O,2004-11-02,,,2920ZC,2016-04-26T03:07:19,false,3,,11,B,,ZONE ARTISANALE DE BEAUVEN,22980,LA LANDEC,,,22097,,,,,,,,,,,,,,,,,,,2008-01-01,A,,,,,29.20Z,NAFRev2,N,-2.191911,48.427083,0.83,locality,Zone Artisanale de Beauven 22980 La Landec,22097_B647,G,ZONE ARTISANALE DE BEAUVEN,
440294841,00018,44029484100018,O,2002-01-21,NN,,,2006-12-15T01:21:05,false,2,,,,,LA TOMBE,22980,LA LANDEC,,,22097,,,,,,,,,,,,,,,,,,,2002-12-25,F,,,,,55.3A,NAF1993,N,-2.180656,48.429722,0.94,street,La Tombe 22980 La Landec,22097_1ezhwo,G,LA TOMBE,
440294841,00026,44029484100026,O,2003-04-01,NN,,,2011-09-09T09:48:47,false,4,,,,,LA TOMBE,22980,LA LANDEC,,,22097,,,,,,,,,,,,,,,,,,,2011-06-30,F,,,,,01.49Z,NAFRev2,N,-2.180656,48.429722,0.94,street,La Tombe 22980 La Landec,22097_1ezhwo,G,LA TOMBE,
440294841,00034,44029484100034,O,2011-09-01,,,,2011-09-09T09:48:47,true,1,LA TOMBE,2,,RTE,DES CHENES,22980,LA LANDEC,,,22097,,,,,,,,,,,,,,,,,,,2011-09-01,A,,,,,01.49Z,NAFRev2,N,-2.178269,48.430042,0.83,housenumber,2 Route des Chenes 22980 La Landec,22097_0666_00002,G,2 ROUTE DES CHENES,
441543584,00011,44154358400011,O,2002-04-02,NN,,,2006-12-15T01:21:37,false,3,,,,,LA TOMBE,22980,LA LANDEC,,,22097,,,,,,,,,,,,,,,,,,,2004-06-10,F,,,,,55.3A,NAFRev1,N,-2.180656,48.429722,0.94,street,La Tombe 22980 La Landec,22097_1ezhwo,G,LA TOMBE,
441543584,00029,44154358400029,O,2004-10-07,,,,2006-11-25T17:51:55,true,3,LA TOMBE,,,,,22980,LA LANDEC,,,22097,,,,,,,,,,,,,,,,,,,2004-12-31,F,,,,,55.4B,NAFRev1,N,-2.180656,48.429722,0.94,street,La Tombe 22980 La Landec,22097_1ezhwo,D,LA TOMBE,