siren,nic,siret,statutDiffusionEtablissement,dateCreationEtablissement,trancheEffectifsEtablissement,anneeEffectifsEtablissement,activitePrincipaleRegistreMetiersEtablissement,dateDernierTraitementEtablissement,etablissementSiege,nombrePeriodesEtablissement,complementAdresseEtablissement,numeroVoieEtablissement,indiceRepetitionEtablissement,typeVoieEtablissement,libelleVoieEtablissement,codePostalEtablissement,libelleCommuneEtablissement,libelleCommuneEtrangerEtablissement,distributionSpecialeEtablissement,codeCommuneEtablissement,codeCedexEtablissement,libelleCedexEtablissement,codePaysEtrangerEtablissement,libellePaysEtrangerEtablissement,complementAdresse2Etablissement,numeroVoie2Etablissement,indiceRepetition2Etablissement,typeVoie2Etablissement,libelleVoie2Etablissement,codePostal2Etablissement,libelleCommune2Etablissement,libelleCommuneEtranger2Etablissement,distributionSpeciale2Etablissement,codeCommune2Etablissement,codeCedex2Etablissement,libelleCedex2Etablissement,codePaysEtranger2Etablissement,libellePaysEtranger2Etablissement,dateDebut,etatAdministratifEtablissement,enseigne1Etablissement,enseigne2Etablissement,enseigne3Etablissement,denominationUsuelleEtablissement,activitePrincipaleEtablissement,nomenclatureActivitePrincipaleEtablissement,caractereEmployeurEtablissement,longitude,latitude,geo_score,geo_type,geo_adresse,geo_id,geo_ligne,geo_l4,geo_l5
213104524,00011,21310452400011,O,1983-03-01,01,2020,,2022-08-29T09:06:45,true,3,,,,,,31800,RIEUCAZE,,,31452,,,,,,,,,,,,,,,,,,,2008-01-01,A,MAIRIE,,,,84.11Z,NAFRev2,N,,,0,,,,,,
263105611,00010,26310561100010,O,1984-09-04,NN,,,2010-06-26T03:08:11,true,3,,,,,MAIRIE,31800,RIEUCAZE,,,31452,,,,,,,,,,,,,,,,,,,2008-01-01,A,CCAS,,,,88.99B,NAFRev2,N,3.0709671,50.6304695,0.92,poi.townhall,Hôtel de Ville Lille,https://osm.org/way/40917078,G,,
311931349,00022,31193134900022,O,,NN,,,,true,1,,,,,IMMEUBLE PALACIOS,31800,RIEUCAZE,,,31452,,,,,,,,,,,,,,,,,,,,F,,,,,69.12,NAP,N,,,0,,,,,,
313455917,00010,31345591700010,O,,,,,,true,1,,,,,,31800,RIEUCAZE,,,31452,,,,,,,,,,,,,,,,,,,,F,,,,,01.50,NAP,N,,,0,,,,,,
324011022,00013,32401102200013,O,1982-03-01,NN,,9521ZZ,2018-07-07T04:16:04,true,4,,,,,,31800,RIEUCAZE,,,31452,,,,,,,,,,,,,,,,,,,2018-06-30,F,,,,,95.21Z,NAFRev2,N,,,0,,,,,,
333929982,00010,33392998200010,O,,NN,,,,true,1,,,,,,31800,RIEUCAZE,,,31452,,,,,,,,,,,,,,,,,,,,F,,,,,81.21,NAP,N,,,0,,,,,,
338572498,00016,33857249800016,O,1986-08-01,NN,,,2012-07-28T10:38:58,true,4,,,,,,31800,RIEUCAZE,,,31452,,,,,,,,,,,,,,,,,,,2008-01-01,F,,,,,77.12Z,NAFRev2,N,,,0,,,,,,
391741774,00015,39174177400015,O,1992-01-01,NN,,,,true,1,,,,,,31800,RIEUCAZE,,,31452,,,,,,,,,,,,,,,,,,,2001-09-28,F,,,,,01.1A,NAF1993,N,,,0,,,,,,
394377303,00018,39437730300018,O,1994-01-01,NN,,,,true,4,,,,,,31800,RIEUCAZE,,,31452,,,,,,,,,,,,,,,,,,,2003-01-31,F,,,,,01.2A,NAFRev1,N,,,0,,,,,,
404038507,00012,40403850700012,O,1983-01-01,NN,,,2021-02-23T11:28:19,true,3,,,,,,31800,RIEUCAZE,,,31452,,,,,,,,,,,,,,,,,,,2008-01-01,A,,,,,01.41Z,NAFRev2,N,,,0,,,,,,
431839018,00014,43183901800014,O,2000-07-03,NN,,,2008-11-08T01:54:54,true,4,,,,,LE VILLAGE,31800,RIEUCAZE,,,31452,,,,,,,,,,,,,,,,,,,2004-12-31,F,,,,,45.3E,NAFRev1,O,2.2950702,48.9311749,0.9,poi.bar,bar le village Gennevilliers,https://osm.org/node/3287755128,G,,
444989487,00012,44498948700012,O,2003-02-01,00,2020,,2022-08-29T09:21:08,true,4,,,,,,31800,RIEUCAZE,,,31452,,,,,,,,,,,,,,,,,,,2012-12-31,A,,,,,01.50Z,NAFRev2,O,,,0,,,,,,
493285415,00011,49328541500011,O,2006-12-01,,,,2008-12-11T09:08:22,true,2,,,,,,31800,RIEUCAZE,,,31452,,,,,,,,,,,,,,,,,,,2008-01-01,A,,,,,01.11Z,NAFRev2,N,,,0,,,,,,
498157569,00019,49815756900019,O,2007-04-01,,,,2008-02-15T05:40:12,true,2,,,,,LASSALLE,31800,RIEUCAZE,,,31452,,,,,,,,,,,,,,,,,,,2008-01-01,A,,,,,01.42Z,NAFRev2,N,0.757622,43.076137,0.9,street,Chemin de Lassalle 31800 Rieucazé,31452_wtotrf,G,CHEMIN DE LASSALLE,
512527250,00017,51252725000017,O,2009-05-07,,,,2022-11-22T04:00:57,true,3,,1,,,VILLAGE,31800,RIEUCAZE,,,31452,,,,,,,,,,,,,,,,,,,2022-11-01,A,,,,,43.32B,NAFRev2,N,4.39087,45.4547668,0.89,poi.cafe,Village Café Saint-Étienne,https://osm.org/node/5321738834,G,,
529767998,00022,52976799800022,O,2014-03-14,02,2020,,2022-09-30T04:07:31,true,1,,,,,DARRE CASE,31800,RIEUCAZE,,,31452,,,,,,,,,,,,,,,,,,,2014-03-14,A,,,,SARL M.E. CHARPENTES,43.91A,NAFRev2,O,,,0,,,,,,
533620779,00025,53362077900025,O,2015-02-25,,,,2015-12-13T04:05:49,true,2,,,,,DARRE CASE,31800,RIEUCAZE,,,31452,,,,,,,,,,,,,,,,,,,2015-11-12,F,SERVICE BATI,,,SERVICE BATI,47.52A,NAFRev2,N,,,0,,,,,,
750678476,00011,75067847600011,O,2012-04-03,,,,2017-03-01T04:01:49,false,2,,,,LD,LAS COSTES,31800,RIEUCAZE,,,31452,,,,,,,,,,,,,,,,,,,2017-02-28,F,,,,,43.91A,NAFRev2,N,-0.0944111,42.9818284,0.89,poi.track,Chemin de las Costes Saint-Savin,https://osm.org/way/194380230,G,,
776837429,00013,77683742900013,O,,NN,,,,true,1,,,,,,31800,RIEUCAZE,,,31452,,,,,,,,,,,,,,,,,,,,F,,,,,55.73,NAP,N,,,0,,,,,,
776837437,00016,77683743700016,O,,,,,,true,1,,,,,,31800,RIEUCAZE,,,31452,,,,,,,,,,,,,,,,,,,1984-12-25,F,,,,,55.60,NAP,N,,,0,,,,,,
776837445,00019,77683744500019,O,1973-01-01,NN,,,2014-07-10T02:31:31,true,4,,,,,,31800,RIEUCAZE,,,31452,,,,,,,,,,,,,,,,,,,2008-12-31,F,,,,,28.93Z,NAFRev2,N,,,0,,,,,,
791957012,00010,79195701200010,O,2013-02-04,,,,2013-03-21T14:11:02,true,1,LE VILLAGE,,,,,31800,RIEUCAZE,,,31452,,,,,,,,,,,,,,,,,,,2013-02-04,A,,,,,35.11Z,NAFRev2,N,,,0,,,,,,
799256953,00016,79925695300016,O,2013-01-01,,,,2013-12-20T10:06:22,true,1,,,,,LE VILLAGE,31800,RIEUCAZE,,,31452,,,,,,,,,,,,,,,,,,,2013-01-01,A,,,,,55.20Z,NAFRev2,N,2.2950702,48.9311749,0.9,poi.bar,bar le village Gennevilliers,https://osm.org/node/3287755128,G,,
808692339,00019,80869233900019,O,2014-12-01,,,,2015-01-02T03:19:49,true,1,,,,,DARRE CASE,31800,RIEUCAZE,,,31452,,,,,,,,,,,,,,,,,,,2014-12-01,A,,,,,68.20B,NAFRev2,N,,,0,,,,,,
814086450,00016,81408645000016,O,2015-06-20,,,,2017-01-26T14:55:41,true,1,LE VILLAGE,,,,QUARTIER DU CHATEAU,31800,RIEUCAZE,,,31452,,,,,,,,,,,,,,,,,,,2015-06-20,A,,,,,55.20Z,NAFRev2,N,1.4843607,43.6004576,0.89,poi.community_centre,Maison de Quartier du Château de l'Hers (Salle des fêtes) Toulouse,https://osm.org/way/186261665,G,,
828027987,00019,82802798700019,O,2017-02-06,,,,2020-01-14T03:37:32,true,2,,,,,LIEUDIT LAS COSTE,31800,RIEUCAZE,,,31452,,,,,,,,,,,,,,,,,,,2018-12-07,F,,,,,43.21A,NAFRev2,N,-0.0944111,42.9818284,0.8,poi.track,Chemin de las Costes Saint-Savin,https://osm.org/way/194380230,G,,
900346594,00014,90034659400014,O,2021-06-03,,,,2021-06-15T09:01:00,true,1,,1,B,RUE,DE L'EGLISE,31800,RIEUCAZE,,,31452,,,,,,,,,,,,,,,,,,,2021-06-03,A,,,,,79.90Z,NAFRev2,N,0.758122,43.076732,0.8,street,Rue de l’Église 31800 Rieucazé,31452_ue67aj,G,RUE DE L EGLISE,
