siren,nic,siret,statutDiffusionEtablissement,dateCreationEtablissement,trancheEffectifsEtablissement,anneeEffectifsEtablissement,activitePrincipaleRegistreMetiersEtablissement,dateDernierTraitementEtablissement,etablissementSiege,nombrePeriodesEtablissement,complementAdresseEtablissement,numeroVoieEtablissement,indiceRepetitionEtablissement,typeVoieEtablissement,libelleVoieEtablissement,codePostalEtablissement,libelleCommuneEtablissement,libelleCommuneEtrangerEtablissement,distributionSpecialeEtablissement,codeCommuneEtablissement,codeCedexEtablissement,libelleCedexEtablissement,codePaysEtrangerEtablissement,libellePaysEtrangerEtablissement,complementAdresse2Etablissement,numeroVoie2Etablissement,indiceRepetition2Etablissement,typeVoie2Etablissement,libelleVoie2Etablissement,codePostal2Etablissement,libelleCommune2Etablissement,libelleCommuneEtranger2Etablissement,distributionSpeciale2Etablissement,codeCommune2Etablissement,codeCedex2Etablissement,libelleCedex2Etablissement,codePaysEtranger2Etablissement,libellePaysEtranger2Etablissement,dateDebut,etatAdministratifEtablissement,enseigne1Etablissement,enseigne2Etablissement,enseigne3Etablissement,denominationUsuelleEtablissement,activitePrincipaleEtablissement,nomenclatureActivitePrincipaleEtablissement,caractereEmployeurEtablissement,longitude,latitude,geo_score,geo_type,geo_adresse,geo_id,geo_ligne,geo_l4,geo_l5
213904139,00010,21390413900010,O,1983-03-01,02,2020,,2022-08-29T09:07:08,true,4,,,,,,39370,LA PESSE,,,39413,,,,,,,,,,,,,,,,,,,2008-01-01,A,MAIRIE,,,,84.11Z,NAFRev2,O,,,0,,,,,,
213904139,00028,21390413900028,O,1983-12-21,02,2020,,2022-08-29T09:07:08,false,3,LE BOURG,,,,,39370,LA PESSE,,,39413,,,,,,,,,,,,,,,,,,,2008-01-01,A,ECOLE PRIMAIRE PUBLIQUE,,,,85.20Z,NAFRev2,N,5.853092,46.281577,0.71,locality,Le Bourbouiller Sud 39370 La Pesse,39413_B005,D,LE BOURBOUILLER SUD,
213904139,00036,21390413900036,O,1996-12-25,NN,,,2008-01-04T18:33:05,false,2,MAIRIE,,,,,39370,LA PESSE,,,39413,,,,,,,,,,,,,,,,,,,2008-01-01,A,SERVICE ASSAINISSEMENT,,,,37.00Z,NAFRev2,N,,,0,,,,,,
253900476,00016,25390047600016,O,1983-03-01,,,,2011-04-23T04:19:40,false,4,,,,,MAIRIE,39370,LA PESSE,,,39413,,,,,,,,,,,,,,,,,,,2008-11-14,F,,,,,84.12Z,NAFRev2,N,3.0709671,50.6304695,0.92,poi.townhall,Hôtel de Ville Lille,https://osm.org/way/40917078,G,,
253906408,00013,25390640800013,O,2004-11-17,,,,2008-01-04T18:52:22,true,3,MAIRIE,,,,LE BOURG,39370,LA PESSE,,,39413,,,,,,,,,,,,,,,,,,,2008-01-01,A,,,,,84.25Z,NAFRev2,N,5.853092,46.281577,0.71,locality,Le Bourbouiller Sud 39370 La Pesse,39413_B005,G,LE BOURBOUILLER SUD,
263903395,00014,26390339500014,O,1986-01-01,NN,,,,true,1,,,,,,39370,LA PESSE,,,39413,,,,,,,,,,,,,,,,,,,2001-05-23,F,,,,,85.3K,NAF1993,N,,,0,,,,,,
263906869,00015,26390686900015,O,1956-01-01,,,,2010-06-26T03:09:27,true,3,MAIRIE,,,,,39370,LA PESSE,,,39413,,,,,,,,,,,,,,,,,,,2008-01-01,A,CDE,,,,88.99B,NAFRev2,N,,,0,,,,,,
273900712,00012,27390071200012,O,,,,,,true,1,,,,,MAIRIE,39370,LA PESSE,,,39413,,,,,,,,,,,,,,,,,,,1995-12-25,F,,,,,90.0A,NAF1993,N,3.0709671,50.6304695,0.92,poi.townhall,Hôtel de Ville Lille,https://osm.org/way/40917078,G,,
293906061,00016,29390606100016,O,1983-08-10,NN,,,2008-01-04T19:06:37,true,3,,,,,MAIRIE,39370,LA PESSE,,,39413,,,,,,,,,,,,,,,,,,,2008-01-01,A,,,,,42.99Z,NAFRev2,N,3.0709671,50.6304695,0.92,poi.townhall,Hôtel de Ville Lille,https://osm.org/way/40917078,G,,
300844792,00030,30084479200030,O,2008-08-01,,,,2019-02-18T11:19:59,true,1,,10,,,RUE DE LA BORNE AU LION,39370,LA PESSE,,,39413,,,,,,,,,,,,,,,,,,,2008-08-01,A,,,,,68.20A,NAFRev2,N,5.849386,46.285342,0.84,housenumber,10 Route de la Borne au Lion 39370 La Pesse,39413_0180_00010,G,10 ROUTE DE LA BORNE AU LION,
301062493,00012,30106249300012,O,1965-01-01,NN,,,2008-11-07T00:17:09,true,4,,,,,,39370,LA PESSE,,,39413,,,,,,,,,,,,,,,,,,,2005-09-30,F,,,,,15.8C,NAFRev1,N,,,0,,,,,,
301403721,00014,30140372100014,O,1993-12-31,NN,,,2008-01-04T19:14:49,true,3,,,,,AU VILLAGE,39370,LA PESSE,,,39413,,,,,,,,,,,,,,,,,,,2008-01-01,A,,,,,85.51Z,NAFRev2,N,5.853006,46.30406,0.34,locality,Au Pas Rouge 39370 La Pesse,39413_B054,G,AU PAS ROUGE,
302151873,00049,30215187300049,O,1992-01-01,NN,,,2012-04-10T15:31:56,false,4,,,,,AU VILLAGE,39370,LA PESSE,,,39413,,,,,,,,,,,,,,,,,,,2011-12-31,F,,,,,68.20A,NAFRev2,N,5.853006,46.30406,0.34,locality,Au Pas Rouge 39370 La Pesse,39413_B054,G,AU PAS ROUGE,
302359567,00039,30235956700039,O,1998-01-01,NN,,,2013-06-07T09:35:54,false,4,FROIDE COMBE,,,,,39370,LA PESSE,,,39413,,,,,,,,,,,,,,,,,,,2008-01-01,F,,,,,02.20Z,NAFRev2,N,5.868185,46.286025,0.93,locality,Froide Combe 39370 La Pesse,39413_B041,D,FROIDE COMBE,
302597521,00012,30259752100012,O,1975-01-01,NN,,,2012-05-05T00:46:41,false,5,,,,,,39370,LA PESSE,,,39413,,,,,,,,,,,,,,,,,,,2010-09-30,F,,,,,68.20A,NAFRev2,O,,,0,,,,,,
302597521,00020,30259752100020,O,1989-01-01,NN,,,2021-02-23T10:36:20,true,3,,,,,AU VILLAGE,39370,LA PESSE,,,39413,,,,,,,,,,,,,,,,,,,2008-01-01,A,,,,,68.20A,NAFRev2,N,5.853006,46.30406,0.34,locality,Au Pas Rouge 39370 La Pesse,39413_B054,G,AU PAS ROUGE,
307300566,00048,30730056600048,O,1999-12-31,NN,,,2008-01-04T19:46:15,true,3,AU VILLAGE,,,,LE BOURG,39370,LA PESSE,,,39413,,,,,,,,,,,,,,,,,,,2008-01-01,A,,,,,55.20Z,NAFRev2,N,5.853092,46.281577,0.71,locality,Le Bourbouiller Sud 39370 La Pesse,39413_B005,G,LE BOURBOUILLER SUD,
309483097,00015,30948309700015,O,,NN,,,2006-11-25T09:24:46,true,1,,,,,,39370,LA PESSE,,,39413,,,,,,,,,,,,,,,,,,,1990-03-27,F,,,,,96.24,NAP,N,,,0,,,,,,
310415567,00018,31041556700018,O,,NN,,,,true,1,,,,,,39370,LA PESSE,,,39413,,,,,,,,,,,,,,,,,,,1988-03-18,F,,,,,52.1B,NAF1993,N,,,0,,,,,,
315721068,00023,31572106800023,O,1988-10-01,NN,,,2011-04-28T00:15:46,false,4,,,,LD,L EMBOSSIEUX,39370,LA PESSE,,,39413,,,,,,,,,,,,,,,,,,,2001-11-09,F,,,,,45.4C,NAF1993,N,5.856434,46.297846,0.91,locality,Hameau de l’Embossieux 39370 La Pesse,39413_B046,G,HAMEAU DE L EMBOSSIEUX,
315997080,00025,31599708000025,O,1989-12-01,,,,,true,4,,,,,AU VILLAGE,39370,LA PESSE,,,39413,,,,,,,,,,,,,,,,,,,1994-04-01,F,,,,,55.3A,NAF1993,N,5.853006,46.30406,0.34,locality,Au Pas Rouge 39370 La Pesse,39413_B054,G,AU PAS ROUGE,
316146414,00040,31614641400040,O,1989-04-15,NN,,,2008-11-07T00:31:41,true,3,,,,,,39370,LA PESSE,,,39413,,,,,,,,,,,,,,,,,,,1991-12-31,F,,,,,55.60,NAP,N,,,0,,,,,,
316345552,00012,31634555200012,O,1979-01-01,NN,,,2011-11-30T04:31:43,true,4,,,,,LES NERBIERS,39370,LA PESSE,,,39413,,,,,,,,,,,,,,,,,,,2011-06-15,F,,,,,68.20B,NAFRev2,N,5.856161,46.296245,0.37,street,Chemin des Quartiers 39370 La Pesse,39413_0235,G,CHEMIN DES QUARTIERS,
318425311,00012,31842531100012,O,1972-01-01,NN,,,2009-06-27T04:13:31,true,3,,,,,,39370,LA PESSE,,,39413,,,,,,,,,,,,,,,,,,,2008-01-01,A,,,,,68.20B,NAFRev2,N,,,0,,,,,,
318749967,00010,31874996700010,O,1980-01-01,NN,,,2008-01-04T21:02:54,true,3,,,,,LE CRET,39370,LA PESSE,,,39413,,,,,,,,,,,,,,,,,,,2008-01-01,A,,,,,93.19Z,NAFRev2,N,5.874144,46.269093,0.67,locality,Crêt au Merle 39370 La Pesse,39413_B026,G,CRET AU MERLE,
319058947,00015,31905894700015,O,,,,,,true,1,,,,,,39370,LA PESSE,,,39413,,,,,,,,,,,,,,,,,,,1984-12-25,F,,,,,86.12,NAP,N,,,0,,,,,,
319081170,00031,31908117000031,O,1988-12-25,NN,,9529ZC,2019-03-19T03:41:55,true,5,,5,,IMP,DES GENTIANES,39370,LA PESSE,,,39413,,,,,,,,,,,,,,,,,,,2019-02-28,F,,,,MIMI POLKA,32.99Z,NAFRev2,N,5.845877,46.283493,0.84,housenumber,5 Impasse des Gentianes 39370 La Pesse,39413_0215_00005,G,5 IMPASSE DES GENTIANES,
319402384,00014,31940238400014,O,,NN,,,,true,1,,,,,,39370,LA PESSE,,,39413,,,,,,,,,,,,,,,,,,,1993-12-31,F,,,,,52.2C,NAF1993,N,,,0,,,,,,
319760807,00051,31976080700051,O,2008-11-09,,,8121ZZ,2018-12-01T04:13:16,true,4,L'EMBOSSIEUX,1,,RTE,DE LA PESSE,39370,LA PESSE,,,39413,,,,,,,,,,,,,,,,,,,2018-11-30,F,,,,,81.21Z,NAFRev2,N,5.856582,46.297991,0.84,housenumber,1 Route de la Pesse 39370 La Pesse,39413_0225_00001,G,1 ROUTE DE LA PESSE,
323639021,00050,32363902100050,O,2015-10-01,NN,,,2019-06-24T13:22:16,false,2,,27,,RUE,DE LA FRUITIERE,39370,LA PESSE,,,39413,,,,,,,,,,,,,,,,,,,2018-09-30,F,,,,,86.21Z,NAFRev2,O,5.851415,46.288911,0.95,housenumber,27 Rue de la Fruitière 39370 La Pesse,39413_0270_00027,G,27 RUE DE LA FRUITIERE,
324197979,00028,32419797900028,O,1985-09-05,NN,,4399CZ,2022-10-22T04:09:37,true,2,,,,,,39370,LA PESSE,,,39413,,,,,,,,,,,,,,,,,,,1987-09-30,F,,,,,,,,,,0,,,,,,
324472323,00017,32447232300017,O,,NN,,,,true,1,,,,,,39370,LA PESSE,,,39413,,,,,,,,,,,,,,,,,,,,F,,,,,81.11,NAP,N,,,0,,,,,,
324646959,00027,32464695900027,O,2010-01-01,,,,2016-01-12T00:11:30,true,1,,,,LD,CRET A LA MYA,39370,LA PESSE,,,39413,,,,,,,,,,,,,,,,,,,2010-01-01,A,,,,,02.20Z,NAFRev2,N,5.874144,46.269093,0.53,locality,Crêt au Merle 39370 La Pesse,39413_B026,G,CRET AU MERLE,
324779131,00022,32477913100022,O,1999-01-01,NN,,,,true,1,,,,,,39370,LA PESSE,,,39413,,,,,,,,,,,,,,,,,,,2002-03-31,F,,,,,92.6C,NAF1993,N,,,0,,,,,,
326050457,00018,32605045700018,O,1981-11-13,NN,,,2008-04-25T00:16:20,false,3,,,,,CHAUDEZEMBRE,39370,LA PESSE,,,39413,,,,,,,,,,,,,,,,,,,2006-10-31,F,,,,,85.1G,NAFRev1,N,5.845595,46.285917,0.92,street,Route de Chaudezembre 39370 La Pesse,39413_0185,G,ROUTE DE CHAUDEZEMBRE,
326336955,00025,32633695500025,O,1992-01-01,NN,,,,true,1,,,,,,39370,LA PESSE,,,39413,,,,,,,,,,,,,,,,,,,2001-06-30,F,,,,,55.2E,NAF1993,N,,,0,,,,,,
326540481,00024,32654048100024,O,1990-01-03,NN,,,,true,1,,,,,CHALET DES DARAPPES,39370,LA PESSE,,,39413,,,,,,,,,,,,,,,,,,,2000-06-30,F,,,,,55.2E,NAF1993,O,5.85583,46.298717,0.6,street,Route des Darappes 39370 La Pesse,39413_0190,G,ROUTE DES DARAPPES,
329441802,00017,32944180200017,O,,,,,2006-11-25T10:10:51,true,1,,,,,MAISON D'EVUAZ,39370,LA PESSE,,,39413,,,,,,,,,,,,,,,,,,,1989-09-30,F,,,,,96.23,NAP,N,,,0,,,,,,
329498174,00039,32949817400039,O,2009-01-01,,,,2022-07-25T13:38:18,true,1,,,,LD,LE CRET,39370,LA PESSE,,,39413,,,,,,,,,,,,,,,,,,,2009-01-01,A,,,,,55.20Z,NAFRev2,N,5.874144,46.269093,0.67,locality,Crêt au Merle 39370 La Pesse,39413_B026,G,CRET AU MERLE,
330246075,00015,33024607500015,O,1984-07-01,NN,,,,true,1,,,,LD,LE CRET,39370,LA PESSE,,,39413,,,,,,,,,,,,,,,,,,,2001-12-31,F,,,,,20.1A,NAF1993,N,5.874144,46.269093,0.67,locality,Crêt au Merle 39370 La Pesse,39413_B026,G,CRET AU MERLE,
334155918,00017,33415591800017,O,1985-11-20,NN,,,2008-01-04T20:47:32,true,3,,,,,SOUS LES BOIS,39370,LA PESSE,,,39413,,,,,,,,,,,,,,,,,,,2008-01-01,A,,,,,90.03B,NAFRev2,N,5.829245,46.290669,0.4,locality,Le Cernois Bouiller 39370 La Pesse,39413_B011,G,LE CERNOIS BOUILLER,
334155918,00025,33415591800025,O,2017-06-21,,,,2021-02-23T10:53:24,false,1,,,,LD,LE CERNOIS,39370,LA PESSE,,,39413,,,,,,,,,,,,,,,,,,,2017-06-21,A,,,,,01.28Z,NAFRev2,N,5.829245,46.290669,0.91,locality,Le Cernois Bouiller 39370 La Pesse,39413_B011,G,LE CERNOIS BOUILLER,
334745361,00041,33474536100041,O,2013-08-01,,,,2022-04-13T03:44:40,false,2,,10,,RUE,DE L'EPICEA,39370,LA PESSE,,,39413,,,,,,,,,,,,,,,,,,,2014-10-01,F,,,,,47.99B,NAFRev2,N,5.847358,46.284663,0.95,housenumber,10 Rue de l’Epicéa 39370 La Pesse,39413_0200_00010,G,10 RUE DE L EPICEA,
338752520,00027,33875252000027,O,2013-07-04,,,,2017-03-24T08:29:18,true,3,SOUS LES BOIS,,,,,39370,LA PESSE,,,39413,,,,,,,,,,,,,,,,,,,2017-02-28,F,VU D'EN HAUT,,,,01.62Z,NAFRev2,N,5.829245,46.290669,0.4,locality,Le Cernois Bouiller 39370 La Pesse,39413_B011,D,LE CERNOIS BOUILLER,
340088624,00010,34008862400010,O,,,,,2006-11-25T10:37:23,true,1,,,,,,39370,LA PESSE,,,39413,,,,,,,,,,,,,,,,,,,1997-12-25,F,,,,,85.3G,NAF1993,N,,,0,,,,,,
340835131,00012,34083513100012,O,1987-04-06,11,2020,1623ZZ,2022-10-01T04:56:14,true,4,,,,,SUR LE CRET,39370,LA PESSE,,,39413,,,,,,,,,,,,,,,,,,,2008-01-01,A,,,,,16.23Z,NAFRev2,O,5.874144,46.269093,0.46,locality,Crêt au Merle 39370 La Pesse,39413_B026,G,CRET AU MERLE,
341369247,00034,34136924700034,O,2001-10-19,NN,,,2008-04-25T14:46:25,false,7,,,,LD,LE SARNASSON,39370,LA PESSE,,,39413,,,,,,,,,,,,,,,,,,,2008-01-01,F,FERME DU SARNASSON,,,,56.10A,NAFRev2,N,5.845402,46.300579,0.93,street,Le Sarnasson 39370 La Pesse,39413_0ui6kl,G,LE SARNASSON,
341369247,00042,34136924700042,O,2001-09-11,NN,,,2019-10-10T10:35:43,true,3,,,,,LE SARNASSON,39370,LA PESSE,,,39413,,,,,,,,,,,,,,,,,,,2008-01-01,A,,,,,68.20A,NAFRev2,N,5.845402,46.300579,0.93,street,Le Sarnasson 39370 La Pesse,39413_0ui6kl,G,LE SARNASSON,
341369247,00059,34136924700059,O,2005-12-18,NN,,,2019-10-10T10:35:43,false,3,,,,,LE VILLAGE,39370,LA PESSE,,,39413,,,,,,,,,,,,,,,,,,,2018-05-02,F,LES TAVAILLONS,,,,55.20Z,NAFRev2,O,5.853092,46.281577,0.35,locality,Le Bourbouiller Sud 39370 La Pesse,39413_B005,G,LE BOURBOUILLER SUD,
341369247,00067,34136924700067,O,2010-02-01,,,,2011-07-22T05:01:14,false,2,,10,,RUE,DE L'EPICEA,39370,LA PESSE,,,39413,,,,,,,,,,,,,,,,,,,2011-03-31,F,ART ET BIEN ETRE,,,,47.78C,NAFRev2,N,5.847358,46.284663,0.95,housenumber,10 Rue de l’Epicéa 39370 La Pesse,39413_0200_00010,G,10 RUE DE L EPICEA,
341732089,00048,34173208900048,O,2006-12-01,,,,2009-12-09T03:51:50,true,3,,,,LD,LA CRETE,39370,LA PESSE,,,39413,,,,,,,,,,,,,,,,,,,2008-12-31,F,,,,,90.03B,NAFRev2,N,5.874144,46.269093,0.6,locality,Crêt au Merle 39370 La Pesse,39413_B026,G,CRET AU MERLE,
344597430,00026,34459743000026,O,2006-10-01,,,,2021-02-23T10:59:35,false,1,,,,,LA SEMINE,39370,LA PESSE,,,39413,,,,,,,,,,,,,,,,,,,2006-10-01,A,,,,,68.20A,NAFRev2,N,5.844667,46.282356,0.93,street,Sur la Semine 39370 La Pesse,39413_kixrtq,G,SUR LA SEMINE,
344597430,00034,34459743000034,O,2018-12-01,,,,2018-11-22T12:49:57,true,1,LA SEMINE,,,,,39370,LA PESSE,,,39413,,,,,,,,,,,,,,,,,,,2018-12-01,A,,,,,01.29Z,NAFRev2,N,5.844667,46.282356,0.93,street,Sur la Semine 39370 La Pesse,39413_kixrtq,D,SUR LA SEMINE,
349502195,00010,34950219500010,O,,NN,,,,true,1,,,,,,39370,LA PESSE,,,39413,,,,,,,,,,,,,,,,,,,1993-03-31,F,,,,,55.2C,NAF1993,N,,,0,,,,,,
350028718,00012,35002871800012,O,1989-01-02,01,2020,1610AQ,2022-08-29T09:00:29,true,4,,,,,L EMBOSSIEUX,39370,LA PESSE,,,39413,,,,,,,,,,,,,,,,,,,2008-01-01,A,,,,,02.20Z,NAFRev2,O,5.856434,46.297846,0.91,locality,Hameau de l’Embossieux 39370 La Pesse,39413_B046,G,HAMEAU DE L EMBOSSIEUX,
352294573,00014,35229457300014,O,,NN,,,,true,1,,,,RUE,PRINCIPALE,39370,LA PESSE,,,39413,,,,,,,,,,,,,,,,,,,1991-06-27,F,,,,,62.11,NAP,N,2.061661,50.820766,0.9,poi,Rue Principale (Pont) Zouafques,https://osm.org/way/111379934,G,,
352654552,00012,35265455200012,O,1989-10-15,NN,,,2008-01-04T23:45:01,true,3,,,,,LA MAISON D EVUAZ,39370,LA PESSE,,,39413,,,,,,,,,,,,,,,,,,,2008-01-01,A,,,,,93.12Z,NAFRev2,N,,,0,,,,,,
352974364,00015,35297436400015,O,1989-12-15,NN,,,2008-11-08T00:30:17,true,2,AU VILLAGE,,,,,39370,LA PESSE,,,39413,,,,,,,,,,,,,,,,,,,1993-09-30,F,,,,,,,,5.853006,46.30406,0.34,locality,Au Pas Rouge 39370 La Pesse,39413_B054,D,AU PAS ROUGE,
353435571,00016,35343557100016,O,1989-12-20,NN,,,2021-02-23T11:05:44,true,6,LA COMBE AUX BISONS,,,,LE PRE REVERCHON,39370,LA PESSE,,,39413,,,,,,,,,,,,,,,,,,,2009-12-16,A,,,,,68.20B,NAFRev2,N,5.859987,46.29162,0.79,locality,Pré Reverchon 39370 La Pesse,39413_B065,G,PRE REVERCHON,
353474158,00014,35347415800014,O,1989-12-20,02,2020,1013BZ,2022-08-29T09:03:56,false,4,,11,B,RUE,DE LA FRUITIERE,39370,LA PESSE,,,39413,,,,,,,,,,,,,,,,,,,2021-03-12,F,,,,,10.13B,NAFRev2,O,5.848671,46.286466,0.87,housenumber,11bis Rue de la Fruitière 39370 La Pesse,39413_0270_00011_bis,G,11BIS RUE DE LA FRUITIERE,
353474158,00048,35347415800048,O,1998-01-01,NN,,,2021-11-06T14:25:57,true,5,,23,,RUE,DE LA FRUITIERE,39370,LA PESSE,,,39413,,,,,,,,,,,,,,,,,,,2021-03-12,A,LA FRUITIERE,,,,47.29Z,NAFRev2,O,5.850338,46.287946,0.95,housenumber,23 Rue de la Fruitière 39370 La Pesse,39413_0270_00023,G,23 RUE DE LA FRUITIERE,
353573694,00018,35357369400018,O,1990-01-15,NN,,,2006-12-15T00:38:32,false,3,,,,,,39370,LA PESSE,,,39413,,,,,,,,,,,,,,,,,,,1993-12-31,F,,,,,92.6C,NAF1993,N,,,0,,,,,,
356000430,04684,35600043004684,O,2000-06-05,,,,2009-10-17T13:35:29,false,4,,,,RUE,PRINCIPALE,39370,LA PESSE,,,39413,,,,,,,,,,,,,,,,,,,2009-03-18,F,BUREAU DE POSTE,,,,53.10Z,NAFRev2,N,2.061661,50.820766,0.9,poi,Rue Principale (Pont) Zouafques,https://osm.org/way/111379934,G,,
377748173,00020,37774817300020,O,1992-08-19,NN,,,2013-10-04T04:25:00,true,4,,,,,HAMEAU DE L'EMBOSSIEUX,39370,LA PESSE,,,39413,,,,,,,,,,,,,,,,,,,2013-09-30,F,,,,,96.09Z,NAFRev2,N,5.856434,46.297846,0.93,locality,Hameau de l’Embossieux 39370 La Pesse,39413_B046,G,HAMEAU DE L EMBOSSIEUX,
378115935,00017,37811593500017,O,1990-04-06,,,,2017-01-03T14:19:19,true,4,,,,,,39370,LA PESSE,,,39413,,,,,,,,,,,,,,,,,,,2008-01-01,A,,,,,93.12Z,NAFRev2,N,,,0,,,,,,
378880793,00013,37888079300013,O,1990-08-01,NN,,,2008-11-08T00:34:48,true,5,,,,,,39370,LA PESSE,,,39413,,,,,,,,,,,,,,,,,,,2003-12-05,F,,,,,36.4Z,NAFRev1,N,,,0,,,,,,
382653681,00017,38265368100017,O,1991-07-01,NN,,,,true,3,,,,,AU VILLAGE,39370,LA PESSE,,,39413,,,,,,,,,,,,,,,,,,,1994-05-20,F,,,,,52.1B,NAF1993,N,5.853006,46.30406,0.34,locality,Au Pas Rouge 39370 La Pesse,39413_B054,G,AU PAS ROUGE,
382732584,00018,38273258400018,O,1991-07-01,NN,,,2015-05-14T04:52:04,true,6,LE NERBIEF,,,,,39370,LA PESSE,,,39413,,,,,,,,,,,,,,,,,,,2013-09-30,F,,,,,85.51Z,NAFRev2,O,,,0,,,,,,
382934362,00064,38293436200064,O,2015-12-01,,,,2019-11-22T10:41:16,false,2,,27,,RUE,DE LA FRUITIERE,39370,LA PESSE,,,39413,,,,,,,,,,,,,,,,,,,2016-03-31,F,,,,,86.90E,NAFRev2,N,5.851415,46.288911,0.95,housenumber,27 Rue de la Fruitière 39370 La Pesse,39413_0270_00027,G,27 RUE DE LA FRUITIERE,
383268869,00021,38326886900021,O,2021-11-12,,,3213ZZ,2021-12-04T14:32:39,true,1,,16,,,ROUTE DE LA PESSE,39370,LA PESSE,,,39413,,,,,,,,,,,,,,,,,,,2021-11-12,A,,,,LUSYLCREA,32.13Z,NAFRev2,N,5.855247,46.295678,0.94,housenumber,16 Route de la Pesse 39370 La Pesse,39413_0225_00016,G,16 ROUTE DE LA PESSE,
383412061,00012,38341206100012,O,1991-07-01,NN,,,2006-11-25T11:41:21,true,1,,,,,AU VILLAGE,39370,LA PESSE,,,39413,,,,,,,,,,,,,,,,,,,2001-08-31,F,,,,,74.1J,NAF1993,N,5.853006,46.30406,0.34,locality,Au Pas Rouge 39370 La Pesse,39413_B054,G,AU PAS ROUGE,
383968948,00018,38396894800018,O,1991-01-01,NN,,,,true,4,,,,,,39370,LA PESSE,,,39413,,,,,,,,,,,,,,,,,,,2003-12-31,F,,,,,70.2A,NAFRev1,N,,,0,,,,,,
384713137,00014,38471313700014,O,1992-02-01,NN,,,2008-11-08T00:45:40,false,4,,,,,,39370,LA PESSE,,,39413,,,,,,,,,,,,,,,,,,,1999-04-20,F,,,,,45.2U,NAF1993,O,,,0,,,,,,
387703267,00014,38770326700014,O,1991-12-17,NN,,,2008-01-04T22:58:05,true,3,,,,,SUR LE CRET,39370,LA PESSE,,,39413,,,,,,,,,,,,,,,,,,,2008-01-01,A,,,,,01.41Z,NAFRev2,N,5.874144,46.269093,0.46,locality,Crêt au Merle 39370 La Pesse,39413_B026,G,CRET AU MERLE,
388172280,00017,38817228000017,O,1992-06-01,NN,,,2008-01-04T23:05:28,true,3,,,,,,39370,LA PESSE,,,39413,,,,,,,,,,,,,,,,,,,2008-01-01,A,,,,,94.99Z,NAFRev2,N,,,0,,,,,,
388932402,00018,38893240200018,O,1969-04-01,NN,,,,true,1,,,,,,39370,LA PESSE,,,39413,,,,,,,,,,,,,,,,,,,1999-05-31,F,,,,,01.2A,NAF1993,N,,,0,,,,,,
389005182,00016,38900518200016,O,1965-01-01,NN,,,2006-10-28T01:26:07,true,3,,,,,,39370,LA PESSE,,,39413,,,,,,,,,,,,,,,,,,,2004-12-31,F,,,,,01.2A,NAFRev1,N,,,0,,,,,,
389008947,00027,38900894700027,O,1995-09-18,NN,,,,false,3,,,,,LE CERNETRAU,39370,LA PESSE,,,39413,,,,,,,,,,,,,,,,,,,1997-06-15,F,,,,,74.8F,NAF1993,N,5.829245,46.290669,0.5,locality,Le Cernois Bouiller 39370 La Pesse,39413_B011,G,LE CERNOIS BOUILLER,
389058082,00014,38905808200014,O,1981-01-01,NN,,,2008-01-04T23:18:31,true,3,,,,,,39370,LA PESSE,,,39413,,,,,,,,,,,,,,,,,,,2008-01-01,A,,,,,01.41Z,NAFRev2,N,,,0,,,,,,
389396722,00016,38939672200016,O,1992-11-07,NN,,,2022-03-08T10:00:48,true,3,,,,,LE CRET AU MERLE,39370,LA PESSE,,,39413,,,,,,,,,,,,,,,,,,,2008-01-01,A,,,,,68.20B,NAFRev2,N,5.874144,46.269093,0.83,locality,Crêt au Merle 39370 La Pesse,39413_B026,G,CRET AU MERLE,
391883147,00046,39188314700046,O,2021-01-01,,,,2021-06-10T08:31:09,false,1,,6,A,RUE,DE LA BORNE AU LION,39370,LA PESSE,,,39413,,,,,,,,,,,,,,,,,,,2021-01-01,A,,,,,68.20A,NAFRev2,N,5.848913,46.285474,0.84,interpolation,6 Route de la Borne au Lion 39370 La Pesse,,G,4 ROUTE DE LA BORNE AU LION,
392205829,00014,39220582900014,O,1993-07-10,NN,,,,true,4,,,,LD,LE BERBOIS,39370,LA PESSE,,,39413,,,,,,,,,,,,,,,,,,,2003-03-30,F,,,,,55.2A,NAFRev1,N,5.853092,46.281577,0.43,locality,Le Bourbouiller Sud 39370 La Pesse,39413_B005,G,LE BOURBOUILLER SUD,
393259924,00032,39325992400032,O,2012-12-01,NN,,,2014-06-14T02:07:43,false,2,,10,,RUE,DE L'EPICEA,39370,LA PESSE,,,39413,,,,,,,,,,,,,,,,,,,2013-03-31,F,,,,LE RELAIS DES SKIEURS,56.10A,NAFRev2,O,5.847358,46.284663,0.95,housenumber,10 Rue de l’Epicéa 39370 La Pesse,39413_0200_00010,G,10 RUE DE L EPICEA,
394298491,00025,39429849100025,O,2008-01-01,,,,2008-08-05T04:06:29,true,2,ECOLE DU SKI FRANCAIS DU HAUT JURA,,,,,39370,LA PESSE,,,39413,,,,,,,,,,,,,,,,,,,2008-03-21,F,,,,,85.51Z,NAFRev2,N,,,0,,,,,,
394530943,00023,39453094300023,O,1998-01-01,,,4329AZ,2022-02-17T09:41:20,true,4,,,,,SOUS LA VYE,39370,LA PESSE,,,39413,,,,,,,,,,,,,,,,,,,2022-02-01,A,,,,SIM-ECO-RENOV,43.29A,NAFRev2,N,5.857723,46.298145,0.33,street,Impasse des Faubourgs 39370 La Pesse,39413_0210,G,IMPASSE DES FAUBOURGS,
395367758,00012,39536775800012,O,1994-05-12,NN,,,2011-04-28T00:59:55,false,4,,,,,AU VILLAGE,39370,LA PESSE,,,39413,,,,,,,,,,,,,,,,,,,2000-05-15,F,,,,,55.3A,NAF1993,O,5.853006,46.30406,0.34,locality,Au Pas Rouge 39370 La Pesse,39413_B054,G,AU PAS ROUGE,
395367758,00020,39536775800020,O,2008-08-01,00,2020,,2022-08-29T09:18:52,true,2,,,,,LE COINCHET,39370,LA PESSE,,,39413,,,,,,,,,,,,,,,,,,,2010-09-05,A,LES LOGES DU COINCHET,,,,55.20Z,NAFRev2,O,5.829245,46.290669,0.32,locality,Le Cernois Bouiller 39370 La Pesse,39413_B011,G,LE CERNOIS BOUILLER,
397457441,00012,39745744100012,O,1994-05-20,,,,2022-04-03T20:05:43,true,4,AU VILLAGE,,,,AU VILLAGE,39370,LA PESSE,,,39413,,,,,,,,,,,,,,,,,,,2008-01-01,A,,,,,47.11B,NAFRev2,N,5.853006,46.30406,0.34,locality,Au Pas Rouge 39370 La Pesse,39413_B054,G,AU PAS ROUGE,
398691063,00018,39869106300018,O,1994-10-21,NN,,,2008-11-08T01:05:14,true,4,,,,RTE,DU CRET DE CHALAME,39370,LA PESSE,,,39413,,,,,,,,,,,,,,,,,,,2004-05-06,F,,,,,55.1A,NAFRev1,O,5.8474176,46.2842804,0.71,poi.bakery,Boulangerie Pâtisserie du Crêt de Chalam La Pesse,https://osm.org/node/4580721536,G,,
399821321,00011,39982132100011,O,1994-03-01,NN,,,,true,3,,,,,L'ENQUERNE,39370,LA PESSE,,,39413,,,,,,,,,,,,,,,,,,,2003-12-31,F,,,,,01.2A,NAFRev1,N,5.845053,46.286383,0.35,street,Lotissement l’Enclos 39370 La Pesse,39413_A017,G,LOTISSEMENT L ENCLOS,
400562484,00024,40056248400024,O,1999-01-01,NN,,,,false,4,ESF DU HAUT JURA,,,,,39370,LA PESSE,,,39413,,,,,,,,,,,,,,,,,,,2003-01-01,F,,,,,92.6C,NAF1993,N,,,0,,,,,,
404717183,00010,40471718300010,O,1996-04-01,NN,,,2011-05-03T00:25:33,false,4,,,,,LES TAVAILLONS,39370,LA PESSE,,,39413,,,,,,,,,,,,,,,,,,,2002-12-31,F,,,,,55.2E,NAF1993,N,6.631073,46.0276185,0.9,poi.hotel,Les Tavaillons (Hôtel) Arâches-la-Frasse,https://osm.org/way/234178532,G,,
407530096,00020,40753009600020,O,2006-12-16,NN,,,2009-06-27T08:08:08,true,2,LE SARNASSON,,,,,39370,LA PESSE,,,39413,,,,,,,,,,,,,,,,,,,2007-12-31,F,BOREAL TRAINEAU AVENTURE,,,,01.2J,NAFRev1,O,5.845402,46.300579,0.93,street,Le Sarnasson 39370 La Pesse,39413_0ui6kl,D,LE SARNASSON,
409931458,00015,40993145800015,O,1986-12-31,NN,,,2011-01-09T04:42:25,true,5,,,,,LE CERNETROU,39370,LA PESSE,,,39413,,,,,,,,,,,,,,,,,,,2010-12-31,F,,,,,01.42Z,NAFRev2,N,5.829245,46.290669,0.5,locality,Le Cernois Bouiller 39370 La Pesse,39413_B011,G,LE CERNOIS BOUILLER,
410098024,00012,41009802400012,O,1996-11-12,NN,,,2009-12-01T05:39:47,true,3,,,,,LA SEMINE,39370,LA PESSE,,,39413,,,,,,,,,,,,,,,,,,,2008-01-01,A,,,,,68.20B,NAFRev2,N,5.844667,46.282356,0.93,street,Sur la Semine 39370 La Pesse,39413_kixrtq,G,SUR LA SEMINE,
410409890,00010,41040989000010,O,1997-01-05,NN,,,2013-11-26T03:38:56,true,4,,,,,L'EMBOSSIEUX,39370,LA PESSE,,,39413,,,,,,,,,,,,,,,,,,,2007-11-09,F,,,,,55.1A,NAFRev1,N,5.856434,46.297846,0.91,locality,Hameau de l’Embossieux 39370 La Pesse,39413_B046,G,HAMEAU DE L EMBOSSIEUX,
410750988,00025,41075098800025,O,1997-04-01,NN,,,,true,1,,,,,ESF MES HAUTES COMMBES,39370,LA PESSE,,,39413,,,,,,,,,,,,,,,,,,,2000-12-31,F,,,,,92.6C,NAF1993,N,,,0,,,,,,