siren,nic,siret,statutDiffusionEtablissement,dateCreationEtablissement,trancheEffectifsEtablissement,anneeEffectifsEtablissement,activitePrincipaleRegistreMetiersEtablissement,dateDernierTraitementEtablissement,etablissementSiege,nombrePeriodesEtablissement,complementAdresseEtablissement,numeroVoieEtablissement,indiceRepetitionEtablissement,typeVoieEtablissement,libelleVoieEtablissement,codePostalEtablissement,libelleCommuneEtablissement,libelleCommuneEtrangerEtablissement,distributionSpecialeEtablissement,codeCommuneEtablissement,codeCedexEtablissement,libelleCedexEtablissement,codePaysEtrangerEtablissement,libellePaysEtrangerEtablissement,complementAdresse2Etablissement,numeroVoie2Etablissement,indiceRepetition2Etablissement,typeVoie2Etablissement,libelleVoie2Etablissement,codePostal2Etablissement,libelleCommune2Etablissement,libelleCommuneEtranger2Etablissement,distributionSpeciale2Etablissement,codeCommune2Etablissement,codeCedex2Etablissement,libelleCedex2Etablissement,codePaysEtranger2Etablissement,libellePaysEtranger2Etablissement,dateDebut,etatAdministratifEtablissement,enseigne1Etablissement,enseigne2Etablissement,enseigne3Etablissement,denominationUsuelleEtablissement,activitePrincipaleEtablissement,nomenclatureActivitePrincipaleEtablissement,caractereEmployeurEtablissement,longitude,latitude,geo_score,geo_type,geo_adresse,geo_id,geo_ligne,geo_l4,geo_l5
035640515,00017,03564051500017,O,,NN,,,,true,1,,,,,,39120,RAHON,,,39448,,,,,,,,,,,,,,,,,,,,F,,,,,48.01,NAP,N,,,0,,,,,,
035941871,00010,03594187100010,O,,,,,,true,1,,,,RUE,DU MOULIN,39120,RAHON,,,39448,,,,,,,,,,,,,,,,,,,1984-12-25,F,,,,,62.43,NAP,N,5.456295,46.988839,0.95,street,Rue du Moulin 39120 Rahon,39448_0012,G,RUE DU MOULIN,
036341089,00013,03634108900013,O,,NN,,,,true,1,,,,RUE,DU BOIS,39120,RAHON,,,39448,,,,,,,,,,,,,,,,,,,1989-12-31,F,,,,,01.00,NAP,N,5.465019,46.990077,0.95,street,Rue du Bois 39120 Rahon,39448_0002,G,RUE DU BOIS,
036840056,00018,03684005600018,O,,NN,,,,true,1,,,,RUE,DES HALLES,39120,RAHON,,,39448,,,,,,,,,,,,,,,,,,,1996-07-31,F,,,,,15.8C,NAF1993,O,5.46275,46.985741,0.95,street,Rue des Halles 39120 Rahon,39448_0008,G,RUE DES HALLES,
037240215,00014,03724021500014,O,,NN,,,,true,1,,,,,,39120,RAHON,,,39448,,,,,,,,,,,,,,,,,,,1997-03-31,F,,,,,55.1A,NAF1993,O,,,0,,,,,,
213904485,00017,21390448500017,O,1983-03-01,03,2020,,2022-08-29T09:07:08,true,4,,,,,,39120,RAHON,,,39448,,,,,,,,,,,,,,,,,,,2008-01-01,A,MAIRIE,,,,84.11Z,NAFRev2,O,,,0,,,,,,
213904485,00025,21390448500025,O,1983-12-21,02,2020,,2022-08-29T09:07:08,false,3,,19,,RUE,DE L EGLISE,39120,RAHON,,,39448,,,,,,,,,,,,,,,,,,,2008-01-01,A,ECOLE PRIMAIRE PUBLIQUE,,,,85.20Z,NAFRev2,N,5.461532,46.987144,0.95,housenumber,19 Rue de l’Eglise 39120 Rahon,39448_0030_00019,G,19 RUE DE L EGLISE,
213904485,00033,21390448500033,O,1997-01-01,NN,,,2021-12-22T13:23:36,false,4,MAIRIE,,,,,39120,RAHON,,,39448,,,,,,,,,,,,,,,,,,,2022-01-01,A,EAU - ASSAINISSEMENT,,,,36.00Z,NAFRev2,N,,,0,,,,,,
213904485,00041,21390448500041,O,1997-01-01,NN,,,2021-12-22T13:21:27,false,4,MAIRIE,,,,,39120,RAHON,,,39448,,,,,,,,,,,,,,,,,,,2022-01-01,F,SERVICE ASSAINISSEMENT RAHON,,,,37.00Z,NAFRev2,N,,,0,,,,,,
213904485,00058,21390448500058,O,1998-01-01,NN,,,2008-01-04T18:33:08,false,3,MAIRIE,,,,,39120,RAHON,,,39448,,,,,,,,,,,,,,,,,,,2007-12-13,F,LOTISSEMENT RAHON,,,,70.1C,NAFRev1,N,,,0,,,,,,
263903593,00014,26390359300014,O,1986-01-01,NN,,,2016-07-23T12:25:16,true,4,,,,,,39120,RAHON,,,39448,,,,,,,,,,,,,,,,,,,2016-01-01,F,CCAS,,,,88.99B,NAFRev2,N,,,0,,,,,,
293904488,00013,29390448800013,O,1983-08-10,NN,,,2022-06-21T10:10:11,true,3,,,,,MAIRIE,39120,RAHON,,,39448,,,,,,,,,,,,,,,,,,,2008-01-01,A,,,,,42.99Z,NAFRev2,O,3.0709671,50.6304695,0.92,poi.townhall,Hôtel de Ville Lille,https://osm.org/way/40917078,G,,
301247375,00019,30124737500019,O,1974-01-01,NN,,,,true,1,,,,RUE,DU MOULIN,39120,RAHON,,,39448,,,,,,,,,,,,,,,,,,,2000-09-30,F,,,,,45.3A,NAF1993,N,5.456295,46.988839,0.95,street,Rue du Moulin 39120 Rahon,39448_0012,G,RUE DU MOULIN,
301247664,00016,30124766400016,O,,,,,,true,1,,,,,,39120,RAHON,,,39448,,,,,,,,,,,,,,,,,,,1989-12-31,F,,,,,57.02,NAP,N,,,0,,,,,,
301449450,00016,30144945000016,O,1985-09-09,NN,,,2006-10-26T23:52:11,true,3,,,,RTE,DE MOLAY,39120,RAHON,,,39448,,,,,,,,RUE,DES VAIVRES,39120,RAHON,,,39448,,,,,2004-12-31,F,,,,,70.2C,NAFRev1,N,5.452597,46.990406,0.8,street,Route de Molay 39120 Rahon,39448_0011,G,ROUTE DE MOLAY,
311268270,00072,31126827000072,O,1991-06-03,NN,,,,false,3,,,,,,39120,RAHON,,,39448,,,,,,,,,,,,,,,,,,,1992-06-26,F,ENTREPRISE GERRIET,,,,71.3C,NAF1993,N,,,0,,,,,,
316900554,00015,31690055400015,O,,NN,,,,true,1,,,,,LES GOUBOTS,39120,RAHON,,,39448,,,,,,,,,,,,,,,,,,,1994-12-31,F,,,,,55.4B,NAF1993,N,,,0,,,,,,
317382026,00019,31738202600019,O,,,,,,true,1,,,,,,39120,RAHON,,,39448,,,,,,,,,,,,,,,,,,,1985-12-25,F,,,,,67.08,NAP,N,,,0,,,,,,
318020377,00012,31802037700012,O,,,,,,true,1,,,,,,39120,RAHON,,,39448,,,,,,,,,,,,,,,,,,,1984-12-25,F,,,,,62.11,NAP,N,,,0,,,,,,
320032113,00013,32003211300013,O,1979-07-16,01,2020,,2022-08-29T09:16:33,true,3,,,,,,39120,RAHON,,,39448,,,,,,,,,,,,,,,,,,,2008-01-01,A,,,,,01.50Z,NAFRev2,N,,,0,,,,,,
325531382,00019,32553138200019,O,1982-10-01,NN,,,2008-11-07T00:42:47,true,4,,,,,,39120,RAHON,,,39448,,,,,,,,,,,,,,,,,,,2005-12-31,F,,,,,52.2C,NAFRev1,O,,,0,,,,,,
329522502,00015,32952250200015,O,1982-05-01,NN,,,2017-05-04T04:08:44,false,6,,,,,SOUS LES GRANDS CHENES,39120,RAHON,,,39448,,,,,,,,,,,,,,,,,,,2015-09-01,F,,,,,85.51Z,NAFRev2,O,,,0,,,,,,
329522502,00023,32952250200023,O,2015-09-01,01,2019,,2021-10-27T08:27:19,true,2,,1,,RUE,DES BARAZINES,39120,RAHON,,,39448,,,,,,,,,,,,,,,,,,,2016-03-01,A,,,,,85.51Z,NAFRev2,N,5.4654,46.989866,0.95,housenumber,1 Rue des Barazines 39120 Rahon,39448_ntqnzp_00001,G,1 RUE DES BARAZINES,
329522502,00031,32952250200031,O,2015-09-01,,,,2016-01-12T00:11:51,false,1,,,,,SOUS LES GRANDS CHENES,39120,RAHON,,,39448,,,,,,,,,,,,,,,,,,,2015-09-01,A,,,,,68.20B,NAFRev2,N,,,0,,,,,,
330397571,00010,33039757100010,O,,NN,,,,true,1,,,,PL,DE LA MAIRIE,39120,RAHON,,,39448,,,,,,,,,,,,,,,,,,,,F,,,,,67.08,NAP,N,5.466758,46.982645,0.38,street,Rue de la Chapelle 39120 Rahon,39448_0005,G,RUE DE LA CHAPELLE,
332899152,00018,33289915200018,O,,,,,,true,1,,,,PL,DE LA BASCULE,39120,RAHON,,,39448,,,,,,,,,,,,,,,,,,,1989-03-25,F,,,,,67.08,NAP,N,5.466758,46.982645,0.41,street,Rue de la Chapelle 39120 Rahon,39448_0005,G,RUE DE LA CHAPELLE,
340078740,00032,34007874000032,O,1999-02-04,,,1085ZZ,2022-04-13T04:01:26,true,6,,7,,RUE,ROGUIER,39120,RAHON,,,39448,,,,,,,,,,,,,,,,,,,2022-04-12,A,,,,PIZZA FLAMM,56.10C,NAFRev2,N,5.459306,46.98932,0.95,housenumber,7 Rue Roguier 39120 Rahon,39448_0017_00007,G,7 RUE ROGUIER,
340421361,00023,34042136100023,O,1991-05-02,NN,,,2016-03-10T15:36:51,true,6,,6,,RLE,DES MERLES,39120,RAHON,,,39448,,,,,,,,,,,,,,,,,,,2016-03-01,A,,,,,47.21Z,NAFRev2,O,5.465728,46.992085,0.87,housenumber,6 Ruelle des Merles 39120 Rahon,39448_0040_00006,G,6 RUELLE DES MERLES,
340421361,00031,34042136100031,O,1998-01-01,NN,,,2013-05-18T03:53:06,false,4,,6,,,RUELLE DES MERLES,39120,RAHON,,,39448,,,,,,,,,,,,,,,,,,,2008-01-01,A,,,,,68.20B,NAFRev2,O,5.465728,46.992085,0.94,housenumber,6 Ruelle des Merles 39120 Rahon,39448_0040_00006,G,6 RUELLE DES MERLES,
340421361,00056,34042136100056,O,2006-02-01,NN,,,2008-11-07T01:00:30,false,2,,2,,RUE,ROGUIER,39120,RAHON,,,39448,,,,,,,,,,,,,,,,,,,2006-10-18,F,,,,,15.1A,NAFRev1,N,5.460243,46.988671,0.95,housenumber,2 Rue Roguier 39120 Rahon,39448_0017_00002,G,2 RUE ROGUIER,
341044725,00016,34104472500016,O,1987-04-27,NN,,,,true,1,,,,LOT,COMMUNAL,39120,RAHON,,,39448,,,,,,,,,,,,,,,,,,,2002-06-30,F,,,,,20.1A,NAF1993,N,0.5200385,44.378885,0.82,poi.community_centre,(Salle des fêtes) Le Temple-sur-Lot,https://osm.org/way/319529214,G,,
342611936,00028,34261193600028,O,2020-11-10,,,,2020-12-15T08:45:10,true,1,,40,,RUE,DU MOULIN,39120,RAHON,,,39448,,,,,,,,,,,,,,,,,,,2020-11-10,A,,,,,68.20B,NAFRev2,N,5.453336,46.988939,0.95,housenumber,40 Rue du Moulin 39120 Rahon,39448_0012_00040,G,40 RUE DU MOULIN,
347860660,00013,34786066000013,O,,NN,,,,true,1,,,,,,39120,RAHON,,,39448,,,,,,,,,,,,,,,,,,,1994-06-30,F,,,,,52.4Y,NAF1993,N,,,0,,,,,,
347860801,00013,34786080100013,O,,NN,,,,true,1,,,,,,39120,RAHON,,,39448,,,,,,,,,,,,,,,,,,,1994-06-30,F,,,,,52.4Y,NAF1993,N,,,0,,,,,,
350528717,00019,35052871700019,O,1989-05-01,NN,,,,true,4,,,,PL,DE LA BASCULE,39120,RAHON,,,39448,,,,,,,,,,,,,,,,,,,1991-12-25,F,,,,,67.01,NAP,N,5.466758,46.982645,0.41,street,Rue de la Chapelle 39120 Rahon,39448_0005,G,RUE DE LA CHAPELLE,
351503388,00016,35150338800016,O,,NN,,,,true,1,,,,,,39120,RAHON,,,39448,,,,,,,,,,,,,,,,,,,1989-09-30,F,,,,,80.02,NAP,N,,,0,,,,,,
352209449,00011,35220944900011,O,1989-09-05,NN,,,2008-01-04T23:39:58,true,3,,,,,,39120,RAHON,,,39448,,,,,,,,,,,,,,,,,,,2008-01-01,A,,,,,94.99Z,NAFRev2,N,,,0,,,,,,
353161003,00036,35316100300036,O,1994-05-19,NN,,,2013-02-01T09:19:43,false,4,,7,,RUE,DE LA CHAPELLE,39120,RAHON,,,39448,,,,,,,,,,,,,,,,,,,2003-03-01,F,,,,,93.0D,NAFRev1,N,5.465876,46.98356,0.95,housenumber,7 Rue de la Chapelle 39120 Rahon,39448_0005_00007,G,7 RUE DE LA CHAPELLE,
353613623,00019,35361362300019,O,1990-01-29,01,2020,,2022-08-29T09:04:04,true,4,,,,RUE,DU BOIS,39120,RAHON,,,39448,,,,,,,,,,,,,,,,,,,2008-12-31,A,,,,,46.11Z,NAFRev2,O,5.465019,46.990077,0.95,street,Rue du Bois 39120 Rahon,39448_0002,G,RUE DU BOIS,
356000430,03892,35600043003892,O,1991-01-01,NN,,,2006-10-28T00:11:28,false,3,,13,,RUE,DE L'EGLISE,39120,RAHON,,,39448,,,,,,,,,,,,,,,,,,,2006-09-21,F,BUREAU DE POSTE,,,,64.1A,NAFRev1,N,5.461188,46.987571,0.95,housenumber,13 Rue de l’Eglise 39120 Rahon,39448_0030_00013,G,13 RUE DE L EGLISE,
377515580,00019,37751558000019,O,,NN,,,,true,1,,,,,,39120,RAHON,,,39448,,,,,,,,,,,,,,,,,,,1994-06-20,F,,,,,01.3Z,NAF1993,N,,,0,,,,,,
377515804,00013,37751580400013,O,,NN,,,,true,1,,,,,,39120,RAHON,,,39448,,,,,,,,,,,,,,,,,,,1991-12-31,F,,,,,01.07,NAP,N,,,0,,,,,,
378613491,00018,37861349100018,O,1990-04-27,NN,,,2016-01-14T03:56:13,true,3,,,,,MAIRIE,39120,RAHON,,,39448,,,,,,,,,,,,,,,,,,,2008-01-01,A,,,,,77.31Z,NAFRev2,N,3.0709671,50.6304695,0.92,poi.townhall,Hôtel de Ville Lille,https://osm.org/way/40917078,G,,
379977036,00019,37997703600019,O,1990-01-01,NN,,,,true,4,,,,RUE,DU BOIS,39120,RAHON,,,39448,,,,,,,,,,,,,,,,,,,2003-12-31,F,,,,,01.3Z,NAFRev1,N,5.465019,46.990077,0.95,street,Rue du Bois 39120 Rahon,39448_0002,G,RUE DU BOIS,
381224088,00017,38122408800017,O,1991-01-01,NN,,,2020-02-29T03:46:45,true,4,,3,,RUE,DES HALLES,39120,RAHON,,,39448,,,,,,,,,,,,,,,,,,,2014-12-31,A,,,,,01.50Z,NAFRev2,O,5.462167,46.986443,0.95,housenumber,3 Rue des Halles 39120 Rahon,39448_0008_00003,G,3 RUE DES HALLES,
381224088,00025,38122408800025,O,2020-10-01,,,,2020-10-20T12:03:50,false,1,,,,RTE,DE MOLAY,39120,RAHON,,,39448,,,,,,,,,,,,,,,,,,,2020-10-01,A,,,,,35.11Z,NAFRev2,N,5.452597,46.990406,0.8,street,Route de Molay 39120 Rahon,39448_0011,G,ROUTE DE MOLAY,
381917491,00023,38191749100023,O,2019-11-07,,,,2021-02-23T11:10:18,true,1,,2,,RUE,DES JONCHERETS,39120,RAHON,,,39448,,,,,,,,,,,,,,,,,,,2019-11-07,A,,,,,68.20B,NAFRev2,N,5.46395,46.984397,0.94,housenumber,2 Rue des Joncherets 39120 Rahon,39448_0009_00002,G,2 RUE DES JONCHERETS,
382177830,00017,38217783000017,O,,NN,,,,true,1,,,,RUE,DES HALLES,39120,RAHON,,,39448,,,,,,,,,,,,,,,,,,,1991-12-17,F,,,,,57.05,NAP,N,5.46275,46.985741,0.95,street,Rue des Halles 39120 Rahon,39448_0008,G,RUE DES HALLES,
382386290,00029,38238629000029,O,2001-01-08,NN,,4399CZ,2017-05-04T02:30:25,true,5,,5,,,RLE DES VIGNES,39120,RAHON,,,39448,,,,,,,,,,,,,,,,,,,2015-12-31,F,,,,,43.99C,NAFRev2,O,5.465645,46.984485,0.83,housenumber,5 Ruelle des Vignes 39120 Rahon,39448_0019_00005,G,5 RUELLE DES VIGNES,
384430542,00017,38443054200017,O,1992-01-01,NN,,,2018-09-29T12:13:30,true,4,,,,RUE,DU BOIS,39120,RAHON,,,39448,,,,,,,,,,,,,,,,,,,2014-12-31,A,,,,,01.50Z,NAFRev2,O,5.465019,46.990077,0.95,street,Rue du Bois 39120 Rahon,39448_0002,G,RUE DU BOIS,
391924198,00024,39192419800024,O,2018-01-01,,,,2021-02-23T11:17:46,true,1,,1,,,MEIX DE L'OPERA,39120,RAHON,,,39448,,,,,,,,,,,,,,,,,,,2018-01-01,A,LA FERME DU PETIT DESCHAUX,,,,01.45Z,NAFRev2,N,5.476757,46.967669,0.84,locality,Meix de l’Opéra 39120 Rahon,39448_B047,G,MEIX DE L OPERA,
394017198,00018,39401719800018,O,1994-01-29,NN,,,2016-02-16T03:57:10,true,4,,,,,,39120,RAHON,,,39448,,,,,,,,,,,,,,,,,,,2016-01-27,F,,,,,64.20Z,NAFRev2,N,,,0,,,,,,
394081277,00011,39408127700011,O,1994-01-01,NN,,,2007-01-18T09:35:23,true,3,,,,,,39120,RAHON,,,39448,,,,,,,,,,,,,,,,,,,1998-12-25,F,,,,,01.3Z,NAF1993,N,,,0,,,,,,
394081749,00019,39408174900019,O,,,,,,true,1,,,,RUE,DES HALLES,39120,RAHON,,,39448,,,,,,,,,,,,,,,,,,,1997-12-31,F,,,,,01.3Z,NAF1993,N,5.46275,46.985741,0.95,street,Rue des Halles 39120 Rahon,39448_0008,G,RUE DES HALLES,
394234918,00016,39423491800016,O,,NN,,,,true,1,,,,,,39120,RAHON,,,39448,,,,,,,,,,,,,,,,,,,1995-01-01,F,,,,,01.3Z,NAF1993,N,,,0,,,,,,
394587398,00014,39458739800014,O,1993-01-01,NN,,,2015-08-12T08:05:41,true,4,,,,,,39120,RAHON,,,39448,,,,,,,,,,,,,,,,,,,2015-12-31,F,,,,,01.11Z,NAFRev2,N,,,0,,,,,,
397785627,00019,39778562700019,O,1994-04-21,NN,,,2008-01-04T18:35:19,true,3,,31,,RUE,DU MOULIN,39120,RAHON,,,39448,,,,,,,,,,,,,,,,,,,2008-01-01,A,,,,,68.20B,NAFRev2,N,5.45465,46.989,0.95,housenumber,31 Rue du Moulin 39120 Rahon,39448_0012_00031,G,31 RUE DU MOULIN,
398137489,00017,39813748900017,O,1994-07-01,NN,,,2008-11-08T01:04:04,true,4,,,,RUE,DES VAIVRES,39120,RAHON,,,39448,,,,,,,,,,,,,,,,,,,2004-12-31,F,,,,,45.1A,NAFRev1,O,5.450999,46.989554,0.95,street,Rue des Vaivres 39120 Rahon,39448_0018,G,RUE DES VAIVRES,
402083950,00046,40208395000046,O,2010-04-01,,,,2021-09-07T16:44:10,false,3,,6,,RUE,DE LA RAPPE,39120,RAHON,,,39448,,,,,,,,,,,,,,,,,,,2021-08-31,F,,,,,85.51Z,NAFRev2,N,5.462286,46.989825,0.94,housenumber,6 Rue de la Rappe 39120 Rahon,39448_0016_00006,G,6 RUE DE LA RAPPE,
408472306,00013,40847230600013,O,1996-08-01,NN,,,,false,4,,8,,RUE,DU BOIS,39120,RAHON,,,39448,,,,,,,,,,,,,,,,,,,1998-12-15,F,,,,,70.2C,NAF1993,N,5.461939,46.988663,0.95,housenumber,8 Rue du Bois 39120 Rahon,39448_0002_00008,G,8 RUE DU BOIS,
409081593,00017,40908159300017,O,1996-08-01,NN,,,2008-11-08T01:21:09,false,4,,11,,RUE,DE L'EGLISE,39120,RAHON,,,39448,,,,,,,,,,,,,,,,,,,1998-09-30,F,,,,,15.8C,NAF1993,O,5.461103,46.987638,0.95,housenumber,11 Rue de l’Eglise 39120 Rahon,39448_0030_00011,G,11 RUE DE L EGLISE,
409931771,00011,40993177100011,O,1986-12-31,NN,,,2008-01-04T21:34:10,true,3,,,,,,39120,RAHON,,,39448,,,,,,,,,,,,,,,,,,,2008-01-01,A,,,,,01.11Z,NAFRev2,N,,,0,,,,,,
409931789,00013,40993178900013,O,1982-12-31,NN,,,,true,1,,,,,,39120,RAHON,,,39448,,,,,,,,,,,,,,,,,,,2002-12-31,F,,,,,01.1A,NAF1993,N,,,0,,,,,,
410105043,00013,41010504300013,O,1996-12-01,NN,,,2008-01-04T21:37:27,true,4,,25,,RUE,DU BOIS,39120,RAHON,,,39448,,,,,,,,,,,,,,,,,,,2008-01-01,A,,,,,94.99Z,NAFRev2,N,5.463395,46.988993,0.95,housenumber,25 Rue du Bois 39120 Rahon,39448_0002_00025,G,25 RUE DU BOIS,
411193956,00017,41119395600017,O,1997-01-01,NN,,,2008-01-04T21:55:02,true,3,,,,,,39120,RAHON,,,39448,,,,,,,,,,,,,,,,,,,2008-01-01,A,,,,,01.50Z,NAFRev2,N,,,0,,,,,,
411337389,00018,41133738900018,O,1982-12-31,NN,,,2006-12-15T01:05:40,false,4,,,,,,39120,RAHON,,,39448,,,,,,,,,,,,,,,,,,,1998-04-01,F,,,,,01.1A,NAF1993,N,,,0,,,,,,
411547938,00018,41154793800018,O,1997-04-01,NN,,,2006-11-25T15:31:57,true,4,,,,,,39120,RAHON,,,39448,,,,,,,,,,,,,,,,,,,2004-09-30,F,,,,,55.1A,NAFRev1,O,,,0,,,,,,
415149608,00010,41514960800010,O,1998-01-01,NN,,,,false,4,,18,,RUE,DES HALLES,39120,RAHON,,,39448,,,,,,,,,,,,,,,,,,,2001-10-30,F,,,,,01.2A,NAF1993,N,5.463081,46.985323,0.95,housenumber,18 Rue des Halles 39120 Rahon,39448_0008_00018,G,18 RUE DES HALLES,
415149608,00028,41514960800028,O,2001-10-30,NN,,,2012-05-05T06:11:40,true,3,,3,,RUE,DU MOULIN,39120,RAHON,,,39448,,,,,,,,,,,,,,,,,,,2008-01-01,A,,,,,01.42Z,NAFRev2,N,5.459833,46.98837,0.95,housenumber,3 Rue du Moulin 39120 Rahon,39448_0012_00003,G,3 RUE DU MOULIN,
415149608,00036,41514960800036,O,2001-10-30,NN,,,2013-05-18T04:26:58,false,3,,3,,RUE,DU MOULIN,39120,RAHON,,,39448,,,,,,,,,,,,,,,,,,,2008-01-01,A,,,,,02.20Z,NAFRev2,N,5.459833,46.98837,0.95,housenumber,3 Rue du Moulin 39120 Rahon,39448_0012_00003,G,3 RUE DU MOULIN,
415394931,00018,41539493100018,O,1997-01-01,,,,2011-04-23T09:47:26,false,3,MME BOUGAIN,31,,RUE,DU MOULIN,39120,RAHON,,,39448,,,,,,,,,,,,,,,,,,,2004-01-01,F,,,,,74.5A,NAFRev1,N,5.45465,46.989,0.95,housenumber,31 Rue du Moulin 39120 Rahon,39448_0012_00031,G,31 RUE DU MOULIN,
418194882,00019,41819488200019,O,1998-03-20,,,,,true,1,,8,,RUE,DU BOIS,39120,RAHON,,,39448,,,,,,,,,,,,,,,,,,,2000-04-01,F,,,,,74.1J,NAF1993,N,5.461939,46.988663,0.95,housenumber,8 Rue du Bois 39120 Rahon,39448_0002_00008,G,8 RUE DU BOIS,
418704151,00012,41870415100012,O,1998-04-01,NN,,,,true,1,,1,,CHE,DE L'ILE,39120,RAHON,,,39448,,,,,,,,,,,,,,,,,,,2001-03-31,F,,,,,01.2A,NAF1993,N,5.452689,46.992849,0.81,housenumber,1 Chemin de l’Ile 39120 Rahon,39448_o3ipkd_00001,G,1 CHEMIN DE L ILE,
419012901,00015,41901290100015,O,1998-05-18,NN,,,,true,4,,2,,RUE,DES BARAZINES,39120,RAHON,,,39448,,,,,,,,,,,,,,,,,,,2002-12-04,F,,,,,74.1J,NAF1993,N,5.464874,46.989919,0.95,housenumber,2 Rue des Barazines 39120 Rahon,39448_ntqnzp_00002,G,2 RUE DES BARAZINES,
420759060,00015,42075906000015,O,1998-10-01,NN,,,,true,4,,11,,RUE,DE L'EGLISE,39120,RAHON,,,39448,,,,,,,,,,,,,,,,,,,2000-09-20,F,,,,,15.8C,NAF1993,O,5.461103,46.987638,0.95,housenumber,11 Rue de l’Eglise 39120 Rahon,39448_0030_00011,G,11 RUE DE L EGLISE,
423319375,00014,42331937500014,O,1999-06-05,NN,,,2008-01-05T20:44:34,true,3,,1,,RUE,DES BARAZINES,39120,RAHON,,,39448,,,,,,,,,,,,,,,,,,,2008-01-01,A,,,,,68.20B,NAFRev2,N,5.4654,46.989866,0.95,housenumber,1 Rue des Barazines 39120 Rahon,39448_ntqnzp_00001,G,1 RUE DES BARAZINES,
424724706,00017,42472470600017,O,1998-12-10,NN,,,2017-05-04T02:05:41,true,4,MME LAIBE MARTINE,1,,RUE,DES BARAZINES,39120,RAHON,,,39448,,,,,,,,,,,,,,,,,,,2008-01-01,A,,,,,93.29Z,NAFRev2,O,5.4654,46.989866,0.95,housenumber,1 Rue des Barazines 39120 Rahon,39448_ntqnzp_00001,G,1 RUE DES BARAZINES,
428032650,00015,42803265000015,O,1980-01-01,NN,,,2008-01-05T01:21:34,true,3,,6,,RUE,DU BOIS,39120,RAHON,,,39448,,,,,,,,,,,,,,,,,,,2008-01-01,A,,,,,01.41Z,NAFRev2,N,5.46169,46.988559,0.95,housenumber,6 Rue du Bois 39120 Rahon,39448_0002_00006,G,6 RUE DU BOIS,
428032791,00017,42803279100017,O,1990-01-01,NN,,,2008-01-05T01:21:34,true,3,,11,,RUE,DES HALLES,39120,RAHON,,,39448,,,,,,,,,,,,,,,,,,,2008-01-01,A,,,,,01.41Z,NAFRev2,N,5.463085,46.985525,0.95,housenumber,11 Rue des Halles 39120 Rahon,39448_0008_00011,G,11 RUE DES HALLES,
429154990,00031,42915499000031,O,2016-10-02,,,,2021-02-23T11:48:47,true,1,,6,,RUE,DU MOULIN,39120,RAHON,,,39448,,,,,,,,,,,,,,,,,,,2016-10-02,A,,,,,02.10Z,NAFRev2,N,5.458201,46.988585,0.95,housenumber,6 Rue du Moulin 39120 Rahon,39448_0012_00006,G,6 RUE DU MOULIN,
429214430,00010,42921443000010,O,2000-01-31,NN,,,2011-05-03T00:40:54,false,5,,2,,RUE,DE L'EGLISE,39120,RAHON,,,39448,,,,,,,,,,,,,,,,,,,2002-02-21,F,,,,,74.1J,NAF1993,N,5.460405,46.98816,0.95,housenumber,2 Rue de l’Eglise 39120 Rahon,39448_0030_00002,G,2 RUE DE L EGLISE,
434895009,00018,43489500900018,O,2001-02-24,NN,,,2010-07-11T05:30:45,true,3,,7,,RUE,DES BARAZINES,39120,RAHON,,,39448,,,,,,,,,,,,,,,,,,,2008-01-01,A,,,,,68.20B,NAFRev2,N,5.466728,46.989411,0.95,housenumber,7 Rue des Barazines 39120 Rahon,39448_ntqnzp_00007,G,7 RUE DES BARAZINES,
438577777,00016,43857777700016,O,2001-04-01,01,2020,,2022-10-13T04:14:49,true,3,,1,,CHE,DE L'ILE,39120,RAHON,,,39448,,,,,,,,,,,,,,,,,,,2008-01-01,A,,,,,01.41Z,NAFRev2,N,5.452689,46.992849,0.81,housenumber,1 Chemin de l’Ile 39120 Rahon,39448_o3ipkd_00001,G,1 CHEMIN DE L ILE,
444873020,00036,44487302000036,O,2006-01-10,00,2020,4339ZZ,2022-08-29T09:21:00,true,4,,4,,RUE,DES JONCHERETS,39120,RAHON,,,39448,,,,,,,,,,,,,,,,,,,2008-01-01,A,,,,,43.99C,NAFRev2,O,5.463952,46.983899,0.94,housenumber,4 Rue des Joncherets 39120 Rahon,39448_0009_00004,G,4 RUE DES JONCHERETS,
447493487,00014,44749348700014,O,2003-01-01,NN,,,2006-10-31T04:37:35,true,3,,30,,RUE,DES VAIVRES,39120,RAHON,,,39448,,,,,,,,,,,,,,,,,,,2003-12-31,F,,,,,01.3Z,NAFRev1,N,5.448718,46.991128,0.95,housenumber,30 Rue des Vaivres 39120 Rahon,39448_0018_00030,G,30 RUE DES VAIVRES,
451958896,00032,45195889600032,O,2006-02-11,,,,2006-11-01T00:24:18,false,2,CHEZ MME VUILLEMIN FRANCOISE,5,,RUE,DE LA RAPPE,39120,RAHON,,,39448,,,,,,,,,,,,,,,,,,,2006-04-06,F,,,,,85.1E,NAFRev1,N,5.461824,46.989469,0.94,housenumber,5 Rue de la Rappe 39120 Rahon,39448_0016_00005,G,5 RUE DE LA RAPPE,
452263031,00018,45226303100018,O,2004-02-23,NN,,,2014-09-26T10:32:36,false,3,,21,,RUE,DU BOIS,39120,RAHON,,,39448,,,,,,,,,,,,,,,,,,,2004-12-25,F,,,,,85.1C,NAFRev1,N,5.46308,46.9888,0.95,housenumber,21 Rue du Bois 39120 Rahon,39448_0002_00021,G,21 RUE DU BOIS,
452342181,00016,45234218100016,O,2004-03-01,NN,,,2007-05-22T00:11:40,true,3,,8,,RUE,DU BOIS,39120,RAHON,,,39448,,,,,,,,,,,,,,,,,,,2005-11-30,F,,,,,74.1G,NAFRev1,N,5.461939,46.988663,0.95,housenumber,8 Rue du Bois 39120 Rahon,39448_0002_00008,G,8 RUE DU BOIS,
478279292,00021,47827929200021,O,2022-01-14,,,,2022-03-03T11:18:34,true,1,,1,,RUE,DES BARAZINES,39120,RAHON,,,39448,,,,,,,,,,,,,,,,,,,2022-01-14,A,,,,,93.12Z,NAFRev2,N,5.4654,46.989866,0.95,housenumber,1 Rue des Barazines 39120 Rahon,39448_ntqnzp_00001,G,1 RUE DES BARAZINES,
480592559,00011,48059255900011,O,2004-12-20,NN,,,2008-01-05T21:45:15,true,3,M. JEAN PIERRE CAUET,7,,RUE,ROGUIER,39120,RAHON,,,39448,,,,,,,,,,,,,,,,,,,2008-01-01,A,,,,,68.20B,NAFRev2,N,5.459306,46.98932,0.95,housenumber,7 Rue Roguier 39120 Rahon,39448_0017_00007,G,7 RUE ROGUIER,
483545331,00017,48354533100017,O,2005-07-27,NN,,,2019-09-20T03:50:13,true,5,,3,,RUE,DU MOULIN,39120,RAHON,,,39448,,,,,,,,,,,,,,,,,,,2019-09-01,A,,,,,49.41B,NAFRev2,N,5.459833,46.98837,0.95,housenumber,3 Rue du Moulin 39120 Rahon,39448_0012_00003,G,3 RUE DU MOULIN,
490086154,00013,49008615400013,O,1999-12-15,,,,2008-01-05T03:22:10,true,2,CZ MME.MARTIN ANICK,5,,RUE,DES PITOUX,39120,RAHON,,,39448,,,,,,,,,,,,,,,,,,,2008-01-01,A,,,,,94.99Z,NAFRev2,N,5.462895,46.990124,0.88,housenumber,5 Ruelle des Pitoux 39120 Rahon,39448_0013_00005,G,5 RUELLE DES PITOUX,
495063059,00010,49506305900010,O,2007-04-01,NN,,,2010-04-18T12:48:34,false,4,CHEZ MME PATENAT NATHALIE,2,,RUE,DES PETITS SOULIERS,39120,RAHON,,,39448,,,,,,,,,,,,,,,,,,,2008-05-01,F,,,,,86.90F,NAFRev2,O,5.467121,46.98271,0.94,housenumber,2 Rue des Petits Souliers 39120 Rahon,39448_0014_00002,G,2 RUE DES PETITS SOULIERS,
501864201,00014,50186420100014,O,2008-01-01,NN,,,2017-05-04T01:52:22,false,3,,6,,RUE,DES MERLES,39120,RAHON,,,39448,,,,,,,,,,,,,,,,,,,2015-11-01,F,,,,,01.13Z,NAFRev2,O,5.465728,46.992085,0.88,housenumber,6 Ruelle des Merles 39120 Rahon,39448_0040_00006,G,6 RUELLE DES MERLES,
501864201,00022,50186420100022,O,2015-11-01,01,2020,,2022-08-29T09:04:20,true,1,,1,,RLE,DES MERLES,39120,RAHON,,,39448,,,,,,,,,,,,,,,,,,,2015-11-01,A,,,,,01.13Z,NAFRev2,N,5.465523,46.992103,0.87,housenumber,1 Ruelle des Merles 39120 Rahon,39448_0040_00001,G,1 RUELLE DES MERLES,
501869887,00015,50186988700015,O,2008-02-01,,,,2012-11-10T00:16:21,true,4,,5,,RUE,DE LA CHAPELLE,39120,RAHON,,,39448,,,,,,,,,,,,,,,,,,,2011-07-31,F,,,,,95.29Z,NAFRev2,N,5.465604,46.983763,0.95,housenumber,5 Rue de la Chapelle 39120 Rahon,39448_0005_00005,G,5 RUE DE LA CHAPELLE,
508589017,00013,50858901700013,O,2008-03-14,,,,2011-10-20T09:40:28,false,2,,2,,RUE,DE L'EGLISE,39120,RAHON,,,39448,,,,,,,,,,,,,,,,,,,2009-05-30,F,,,,,86.90D,NAFRev2,N,5.460405,46.98816,0.95,housenumber,2 Rue de l’Eglise 39120 Rahon,39448_0030_00002,G,2 RUE DE L EGLISE,
508778024,00028,50877802400028,O,2008-09-15,,,1083ZZ,2020-10-05T03:33:17,false,7,,5,,IMP,DE LAYS,39120,RAHON,,,39448,,,,,,,,,,,,,,,,,,,2019-09-14,F,,,,,86.90D,NAFRev2,N,5.463718,46.988182,0.68,housenumber,5 Impasse des Lays 39120 Rahon,39448_0010_00005,G,5 IMPASSE DES LAYS,