siren,nic,siret,statutDiffusionEtablissement,dateCreationEtablissement,trancheEffectifsEtablissement,anneeEffectifsEtablissement,activitePrincipaleRegistreMetiersEtablissement,dateDernierTraitementEtablissement,etablissementSiege,nombrePeriodesEtablissement,complementAdresseEtablissement,numeroVoieEtablissement,indiceRepetitionEtablissement,typeVoieEtablissement,libelleVoieEtablissement,codePostalEtablissement,libelleCommuneEtablissement,libelleCommuneEtrangerEtablissement,distributionSpecialeEtablissement,codeCommuneEtablissement,codeCedexEtablissement,libelleCedexEtablissement,codePaysEtrangerEtablissement,libellePaysEtrangerEtablissement,complementAdresse2Etablissement,numeroVoie2Etablissement,indiceRepetition2Etablissement,typeVoie2Etablissement,libelleVoie2Etablissement,codePostal2Etablissement,libelleCommune2Etablissement,libelleCommuneEtranger2Etablissement,distributionSpeciale2Etablissement,codeCommune2Etablissement,codeCedex2Etablissement,libelleCedex2Etablissement,codePaysEtranger2Etablissement,libellePaysEtranger2Etablissement,dateDebut,etatAdministratifEtablissement,enseigne1Etablissement,enseigne2Etablissement,enseigne3Etablissement,denominationUsuelleEtablissement,activitePrincipaleEtablissement,nomenclatureActivitePrincipaleEtablissement,caractereEmployeurEtablissement,longitude,latitude,geo_score,geo_type,geo_adresse,geo_id,geo_ligne,geo_l4,geo_l5
214202889,00017,21420288900017,O,1983-03-01,02,2020,,2022-08-29T09:07:14,true,4,HOTEL DE VILLE,,,,,42130,SAINT-SIXTE,,,42288,,,,,,,,,,,,,,,,,,,2008-01-01,A,MAIRIE,,,,84.11Z,NAFRev2,O,3.987319,45.77511,0.39,street,Chemin de la Treille 42130 Saint-Sixte,42288_0530,D,CHEMIN DE LA TREILLE,
214202889,00025,21420288900025,O,1983-12-21,01,2020,,2022-08-29T09:07:14,false,3,,,,,LE BOURG,42130,SAINT-SIXTE,,,42288,,,,,,,,,,,,,,,,,,,2008-01-01,A,ECOLE MATERNELLE PUBLIQUE,,,,85.10Z,NAFRev2,N,3.982479,45.774261,0.62,street,Impasse du Bourg 42130 Saint-Sixte,42288_0080,G,IMPASSE DU BOURG,
214202889,00033,21420288900033,O,1996-01-01,NN,,,2019-12-30T14:36:59,false,4,MAIRIE,,,,,42130,SAINT-SIXTE,,,42288,,,,,,,,,,,,,,,,,,,2019-12-26,F,SCE ASSAINISSEMENT,,,,37.00Z,NAFRev2,N,3.974334,45.780144,0.38,street,Chemin de la Prêtrerie 42130 Saint-Sixte,42288_0450,D,CHEMIN DE LA PRETRERIE,
264203126,00018,26420312600018,O,1992-01-01,NN,,,2019-11-14T14:00:38,true,4,,,,,MAIRIE,42130,SAINT-SIXTE,,,42288,,,,,,,,,,,,,,,,,,,2008-09-10,A,CCAS,,,,88.99B,NAFRev2,O,3.0709671,50.6304695,0.92,poi.townhall,Hôtel de Ville Lille,https://osm.org/way/40917078,G,,
301284287,00010,30128428700010,O,,,,,2019-11-14T14:00:38,true,1,,,,,LA FABRIQUE,42130,SAINT-SIXTE,,,42288,,,,,,,,,,,,,,,,,,,1984-12-25,F,,,,,56.02,NAP,N,3.98331,45.752389,0.92,street,Chemin de la Fabrique 42130 Saint-Sixte,42288_0240,G,CHEMIN DE LA FABRIQUE,
303848352,00074,30384835200074,O,2006-07-03,NN,,,2019-11-14T14:00:38,true,5,,,,,LA FABRIQUE,42130,SAINT-SIXTE,,,42288,,,,,,,,,,,,,,,,,,,2008-11-30,F,JC AUTOMOBILE,,,,45.20A,NAFRev2,N,3.98331,45.752389,0.92,street,Chemin de la Fabrique 42130 Saint-Sixte,42288_0240,G,CHEMIN DE LA FABRIQUE,
304416910,00020,30441691000020,O,,NN,,,2019-11-14T14:00:38,true,1,,,,PL,CHIRAT,42130,SAINT-SIXTE,,,42288,,,,,,,,,,,,,,,,,,,1988-01-31,F,,,,,55.60,NAP,N,3.984754,45.779,0.65,street,Chemin de Chirat 42130 Saint-Sixte,42288_0140,G,CHEMIN DE CHIRAT,
305283236,00019,30528323600019,O,1900-01-01,NN,,,2019-11-14T14:00:38,true,3,,,,,LE MONTCEL,42130,SAINT-SIXTE,,,42288,,,,,,,,,,,,,,,,,,,2008-01-01,A,,,,,01.41Z,NAFRev2,N,3.998566,45.772829,0.68,street,Chemin du Montcel 42130 Saint-Sixte,42288_0370,G,CHEMIN DU MONTCEL,
312049539,00017,31204953900017,O,1978-01-01,NN,,,2019-11-14T14:00:38,true,4,,,,,LE BOURG,42130,SAINT-SIXTE,,,42288,,,,,,,,,,,,,,,,,,,2008-06-30,F,,,,,47.78C,NAFRev2,N,3.982479,45.774261,0.62,street,Impasse du Bourg 42130 Saint-Sixte,42288_0080,G,IMPASSE DU BOURG,
312524887,00014,31252488700014,O,1978-01-01,NN,,,2019-11-14T14:00:38,true,5,,,,LD,DE LA PREBENDE,42130,SAINT-SIXTE,,,42288,,,,,,,,,,,,,,,,,,,2008-01-01,A,,,,,55.30Z,NAFRev2,N,3.98042,45.7726,0.93,street,Chemin de la Prébende 42130 Saint-Sixte,42288_0440,G,CHEMIN DE LA PREBENDE,
313209793,00014,31320979300014,O,1978-01-01,NN,,,2019-11-14T14:00:38,true,3,,,,,MAIRIE DE ST SIXTE,42130,SAINT-SIXTE,,,42288,,,,,,,,,,,,,,,,,,,2008-01-01,A,,,,,01.61Z,NAFRev2,N,3.97012,45.777129,0.69,street,Route de St-Martin 42130 Saint-Sixte,42288_0480,G,ROUTE DE ST MARTIN,
314847450,00033,31484745000033,O,1988-03-01,,,,2019-11-14T14:00:38,false,3,,,,,LES ROLLAND,42130,SAINT-SIXTE,,,42288,,,,,,,,,,,,,,,,,,,1997-01-01,F,,,,,45.4J,NAF1993,N,3.977593,45.767571,0.7,street,Chemin des Rollands 42130 Saint-Sixte,42288_0470,G,CHEMIN DES ROLLANDS,
316243054,00012,31624305400012,O,,,,,2019-11-14T14:00:38,true,1,,,,,LA FABRIQUE,42130,SAINT-SIXTE,,,42288,,,,,,,,,,,,,,,,,,,1984-12-25,F,,,,,65.02,NAP,N,3.98331,45.752389,0.92,street,Chemin de la Fabrique 42130 Saint-Sixte,42288_0240,G,CHEMIN DE LA FABRIQUE,
316364900,00027,31636490000027,O,,NN,,,2019-11-14T14:00:38,true,1,,,,LD,LA FABRIQUE,42130,SAINT-SIXTE,,,42288,,,,,,,,,,,,,,,,,,,1989-06-21,F,,,,,67.07,NAP,N,3.98331,45.752389,0.92,street,Chemin de la Fabrique 42130 Saint-Sixte,42288_0240,G,CHEMIN DE LA FABRIQUE,
318126091,00020,31812609100020,O,2013-01-02,,,,2021-02-23T10:42:50,true,1,,,,,LA PREBANDE,42130,SAINT-SIXTE,,,42288,,,,,,,,,,,,,,,,,,,2013-01-02,A,,,,,43.32A,NAFRev2,N,3.98042,45.7726,0.7,street,Chemin de la Prébende 42130 Saint-Sixte,42288_0440,G,CHEMIN DE LA PREBENDE,
320191786,00013,32019178600013,O,1980-10-01,NN,,,2019-11-14T14:00:38,true,3,,,,,LA FABRIQUE,42130,SAINT-SIXTE,,,42288,,,,,,,,,,,,,,,,,,,2004-10-06,F,,,,,50.1Z,NAFRev1,N,3.98331,45.752389,0.92,street,Chemin de la Fabrique 42130 Saint-Sixte,42288_0240,G,CHEMIN DE LA FABRIQUE,
320206857,00015,32020685700015,O,,NN,,,2019-11-14T14:00:38,true,1,,,,,BOURG ST SIXTE,42130,SAINT-SIXTE,,,42288,,,,,,,,,,,,,,,,,,,1992-12-31,F,,,,,55.3A,NAF1993,N,3.982479,45.774261,0.81,street,Impasse du Bourg 42130 Saint-Sixte,42288_0080,G,IMPASSE DU BOURG,
321296477,00037,32129647700037,O,2009-08-01,,,4520BA,2022-10-06T09:37:59,true,2,,,,,LE MONTCEL,42130,SAINT-SIXTE,,,42288,,,,,,,,,,,,,,,,,,,2021-12-31,F,,,,,45.11Z,NAFRev2,N,3.998566,45.772829,0.68,street,Chemin du Montcel 42130 Saint-Sixte,42288_0370,G,CHEMIN DU MONTCEL,
322875337,00022,32287533700022,O,1985-04-06,NN,,,2019-11-14T14:00:38,true,7,,,,LD,LA PREBENDE,42130,SAINT-SIXTE,,,42288,,,,,,,,,,,,,,,,,,,2017-12-29,F,,,,,68.20B,NAFRev2,N,3.98042,45.7726,0.92,street,Chemin de la Prébende 42130 Saint-Sixte,42288_0440,G,CHEMIN DE LA PREBENDE,
324326990,00029,32432699000029,O,,NN,,,2019-11-14T14:00:38,true,1,,,,LD,LE MONTCEL,42130,SAINT-SIXTE,,,42288,,,,,,,,,,,,,,,,,,,,F,,,,,55.60,NAP,N,3.998566,45.772829,0.68,street,Chemin du Montcel 42130 Saint-Sixte,42288_0370,G,CHEMIN DU MONTCEL,
325836716,00010,32583671600010,O,1983-01-01,NN,,,2019-11-14T14:00:38,true,3,,,,LD,LA FABRIQUE,42130,SAINT-SIXTE,,,42288,,,,,,,,,,,,,,,,,,,2004-06-30,F,,,,,50.2Z,NAFRev1,N,3.98331,45.752389,0.92,street,Chemin de la Fabrique 42130 Saint-Sixte,42288_0240,G,CHEMIN DE LA FABRIQUE,
326802626,00019,32680262600019,O,1982-08-12,NN,,,2019-11-14T14:00:38,true,3,,,,LD,LE BOURG,42130,SAINT-SIXTE,,,42288,,,,,,,,,,,,,,,,,,,2008-01-01,A,,,,,02.40Z,NAFRev2,N,3.982479,45.774261,0.62,street,Impasse du Bourg 42130 Saint-Sixte,42288_0080,G,IMPASSE DU BOURG,
327597209,00011,32759720900011,O,,NN,,,2019-11-14T14:00:38,true,1,,,,,LA FABRIQUE,42130,SAINT-SIXTE,,,42288,,,,,,,,,,,,,,,,,,,,F,,,,,81.21,NAP,N,3.98331,45.752389,0.92,street,Chemin de la Fabrique 42130 Saint-Sixte,42288_0240,G,CHEMIN DE LA FABRIQUE,
327614699,00012,32761469900012,O,,NN,,,2019-11-14T14:00:38,true,1,,,,,LA FABRIQUE,42130,SAINT-SIXTE,,,42288,,,,,,,,,,,,,,,,,,,,F,,,,,81.21,NAP,N,3.98331,45.752389,0.92,street,Chemin de la Fabrique 42130 Saint-Sixte,42288_0240,G,CHEMIN DE LA FABRIQUE,
331571406,00015,33157140600015,O,1985-01-01,NN,,,2020-10-22T16:02:50,true,6,,,,LD,LA TREILLE,42130,SAINT-SIXTE,,,42288,,,,,,,,,,,,,,,,,,,2020-10-01,F,,,,,66.22Z,NAFRev2,N,3.987319,45.77511,0.92,street,Chemin de la Treille 42130 Saint-Sixte,42288_0530,G,CHEMIN DE LA TREILLE,
334526134,00013,33452613400013,O,,NN,,,2019-11-14T14:00:38,true,1,,,,LD,LA PREBENDE,42130,SAINT-SIXTE,,,42288,,,,,,,,,,,,,,,,,,,,F,,,,,62.42,NAP,N,3.98042,45.7726,0.92,street,Chemin de la Prébende 42130 Saint-Sixte,42288_0440,G,CHEMIN DE LA PREBENDE,
335098430,00010,33509843000010,O,1986-01-06,NN,,,2019-11-14T14:00:38,true,4,,,,LD,LIMES,42130,SAINT-SIXTE,,,42288,,,,,,,,,,,,,,,,,,,1999-12-31,F,,,,,45.1A,NAF1993,N,3.967027,45.776433,0.91,street,Chemin de Limes 42130 Saint-Sixte,42288_0340,G,CHEMIN DE LIMES,
337746333,00018,33774633300018,O,1986-02-02,NN,,,2019-11-14T14:00:38,true,3,,,,RTE,DE CEZAY,42130,SAINT-SIXTE,,,42288,,,,,,,,,,,,,,,,,,,2008-01-01,A,,,,,94.99Z,NAFRev2,N,4.003959,45.772802,0.81,street,Route de Cezay 42130 Saint-Sixte,42288_0090,G,ROUTE DE CEZAY,
339101966,00028,33910196600028,O,1991-04-02,NN,,,2021-12-07T08:45:54,false,5,,607,,RTE,DE SAINT MARTIN,42130,SAINT-SIXTE,,,42288,,,,,,,,,,,,,,,,,,,2021-05-20,F,,,,,68.10Z,NAFRev2,N,3.973243,45.775069,0.85,housenumber,607 Route de St-Martin 42130 Saint-Sixte,42288_0480_00607,G,607 ROUTE DE ST MARTIN,
339733750,00030,33973375000030,O,2009-04-15,,,,2021-02-23T10:55:54,false,1,,,,LD,LE BOURG,42130,SAINT-SIXTE,,,42288,,,,,,,,,,,,,,,,,,,2009-04-15,A,,,,,01.45Z,NAFRev2,N,3.982479,45.774261,0.62,street,Impasse du Bourg 42130 Saint-Sixte,42288_0080,G,IMPASSE DU BOURG,
340186774,00014,34018677400014,O,,NN,,,2019-11-14T14:00:38,true,1,,,,,LD LE MONTCEL,42130,SAINT-SIXTE,,,42288,,,,,,,,,,,,,,,,,,,1993-09-16,F,,,,,28.5D,NAF1993,N,3.998566,45.772829,0.68,street,Chemin du Montcel 42130 Saint-Sixte,42288_0370,G,CHEMIN DU MONTCEL,
341025625,00011,34102562500011,O,,NN,,,2019-11-14T14:00:38,true,1,,,,,L'ETANG,42130,SAINT-SIXTE,,,42288,,,,,,,,,,,,,,,,,,,1996-03-31,F,,,,,52.6D,NAF1993,N,3.982115,45.776578,0.35,street,Montée de l’Église 42130 Saint-Sixte,42288_0220,G,MONTEE DE L EGLISE,
342448347,00019,34244834700019,O,1987-10-01,NN,,4334ZC,2022-03-04T04:10:36,true,3,,,,,LE MONTCEL,42130,SAINT-SIXTE,,,42288,,,,,,,,,,,,,,,,,,,1992-03-01,F,,,,,45.4J,NAF1993,,3.998566,45.772829,0.68,street,Chemin du Montcel 42130 Saint-Sixte,42288_0370,G,CHEMIN DU MONTCEL,
343392205,00021,34339220500021,O,1988-12-31,NN,,,2022-12-15T04:08:22,true,5,,,,LD,LIMES,42130,SAINT-SIXTE,,,42288,,,,,,,,,,,,,,,,,,,2022-12-30,F,,,,,01.42Z,NAFRev2,N,3.967027,45.776433,0.91,street,Chemin de Limes 42130 Saint-Sixte,42288_0340,G,CHEMIN DE LIMES,
343508404,00013,34350840400013,O,1988-01-01,NN,,,2020-12-17T03:44:22,true,4,,,,,LA TREILLE,42130,SAINT-SIXTE,,,42288,,,,,,,,,,,,,,,,,,,2020-12-31,F,,,,,01.41Z,NAFRev2,N,3.987319,45.77511,0.92,street,Chemin de la Treille 42130 Saint-Sixte,42288_0530,G,CHEMIN DE LA TREILLE,
343929030,00017,34392903000017,O,1988-01-01,NN,,,2019-11-14T14:00:38,true,4,,,,,LE BOURG,42130,SAINT-SIXTE,,,42288,,,,,,,,,,,,,,,,,,,2010-10-31,F,,,,,01.41Z,NAFRev2,N,3.982479,45.774261,0.62,street,Impasse du Bourg 42130 Saint-Sixte,42288_0080,G,IMPASSE DU BOURG,
344407168,00022,34440716800022,O,2000-05-11,NN,,,2019-11-14T14:00:38,true,1,,,,,LA TREILLE,42130,SAINT-SIXTE,,,42288,,,,,,,,,,,,,,,,,,,2002-09-30,F,,,,,29.6B,NAF1993,N,3.987319,45.77511,0.92,street,Chemin de la Treille 42130 Saint-Sixte,42288_0530,G,CHEMIN DE LA TREILLE,
348188533,00023,34818853300023,O,2012-07-15,,,,2021-02-23T11:01:07,true,1,,,,,JAY,42130,SAINT-SIXTE,,,42288,,,,,,,,,,,,,,,,,,,2012-07-15,A,FORESCALADE,,,,85.51Z,NAFRev2,N,3.99229,45.778213,0.91,street,Chemin de Jay 42130 Saint-Sixte,42288_0310,G,CHEMIN DE JAY,
348433913,00020,34843391300020,O,,NN,,,2019-11-14T14:00:38,true,1,,,,,LA FABRIQUE,42130,SAINT-SIXTE,,,42288,,,,,,,,,,,,,,,,,,,1993-06-01,F,,,,,52.6E,NAF1993,N,3.98331,45.752389,0.92,street,Chemin de la Fabrique 42130 Saint-Sixte,42288_0240,G,CHEMIN DE LA FABRIQUE,
349453456,00015,34945345600015,O,1988-12-27,NN,,,2019-11-14T14:00:38,true,4,,,,,LIMES,42130,SAINT-SIXTE,,,42288,,,,,,,,,,,,,,,,,,,2008-07-21,F,,,,,01.41Z,NAFRev2,N,3.967027,45.776433,0.91,street,Chemin de Limes 42130 Saint-Sixte,42288_0340,G,CHEMIN DE LIMES,
351166160,00017,35116616000017,O,1989-04-25,,,,2019-11-14T14:00:38,true,1,,,,,VARENNE,42130,SAINT-SIXTE,,,42288,,,,,,,,,,,,,,,,,,,1991-05-22,F,,,,,64.49,NAP,N,3.943262,45.766742,0.8,street,Chemin de Varennes 42130 Saint-Sixte,42288_0540,G,CHEMIN DE VARENNES,
351543293,00010,35154329300010,O,,,,,2019-11-14T14:00:38,true,1,,,,,LIMES,42130,SAINT-SIXTE,,,42288,,,,,,,,,,,,,,,,,,,1997-11-09,F,,,,,01.2A,NAF1993,N,3.967027,45.776433,0.91,street,Chemin de Limes 42130 Saint-Sixte,42288_0340,G,CHEMIN DE LIMES,
351992730,00017,35199273000017,O,1989-04-01,NN,,,2019-11-14T14:00:38,false,4,,,,LD,LA FABRIQUE,42130,SAINT-SIXTE,,,42288,,,,,,,,,,,,,,,,,,,2002-06-18,F,,,,,33.1B,NAF1993,O,3.98331,45.752389,0.92,street,Chemin de la Fabrique 42130 Saint-Sixte,42288_0240,G,CHEMIN DE LA FABRIQUE,
353344013,00019,35334401300019,O,,NN,,,2019-11-14T14:00:38,true,1,,,,,LE BOURG,42130,SAINT-SIXTE,,,42288,,,,,,,,,,,,,,,,,,,1996-12-31,F,,,,,01.1A,NAF1993,N,3.982479,45.774261,0.62,street,Impasse du Bourg 42130 Saint-Sixte,42288_0080,G,IMPASSE DU BOURG,
380773994,00013,38077399400013,O,1991-01-01,NN,,,2022-02-01T03:48:48,true,4,,,,RTE,DE CEZAY,42130,SAINT-SIXTE,,,42288,,,,,,,,,,,,,,,,,,,2021-12-31,F,,,,,01.21Z,NAFRev2,N,4.003959,45.772802,0.81,street,Route de Cezay 42130 Saint-Sixte,42288_0090,G,ROUTE DE CEZAY,
381521376,00032,38152137600032,O,1995-07-01,00,2019,4391BZ,2021-10-29T03:38:12,true,5,,,,LD,LES BAS ROLLANDS,42130,SAINT-SIXTE,,,42288,,,,,,,,,,,,,,,,,,,2020-03-11,F,,,,,43.91B,NAFRev2,N,3.977593,45.767571,0.62,street,Chemin des Rollands 42130 Saint-Sixte,42288_0470,G,CHEMIN DES ROLLANDS,
387619117,00030,38761911700030,O,2004-12-13,NN,,,2021-12-10T04:01:20,true,6,,,,,LA FABRIQUE,42130,SAINT-SIXTE,,,42288,,,,,,,,,,,,,,,,,,,2021-10-29,F,,,,,56.30Z,NAFRev2,N,3.98331,45.752389,0.92,street,Chemin de la Fabrique 42130 Saint-Sixte,42288_0240,G,CHEMIN DE LA FABRIQUE,
388953705,00026,38895370500026,O,2013-01-01,,,3109BA,2019-11-14T14:00:38,true,2,,,,,LES ROLLANDS DU HAUT,42130,SAINT-SIXTE,,,42288,,,,,,,,,,,,,,,,,,,2017-12-31,F,,,,,47.89Z,NAFRev2,N,3.977593,45.767571,0.51,street,Chemin des Rollands 42130 Saint-Sixte,42288_0470,G,CHEMIN DES ROLLANDS,
390650075,00018,39065007500018,O,1981-01-01,NN,,,2021-02-23T11:16:33,false,4,,,,,LE MONTCEL,42130,SAINT-SIXTE,,,42288,,,,,,,,,,,,,,,,,,,2008-01-01,A,,,,,01.42Z,NAFRev2,N,3.998566,45.772829,0.68,street,Chemin du Montcel 42130 Saint-Sixte,42288_0370,G,CHEMIN DU MONTCEL,
390650075,00026,39065007500026,O,2004-07-01,,,,2019-11-14T14:00:38,false,4,,,,,LE MONTCEL,42130,SAINT-SIXTE,,,42288,,,,,,,,,,,,,,,,,,,2009-07-30,F,,,,,01.61Z,NAFRev2,O,3.998566,45.772829,0.68,street,Chemin du Montcel 42130 Saint-Sixte,42288_0370,G,CHEMIN DU MONTCEL,
390694909,00016,39069490900016,O,1977-01-01,NN,,,2019-11-14T14:00:38,false,4,,,,,LA PRETRERIE,42130,SAINT-SIXTE,,,42288,,,,,,,,,,,,,,,,,,,2013-06-10,F,,,,,68.20B,NAFRev2,N,3.974334,45.780144,0.92,street,Chemin de la Prêtrerie 42130 Saint-Sixte,42288_0450,G,CHEMIN DE LA PRETRERIE,
390903151,00012,39090315100012,O,1982-01-01,NN,,,2019-11-14T14:00:38,true,4,,,,LD,PLATON,42130,SAINT-SIXTE,,,42288,,,,,,,,,,,,,,,,,,,2008-01-01,A,,,,,68.20B,NAFRev2,N,3.987002,45.784902,0.91,street,Chemin de Platon 42130 Saint-Sixte,42288_0400,G,CHEMIN DE PLATON,
391809969,00010,39180996900010,O,1993-06-01,02,2020,0812ZZ,2022-08-29T09:15:59,false,4,,,,LD,LA GOUTTE DE L'HEUR,42130,SAINT-SIXTE,,,42288,,,,,,,,,,,,,,,,,,,2008-01-01,A,,,,,08.12Z,NAFRev2,O,3.987397,45.767411,0.44,street,Chemin de Goutte Noyeuse 42130 Saint-Sixte,42288_0290,G,CHEMIN DE GOUTTE NOYEUSE,
391876174,00015,39187617400015,O,1900-01-01,NN,,,2019-11-14T14:00:38,false,3,,,,,LE MONTCEL,42130,SAINT-SIXTE,,,42288,,,,,,,,,,,,,,,,,,,1993-12-25,F,,,,,85.1G,NAF1993,N,3.998566,45.772829,0.68,street,Chemin du Montcel 42130 Saint-Sixte,42288_0370,G,CHEMIN DU MONTCEL,
392608337,00011,39260833700011,O,1993-10-06,NN,,4332AA,2019-11-14T14:00:38,true,5,,,,,THAY,42130,SAINT-SIXTE,,,42288,,,,,,,,,,,,,,,,,,,2008-01-01,A,,,,,31.09B,NAFRev2,N,3.942505,45.781392,0.91,street,Chemin de Thay 42130 Saint-Sixte,42288_0510,G,CHEMIN DE THAY,
394647564,00027,39464756400027,O,2016-03-21,,,,2021-02-23T11:20:26,true,1,,,,,LES ROLLANDS BAS,42130,SAINT-SIXTE,,,42288,,,,,,,,,,,,,,,,,,,2016-03-21,A,,,,,96.09Z,NAFRev2,N,3.977593,45.767571,0.62,street,Chemin des Rollands 42130 Saint-Sixte,42288_0470,G,CHEMIN DES ROLLANDS,
395135262,00016,39513526200016,O,1993-01-01,NN,,,2019-11-14T14:00:38,true,3,,,,,LES ROLLANDS,42130,SAINT-SIXTE,,,42288,,,,,,,,,,,,,,,,,,,2005-09-30,F,,,,,01.2A,NAFRev1,N,3.977593,45.767571,0.79,street,Chemin des Rollands 42130 Saint-Sixte,42288_0470,G,CHEMIN DES ROLLANDS,
395390222,00010,39539022200010,O,1994-06-01,NN,,,2019-11-14T14:00:38,true,4,,,,LD,LA PRETRERIE,42130,SAINT-SIXTE,,,42288,,,,,,,,,,,,,,,,,,,2015-06-01,F,,,,,01.41Z,NAFRev2,N,3.974334,45.780144,0.92,street,Chemin de la Prêtrerie 42130 Saint-Sixte,42288_0450,G,CHEMIN DE LA PRETRERIE,
399026582,00029,39902658200029,O,2016-12-21,,,,2019-11-14T14:00:38,true,2,,,,,LES ROLLANDS BAS,42130,SAINT-SIXTE,,,42288,,,,,,,,,,,,,,,,,,,2017-05-04,F,,,,,41.10D,NAFRev2,N,3.977593,45.767571,0.62,street,Chemin des Rollands 42130 Saint-Sixte,42288_0470,G,CHEMIN DES ROLLANDS,
400078341,00049,40007834100049,O,2014-08-01,,,1623ZZ,2021-02-23T11:23:56,true,1,,,,,LES ROLLANDS BAS,42130,SAINT-SIXTE,,,42288,,,,,,,,,,,,,,,,,,,2014-08-01,A,,,,,62.02B,NAFRev2,N,3.977593,45.767571,0.62,street,Chemin des Rollands 42130 Saint-Sixte,42288_0470,G,CHEMIN DES ROLLANDS,
400949335,00014,40094933500014,O,,NN,,,2019-11-14T14:00:38,true,1,,,,,BOURG ST SIXTE,42130,SAINT-SIXTE,,,42288,,,,,,,,,,,,,,,,,,,1995-09-30,F,,,,,55.3A,NAF1993,N,3.982479,45.774261,0.81,street,Impasse du Bourg 42130 Saint-Sixte,42288_0080,G,IMPASSE DU BOURG,
400967295,00025,40096729500025,O,2006-07-01,,,,2019-11-14T14:00:38,false,3,,,,,CIERGUES,42130,SAINT-SIXTE,,,42288,,,,,,,,,,,,,,,,,,,2008-07-16,F,,,,,68.20B,NAFRev2,N,3.959467,45.768335,0.92,street,Chemin de Ciergues 42130 Saint-Sixte,42288_0150,G,CHEMIN DE CIERGUES,
401156914,00012,40115691400012,O,1972-01-01,NN,,,2019-11-14T14:00:38,false,3,,,,,LE MONTCEL,42130,SAINT-SIXTE,,,42288,,,,,,,,,,,,,,,,,,,2000-01-01,F,,,,,01.1A,NAF1993,N,3.998566,45.772829,0.68,street,Chemin du Montcel 42130 Saint-Sixte,42288_0370,G,CHEMIN DU MONTCEL,
401479613,00010,40147961300010,O,1995-07-01,01,2020,999ZZ,2022-08-29T09:22:18,true,3,,,,,LE MONTCEL,42130,SAINT-SIXTE,,,42288,,,,,,,,,,,,,,,,,,,2008-01-01,A,,,,,81.30Z,NAFRev2,N,3.998566,45.772829,0.68,street,Chemin du Montcel 42130 Saint-Sixte,42288_0370,G,CHEMIN DU MONTCEL,
402616742,00019,40261674200019,O,1995-10-01,NN,,,2019-11-14T14:00:38,true,1,,,,,BOURG ST SIXTE,42130,SAINT-SIXTE,,,42288,,,,,,,,,,,,,,,,,,,1998-09-30,F,,,,,55.3A,NAF1993,N,3.982479,45.774261,0.81,street,Impasse du Bourg 42130 Saint-Sixte,42288_0080,G,IMPASSE DU BOURG,
403003502,00016,40300350200016,O,1995-10-01,NN,,,2019-11-14T14:00:38,true,6,,,,LD,PORTES,42130,SAINT-SIXTE,,,42288,,,,,,,,,,,,,,,,,,,2011-04-30,F,,,,,03.22Z,NAFRev2,N,3.955845,45.760137,0.64,street,Chemin de Porte 42130 Saint-Sixte,42288_0430,G,CHEMIN DE PORTE,
408196970,00011,40819697000011,O,1996-07-11,NN,,,2019-11-14T14:00:38,false,4,,,,,LA FABRIQUE,42130,SAINT-SIXTE,,,42288,,,,,,,,,,,,,,,,,,,2001-10-24,F,,,,,92.3J,NAF1993,N,3.98331,45.752389,0.92,street,Chemin de la Fabrique 42130 Saint-Sixte,42288_0240,G,CHEMIN DE LA FABRIQUE,
409283389,00016,40928338900016,O,1980-01-01,NN,,,2019-11-14T14:00:38,true,4,,,,,VARENNES,42130,SAINT-SIXTE,,,42288,,,,,,,,,,,,,,,,,,,2008-11-01,F,,,,,01.13Z,NAFRev2,N,3.943262,45.766742,0.92,street,Chemin de Varennes 42130 Saint-Sixte,42288_0540,G,CHEMIN DE VARENNES,
409283397,00019,40928339700019,O,1980-01-01,NN,,,2019-11-14T14:00:38,true,4,,,,,C1ERGUE,42130,SAINT-SIXTE,,,42288,,,,,,,,,,,,,,,,,,,2008-01-01,F,,,,,01.42Z,NAFRev2,N,,,0,,,,,,
409283405,00010,40928340500010,O,1993-10-11,NN,,,2019-11-14T14:00:38,true,4,,,,,THAY,42130,SAINT-SIXTE,,,42288,,,,,,,,,,,,,,,,,,,2008-12-31,F,,,,,01.43Z,NAFRev2,N,3.942505,45.781392,0.91,street,Chemin de Thay 42130 Saint-Sixte,42288_0510,G,CHEMIN DE THAY,
410344196,00010,41034419600010,O,1997-01-06,NN,,,2019-11-14T14:00:38,false,4,,,,LD,LA PREBENDE,42130,SAINT-SIXTE,,,42288,,,,,,,,,,,,,,,,,,,2004-12-01,F,,,,,52.2P,NAFRev1,O,3.98042,45.7726,0.92,street,Chemin de la Prébende 42130 Saint-Sixte,42288_0440,G,CHEMIN DE LA PREBENDE,
410635924,00013,41063592400013,O,1997-01-01,NN,,,2019-11-14T14:00:38,true,3,,,,,LIMES,42130,SAINT-SIXTE,,,42288,,,,,,,,,,,,,,,,,,,2008-01-01,A,,,,,01.42Z,NAFRev2,N,3.967027,45.776433,0.91,street,Chemin de Limes 42130 Saint-Sixte,42288_0340,G,CHEMIN DE LIMES,
411163025,00017,41116302500017,O,1980-01-01,NN,,,2019-11-14T14:00:38,true,4,,,,,C1ERGUES,42130,SAINT-SIXTE,,,42288,,,,,,,,,,,,,,,,,,,2008-10-31,F,,,,,01.41Z,NAFRev2,N,,,0,,,,,,
411163033,00011,41116303300011,O,1994-01-01,NN,,,2019-11-14T14:00:38,true,4,,,,,JAY,42130,SAINT-SIXTE,,,42288,,,,,,,,,,,,,,,,,,,2009-02-28,F,,,,,01.42Z,NAFRev2,N,3.99229,45.778213,0.91,street,Chemin de Jay 42130 Saint-Sixte,42288_0310,G,CHEMIN DE JAY,
411163041,00014,41116304100014,O,1991-01-01,NN,,,2019-11-14T14:00:38,true,4,,,,,CIERGUES,42130,SAINT-SIXTE,,,42288,,,,,,,,,,,,,,,,,,,2012-12-31,F,,,,,01.45Z,NAFRev2,N,3.959467,45.768335,0.92,street,Chemin de Ciergues 42130 Saint-Sixte,42288_0150,G,CHEMIN DE CIERGUES,
411477508,00013,41147750800013,O,,,,,2019-11-14T14:00:38,true,1,,,,,LE BOURG,42130,SAINT-SIXTE,,,42288,,,,,,,,,,,,,,,,,,,1997-12-31,F,,,,,01.2A,NAF1993,N,3.982479,45.774261,0.62,street,Impasse du Bourg 42130 Saint-Sixte,42288_0080,G,IMPASSE DU BOURG,
411542319,00016,41154231900016,O,1990-01-01,NN,,,2019-11-14T14:00:38,true,4,,,,,GOUTTE NOYEUSE,42130,SAINT-SIXTE,,,42288,,,,,,,,,,,,,,,,,,,2008-01-01,F,,,,,01.11Z,NAFRev2,N,3.987397,45.767411,0.92,street,Chemin de Goutte Noyeuse 42130 Saint-Sixte,42288_0290,G,CHEMIN DE GOUTTE NOYEUSE,
412735805,00019,41273580500019,O,1996-09-06,NN,,,2019-11-14T14:00:38,false,8,,,,,LE JAY,42130,SAINT-SIXTE,,,42288,,,,,,,,,,,,,,,,,,,2018-03-01,F,,,,,90.01Z,NAFRev2,O,3.99229,45.778213,0.65,street,Chemin de Jay 42130 Saint-Sixte,42288_0310,G,CHEMIN DE JAY,
414542258,00010,41454225800010,O,1997-11-10,,,,2019-11-14T14:00:38,false,4,CHEZ MR BEAUVOIR PHILIPPE,,,,LIMES,42130,SAINT-SIXTE,,,42288,,,,,,,,,,,,,,,,,,,2001-09-30,F,,,,,01.3Z,NAF1993,N,3.967027,45.776433,0.91,street,Chemin de Limes 42130 Saint-Sixte,42288_0340,G,CHEMIN DE LIMES,
414542258,00028,41454225800028,O,2001-09-30,00,2020,,2022-08-29T09:30:54,true,3,CHEZ MR CLAIR STEPHANE,,,LD,LIMES,42130,SAINT-SIXTE,,,42288,,,,,,,,,,,,,,,,,,,2008-01-01,A,,,,,01.42Z,NAFRev2,N,3.967027,45.776433,0.91,street,Chemin de Limes 42130 Saint-Sixte,42288_0340,G,CHEMIN DE LIMES,
414859744,00016,41485974400016,O,1997-11-27,NN,,,2019-11-14T14:00:38,true,4,,,,,LE SAUZET,42130,SAINT-SIXTE,,,42288,,,,,,,,,,,,,,,,,,,2018-12-04,F,,,,,68.20B,NAFRev2,N,3.981249,45.774994,0.38,street,Chemin de l’École 42130 Saint-Sixte,42288_0200,G,CHEMIN DE L ECOLE,
418068300,00015,41806830000015,O,1998-01-01,NN,,,2019-11-14T14:00:38,true,3,,,,,LE BOURG,42130,SAINT-SIXTE,,,42288,,,,,,,,,,,,,,,,,,,2004-10-31,F,,,,,01.1A,NAFRev1,N,3.982479,45.774261,0.62,street,Impasse du Bourg 42130 Saint-Sixte,42288_0080,G,IMPASSE DU BOURG,
418127395,00014,41812739500014,O,1998-01-01,NN,,,2019-11-14T14:00:38,true,4,,,,,LES ROLLANDS,42130,SAINT-SIXTE,,,42288,,,,,,,,,,,,,,,,,,,2009-01-01,F,,,,,01.43Z,NAFRev2,N,3.977593,45.767571,0.79,street,Chemin des Rollands 42130 Saint-Sixte,42288_0470,G,CHEMIN DES ROLLANDS,
420292419,00017,42029241900017,O,1998-10-01,,,,2019-11-14T14:00:38,true,1,,,,,BOURG,42130,SAINT-SIXTE,,,42288,,,,,,,,,,,,,,,,,,,1999-03-31,F,,,,,55.3A,NAF1993,N,3.982479,45.774261,0.91,street,Impasse du Bourg 42130 Saint-Sixte,42288_0080,G,IMPASSE DU BOURG,