siren,nic,siret,statutDiffusionEtablissement,dateCreationEtablissement,trancheEffectifsEtablissement,anneeEffectifsEtablissement,activitePrincipaleRegistreMetiersEtablissement,dateDernierTraitementEtablissement,etablissementSiege,nombrePeriodesEtablissement,complementAdresseEtablissement,numeroVoieEtablissement,indiceRepetitionEtablissement,typeVoieEtablissement,libelleVoieEtablissement,codePostalEtablissement,libelleCommuneEtablissement,libelleCommuneEtrangerEtablissement,distributionSpecialeEtablissement,codeCommuneEtablissement,codeCedexEtablissement,libelleCedexEtablissement,codePaysEtrangerEtablissement,libellePaysEtrangerEtablissement,complementAdresse2Etablissement,numeroVoie2Etablissement,indiceRepetition2Etablissement,typeVoie2Etablissement,libelleVoie2Etablissement,codePostal2Etablissement,libelleCommune2Etablissement,libelleCommuneEtranger2Etablissement,distributionSpeciale2Etablissement,codeCommune2Etablissement,codeCedex2Etablissement,libelleCedex2Etablissement,codePaysEtranger2Etablissement,libellePaysEtranger2Etablissement,dateDebut,etatAdministratifEtablissement,enseigne1Etablissement,enseigne2Etablissement,enseigne3Etablissement,denominationUsuelleEtablissement,activitePrincipaleEtablissement,nomenclatureActivitePrincipaleEtablissement,caractereEmployeurEtablissement,longitude,latitude,geo_score,geo_type,geo_adresse,geo_id,geo_ligne,geo_l4,geo_l5
214800419,00019,21480041900019,O,1983-03-01,01,2020,,2022-08-29T09:07:26,true,3,HOTEL DE VILLE,,,,,48300,CHASTANIER,,,48041,,,,,,,,,,,,,,,,,,,2008-01-01,A,MAIRIE,,,,84.11Z,NAFRev2,N,,,0,,,,,,
214800419,00027,21480041900027,O,1983-12-21,NN,,,,false,4,,,,,LES MOULINS,48300,CHASTANIER,,,48041,,,,,,,,,,,,,,,,,,,1999-03-23,F,ECOLE PRIMAIRE PUBLIQUE,,,,80.1Z,NAF1993,N,6.0696786,45.0810872,0.9,poi.ruins,Les Moulins (Ruines) Huez,https://osm.org/node/3672385307,G,,
214800419,00035,21480041900035,O,1997-01-01,NN,,,2012-09-17T15:49:25,false,4,HOTEL DE VILLE,,,,,48300,CHASTANIER,,,48041,,,,,,,,,,,,,,,,,,,2012-01-01,F,SERVICE DES EAUX,,,,36.00Z,NAFRev2,N,,,0,,,,,,
214800419,00043,21480041900043,O,1995-12-25,NN,,,,false,3,,,,,,48300,CHASTANIER,,,48041,,,,,,,,,,,,,,,,,,,2003-12-31,F,ORDURES MENAGERES,,,,90.0B,NAFRev1,N,,,0,,,,,,
264801366,00016,26480136600016,O,1986-01-06,NN,,,2010-06-26T03:10:36,true,3,,,,,HOTEL DE VILLE,48300,CHASTANIER,,,48041,,,,,,,,,,,,,,,,,,,2008-01-01,A,CCAS DE CHASTANIER,,,,88.99B,NAFRev2,N,3.0709671,50.6304695,0.92,poi.townhall,Hôtel de Ville Lille,https://osm.org/way/40917078,G,,
274801190,00019,27480119000019,O,,,,,,true,1,,,,,MAIRIE,48300,CHASTANIER,,,48041,,,,,,,,,,,,,,,,,,,1995-12-25,F,,,,,90.0B,NAF1993,N,3.0709671,50.6304695,0.92,poi.townhall,Hôtel de Ville Lille,https://osm.org/way/40917078,G,,
310220728,00011,31022072800011,O,,,,,,true,1,,,,,LES MOULINS,48300,CHASTANIER,,,48041,,,,,,,,,,,,,,,,,,,1985-12-25,F,,,,,02.20,NAP,N,6.0696786,45.0810872,0.9,poi.ruins,Les Moulins (Ruines) Huez,https://osm.org/node/3672385307,G,,
312215726,00018,31221572600018,O,,NN,,,,true,1,,,,,,48300,CHASTANIER,,,48041,,,,,,,,,,,,,,,,,,,1989-11-13,F,,,,,57.03,NAP,N,,,0,,,,,,
315321653,00018,31532165300018,O,,NN,,,,true,1,,,,,QUARTIER DES BRAUX,48300,CHASTANIER,,,48041,,,,,,,,,,,,,,,,,,,1989-03-05,F,,,,,81.21,NAP,N,0.3120715,48.2535565,0.75,poi.community_centre,Maison des associations Saint-joseph (Salle des fêtes) Marolles-les-Braults,https://osm.org/way/242616094,G,,
316262203,00011,31626220300011,O,1994-12-05,NN,,,2008-01-04T20:44:54,true,3,,,,,LES MOULINS,48300,CHASTANIER,,,48041,,,,,,,,,,,,,,,,,,,2007-08-05,F,,,,,01.1A,NAFRev1,N,6.0696786,45.0810872,0.9,poi.ruins,Les Moulins (Ruines) Huez,https://osm.org/node/3672385307,G,,
316262203,00029,31626220300029,O,1999-01-01,NN,,,2008-01-04T20:44:54,false,3,,,,,LES MOULINS,48300,CHASTANIER,,,48041,,,,,,,,,,,,,,,,,,,2007-08-05,F,,,,,02.0D,NAFRev1,N,6.0696786,45.0810872,0.9,poi.ruins,Les Moulins (Ruines) Huez,https://osm.org/node/3672385307,G,,
318708526,00054,31870852600054,O,2016-07-01,,,,2017-03-02T14:16:46,true,1,,,,,LES CHAUMEILS,48300,CHASTANIER,,,48041,,,,,,,,,,,,,,,,,,,2016-07-01,A,,,,,55.20Z,NAFRev2,N,3.773218,44.729349,0.33,locality,Besses Basses 48300 Chastanier,48041_B018,G,BESSES BASSES,
323595488,00012,32359548800012,O,1982-01-01,NN,,,2009-10-04T05:45:16,true,4,,,,LD,LES BARAQUES,48300,CHASTANIER,,,48041,,,,,,,,,,,,,,,,,,,2009-01-01,A,,,,,01.11Z,NAFRev2,N,3.773218,44.729349,0.31,locality,Besses Basses 48300 Chastanier,48041_B018,G,BESSES BASSES,
324142819,00014,32414281900014,O,1981-04-02,NN,,,2008-04-05T00:24:27,true,3,,,,,HOTEL DE VILLE,48300,CHASTANIER,,,48041,,,,,,,,,,,,,,,,,,,2008-01-01,A,,,,,68.20A,NAFRev2,N,3.0709671,50.6304695,0.92,poi.townhall,Hôtel de Ville Lille,https://osm.org/way/40917078,G,,
327486320,00010,32748632000010,O,1983-07-01,NN,,,2008-01-04T19:28:22,true,3,,,,,LES MOULINS,48300,CHASTANIER,,,48041,,,,,,,,,,,,,,,,,,,2007-09-30,F,,,,,70.2C,NAFRev1,N,6.0696786,45.0810872,0.9,poi.ruins,Les Moulins (Ruines) Huez,https://osm.org/node/3672385307,G,,
328313085,00016,32831308500016,O,1983-10-01,NN,,,2008-01-04T19:37:19,true,3,,,,,FONFREYDE,48300,CHASTANIER,,,48041,,,,,,,,,,,,,,,,,,,2008-01-01,A,,,,,46.23Z,NAFRev2,N,,,0,,,,,,
330545393,00010,33054539300010,O,1984-09-01,NN,,,,true,1,,,,,LES CHAUMEILS,48300,CHASTANIER,,,48041,,,,,,,,,,,,,,,,,,,1998-12-31,F,,,,,01.1A,NAF1993,N,3.773218,44.729349,0.33,locality,Besses Basses 48300 Chastanier,48041_B018,G,BESSES BASSES,
332764497,00027,33276449700027,O,2004-01-01,NN,,,2009-01-08T03:55:19,true,4,LES MOULINS,,,,,48300,CHASTANIER,,,48041,,,,,,,,,,,,,,,,,,,2008-08-31,F,,,,,82.99Z,NAFRev2,N,,,0,,,,,,
335023453,00012,33502345300012,O,1986-01-30,NN,,,2016-01-12T00:12:16,true,4,,,,,LES CHAUMEILS,48300,CHASTANIER,,,48041,,,,,,,,,,,,,,,,,,,2015-12-31,F,,,,,01.50Z,NAFRev2,N,3.773218,44.729349,0.33,locality,Besses Basses 48300 Chastanier,48041_B018,G,BESSES BASSES,
339913899,00011,33991389900011,O,,NN,,,,true,1,,,,,BESSETTE,48300,CHASTANIER,,,48041,,,,,,,,,,,,,,,,,,,1988-05-31,F,,,,,01.50,NAP,N,3.773218,44.729349,0.5,locality,Besses Basses 48300 Chastanier,48041_B018,G,BESSES BASSES,
340935667,00022,34093566700022,O,1991-01-28,NN,,,,true,4,,,,,LES MOULINS,48300,CHASTANIER,,,48041,,,,,,,,,,,,,,,,,,,2001-12-06,F,,,,,02.0B,NAF1993,N,6.0696786,45.0810872,0.9,poi.ruins,Les Moulins (Ruines) Huez,https://osm.org/node/3672385307,G,,
342667458,00034,34266745800034,O,2005-11-01,,,,2008-01-04T22:06:33,true,2,,,,,,48300,CHASTANIER,,,48041,,,,,,,,,,,,,,,,,,,2008-01-01,A,,,,,02.10Z,NAFRev2,N,,,0,,,,,,
345105415,00011,34510541500011,O,,,,,,true,1,,,,,BESSETTE,48300,CHASTANIER,,,48041,,,,,,,,,,,,,,,,,,,1997-12-31,F,,,,,01.2A,NAF1993,N,3.773218,44.729349,0.5,locality,Besses Basses 48300 Chastanier,48041_B018,G,BESSES BASSES,
345182976,00018,34518297600018,O,,NN,,,,true,1,,,,,LES BROUX,48300,CHASTANIER,,,48041,,,,,,,,,,,,,,,,,,,1988-05-15,F,,,,,01.50,NAP,N,1.9243207,48.6335587,0.88,poi.stream,Le Fosse Broux (Ruisseau) La Celle-les-Bordes,https://osm.org/relation/6736151,G,,
347628455,00011,34762845500011,O,1988-06-01,NN,,8121ZZ,2018-12-07T03:52:54,true,6,,,,,FONFREYDE,48300,CHASTANIER,,,48041,,,,,,,,,,,,,,,,,,,2018-12-31,F,,,,,82.99Z,NAFRev2,N,,,0,,,,,,
349050286,00013,34905028600013,O,1989-01-01,NN,,,2014-02-13T09:05:12,true,4,,,,,LES MOULINS DE CHASTANIER,48300,CHASTANIER,,,48041,,,,,,,,,,,,,,,,,,,2014-01-31,F,,,,,01.41Z,NAFRev2,N,3.748209,44.725429,0.53,locality,Le Pont de Braye 48300 Chastanier,48041_B600,G,LE PONT DE BRAYE,
349135509,00017,34913550900017,O,,NN,,,,true,1,,,,,FONTFREYDE,48300,CHASTANIER,,,48041,,,,,,,,,,,,,,,,,,,1993-03-31,F,,,,,51.2E,NAF1993,N,2.5340545,45.3941105,0.89,poi.information,Fontfreyde (Informations) Champs-sur-Tarentaine-Marchal,https://osm.org/node/4936822362,G,,
349755991,00016,34975599100016,O,1989-01-01,NN,,,2009-07-21T20:03:19,true,5,,,,,LES MOULINS,48300,CHASTANIER,,,48041,,,,,,,,,,,,,,,,,,,2008-12-31,F,,,,,45.20A,NAFRev2,O,6.0696786,45.0810872,0.9,poi.ruins,Les Moulins (Ruines) Huez,https://osm.org/node/3672385307,G,,
379037476,00015,37903747600015,O,1990-04-30,NN,,,,true,4,,,,,AUBERGE DU PONT DE BRAYE,48300,CHASTANIER,,,48041,,,,,,,,,,,,,,,,,,,2001-12-28,F,,,,,70.2C,NAF1993,N,3.748209,44.725429,0.56,locality,Le Pont de Braye 48300 Chastanier,48041_B600,G,LE PONT DE BRAYE,
382174936,00015,38217493600015,O,1991-05-15,,,,2009-01-30T16:02:36,true,1,,,,,PONT DE CHASTANIER,48300,CHASTANIER,,,48041,,,,,,,,,,,,,,,,,,,1999-05-15,F,,,,,55.2E,NAF1993,N,3.748209,44.725429,0.91,locality,Le Pont de Braye 48300 Chastanier,48041_B600,G,LE PONT DE BRAYE,
382786911,00018,38278691100018,O,,NN,,,,true,1,,,,,BESSETTES,48300,CHASTANIER,,,48041,,,,,,,,,,,,,,,,,,,1995-09-15,F,,,,,55.2C,NAF1993,N,3.773218,44.729349,0.55,locality,Besses Basses 48300 Chastanier,48041_B018,G,BESSES BASSES,
384094801,00030,38409480100030,O,2019-07-01,,,,2022-05-11T08:55:33,true,4,,,,,BESSETTES,48300,CHASTANIER,,,48041,,,,,,,,,,,,,,,,,,,2021-08-31,F,L'EPHEMERE,,,,56.10A,NAFRev2,O,3.773218,44.729349,0.55,locality,Besses Basses 48300 Chastanier,48041_B018,G,BESSES BASSES,
389518788,00036,38951878800036,O,2017-07-01,,,,2017-10-31T16:15:27,false,2,,,,,BESSETTE,48300,CHASTANIER,,,48041,,,,,,,,,,,,,,,,,,,2017-08-31,F,RESTAURANT L'EPHEMERE,,,CAMPING LES SOUS-BOIS DU LAC,56.30Z,NAFRev2,O,3.773218,44.729349,0.5,locality,Besses Basses 48300 Chastanier,48041_B018,G,BESSES BASSES,
397839994,00019,39783999400019,O,1994-07-01,NN,,,2016-02-26T04:01:10,true,3,,,,,LES MOULINS,48300,CHASTANIER,,,48041,,,,,,,,,,,,,,,,,,,2008-01-01,A,,,,,01.41Z,NAFRev2,N,6.0696786,45.0810872,0.9,poi.ruins,Les Moulins (Ruines) Huez,https://osm.org/node/3672385307,G,,
402320410,00010,40232041000010,O,1995-02-02,NN,,,2021-07-05T08:41:50,true,7,,,,,PONT DE BRAYE,48300,CHASTANIER,,,48041,,,,,,,,,,,,,,,,,,,2021-07-01,A,,,,,56.10A,NAFRev2,O,3.748209,44.725429,0.92,locality,Le Pont de Braye 48300 Chastanier,48041_B600,G,LE PONT DE BRAYE,
409027851,00016,40902785100016,O,1996-07-01,01,2020,5610CQ,2022-08-29T09:26:25,true,7,,,,,BESSETTES,48300,CHASTANIER,,,48041,,,,,,,,,,,,,,,,,,,2017-09-01,A,,,,CAMPING LES SOUS BOIS DU LAC,55.30Z,NAFRev2,O,3.773218,44.729349,0.55,locality,Besses Basses 48300 Chastanier,48041_B018,G,BESSES BASSES,
411196892,00011,41119689200011,O,1997-02-01,NN,,,2008-01-04T21:55:04,true,3,,,,,BESSES BASSES,48300,CHASTANIER,,,48041,,,,,,,,,,,,,,,,,,,2008-01-01,A,,,,,01.41Z,NAFRev2,N,3.773218,44.729349,0.93,locality,Besses Basses 48300 Chastanier,48041_B018,G,BESSES BASSES,
415255827,00016,41525582700016,O,1998-01-01,NN,,,2008-01-04T23:01:33,true,3,,,,,BESSETTE,48300,CHASTANIER,,,48041,,,,,,,,,,,,,,,,,,,2008-01-01,A,,,,,01.42Z,NAFRev2,N,3.773218,44.729349,0.5,locality,Besses Basses 48300 Chastanier,48041_B018,G,BESSES BASSES,
420883084,00014,42088308400014,O,1990-12-31,,,,,true,1,,,,,LE BOURG,48300,CHASTANIER,,,48041,,,,,,,,,,,,,,,,,,,1999-09-30,F,,,,,01.1A,NAF1993,N,3.748209,44.725429,0.39,locality,Le Pont de Braye 48300 Chastanier,48041_B600,G,LE PONT DE BRAYE,
420883092,00017,42088309200017,O,1988-12-31,NN,,,2008-01-04T23:58:47,true,3,,,,,LES BRAUX,48300,CHASTANIER,,,48041,,,,,,,,,,,,,,,,,,,2008-01-01,A,,,,,01.41Z,NAFRev2,N,3.748209,44.725429,0.36,locality,Le Pont de Braye 48300 Chastanier,48041_B600,G,LE PONT DE BRAYE,
421666876,00014,42166687600014,O,1999-01-02,NN,,4399CZ,2019-01-29T03:39:44,true,3,,,,,LES BARAQUES,48300,CHASTANIER,,,48041,,,,,,,,,,,,,,,,,,,2008-01-01,A,,,,,43.99C,NAFRev2,N,3.773218,44.729349,0.31,locality,Besses Basses 48300 Chastanier,48041_B018,G,BESSES BASSES,
423669217,00014,42366921700014,O,1999-07-12,NN,,,2006-11-25T16:30:33,true,3,,,,,VILLEVIEILLETTE,48300,CHASTANIER,,,48041,,,,,,,,,,,,,,,,,,,2004-06-29,F,,,,,92.3B,NAFRev1,N,,,0,,,,,,
423874528,00015,42387452800015,O,1997-08-02,NN,,,2017-05-04T01:55:09,true,4,,,,,MAIRIE,48300,CHASTANIER,,,48041,,,,,,,,,,,,,,,,,,,2008-01-01,A,,,,,91.03Z,NAFRev2,O,3.0709671,50.6304695,0.92,poi.townhall,Hôtel de Ville Lille,https://osm.org/way/40917078,G,,
424277747,00012,42427774700012,O,1999-09-01,NN,,,2013-08-13T11:22:49,false,4,,,,,,48300,CHASTANIER,,,48041,,,,,,,,,,,,,,,,,,,2012-11-30,F,,,,,01.41Z,NAFRev2,N,,,0,,,,,,
424817955,00018,42481795500018,O,1999-10-01,NN,,,2012-11-26T02:36:12,true,4,,,,,BESSES BASSES,48300,CHASTANIER,,,48041,,,,,,,,,,,,,,,,,,,2010-01-01,A,,,,,01.11Z,NAFRev2,N,3.773218,44.729349,0.93,locality,Besses Basses 48300 Chastanier,48041_B018,G,BESSES BASSES,
430136895,00017,43013689500017,O,2000-03-01,NN,,,2017-04-09T03:49:58,true,3,,,,LD,FONFREYDE,48300,CHASTANIER,,,48041,,,,,,,,,,,,,,,,,,,2008-01-01,A,,,,,01.41Z,NAFRev2,N,,,0,,,,,,
438425571,00017,43842557100017,O,2001-07-01,NN,,,2008-01-04T20:11:18,true,3,,,,,MAIRIE,48300,CHASTANIER,,,48041,,,,,,,,,,,,,,,,,,,2008-01-01,A,,,,,94.99Z,NAFRev2,N,3.0709671,50.6304695,0.92,poi.townhall,Hôtel de Ville Lille,https://osm.org/way/40917078,G,,
449383579,00017,44938357900017,O,2003-07-01,NN,,,2010-11-16T00:19:58,false,2,LES MOULINS,,,,,48300,CHASTANIER,,,48041,,,,,,,,,,,,,,,,,,,2003-09-30,F,,,,,,,,,,0,,,,,,
484851043,00048,48485104300048,O,2015-07-15,NN,,,2017-05-04T05:24:43,false,3,,,,,BESSETTES,48300,CHASTANIER,,,48041,,,,,,,,,,,,,,,,,,,2015-08-31,F,,,,,56.10A,NAFRev2,O,3.773218,44.729349,0.55,locality,Besses Basses 48300 Chastanier,48041_B018,G,BESSES BASSES,
485273106,00040,48527310600040,O,2016-07-01,,,,2016-10-06T10:16:59,false,2,,,,,BESSETTES,48300,CHASTANIER,,,48041,,,,,,,,,,,,,,,,,,,2016-08-31,F,,,,,56.30Z,NAFRev2,O,3.773218,44.729349,0.55,locality,Besses Basses 48300 Chastanier,48041_B018,G,BESSES BASSES,
494683006,00030,49468300600030,O,2009-01-06,,,,2021-12-03T03:38:03,false,2,,,,,LD BRAYE,48300,CHASTANIER,,,48041,,,,,,,,,,,,,,,,,,,2021-10-22,F,,,,,62.01Z,NAFRev2,N,3.748209,44.725429,0.9,locality,Le Pont de Braye 48300 Chastanier,48041_B600,G,LE PONT DE BRAYE,
494835820,00015,49483582000015,O,2007-03-01,,,,2012-05-29T16:01:03,true,2,,,,,BESSETTES,48300,CHASTANIER,,,48041,,,,,,,,,,,,,,,,,,,2008-01-01,A,,,,,01.41Z,NAFRev2,N,3.773218,44.729349,0.55,locality,Besses Basses 48300 Chastanier,48041_B018,G,BESSES BASSES,
498084193,00016,49808419300016,O,2007-06-15,NN,,,2009-06-27T14:05:18,true,4,,,,,VILLEVIEILLETTE,48300,CHASTANIER,,,48041,,,,,,,,,,,,,,,,,,,2008-01-01,A,,,,,47.91B,NAFRev2,N,,,0,,,,,,
498816818,00013,49881681800013,O,2007-07-01,,,,2008-01-05T01:04:20,true,2,,,,,LE HAUT VILLAGE,48300,CHASTANIER,,,48041,,,,,,,,,,,,,,,,,,,2008-01-01,A,,,,,58.29A,NAFRev2,N,3.751493,44.725501,0.47,locality,Chastanier Village 48300 Chastanier,48041_B570,G,CHASTANIER VILLAGE,
507994416,00018,50799441600018,O,2008-05-01,,,,2014-02-13T03:42:36,true,2,,,,,LA COMBE DES MOULINS,48300,CHASTANIER,,,48041,,,,,,,,,,,,,,,,,,,2014-01-31,F,,,,,01.42Z,NAFRev2,N,6.3173213,45.2775883,0.9,poi.stream,Ruisseau de la Combe des Moulins Jarrier,https://osm.org/way/313807440,G,,
510193816,00012,51019381600012,O,2009-01-05,,,5610CQ,2021-12-07T04:14:59,true,2,,,,,PONT DE BRAYE,48300,CHASTANIER,,,48041,,,,,,,,,,,,,,,,,,,2021-10-21,F,CAMPING LE PONT DE BRAYE,,,,55.30Z,NAFRev2,N,3.748209,44.725429,0.92,locality,Le Pont de Braye 48300 Chastanier,48041_B600,G,LE PONT DE BRAYE,
513073080,05252,51307308005252,O,2011-02-23,,,,2012-06-29T14:07:18,false,2,,,,,FONFREYDE,48300,CHASTANIER,,,48041,,,,,,,,,,,,,,,,,,,2012-06-18,F,,,,,35.11Z,NAFRev2,N,,,0,,,,,,
513775890,00033,51377589000033,O,2017-10-01,,,,2021-02-23T15:24:35,true,1,,,,,LES MOULINS,48300,CHASTANIER,,,48041,,,,,,,,,,,,,,,,,,,2017-10-01,A,,,,,71.12B,NAFRev2,N,6.0696786,45.0810872,0.9,poi.ruins,Les Moulins (Ruines) Huez,https://osm.org/node/3672385307,G,,
669403347,00026,66940334700026,O,2020-07-01,00,2020,,2022-12-13T11:21:44,false,4,,,,,BESSETTES,48300,CHASTANIER,,,48041,,,,,,,,,,,,,,,,,,,2022-09-15,F,L'EPHEMERE,,,PLUCHERY,56.10A,NAFRev2,O,3.773218,44.729349,0.55,locality,Besses Basses 48300 Chastanier,48041_B018,G,BESSES BASSES,
776102428,00013,77610242800013,O,,NN,,,,true,1,,,,LD,BESSETTES,48300,CHASTANIER,,,48041,,,,,,,,,,,,,,,,,,,2001-01-29,F,,,,,01.4A,NAF1993,N,3.773218,44.729349,0.55,locality,Besses Basses 48300 Chastanier,48041_B018,G,BESSES BASSES,
776102436,00016,77610243600016,O,,,,,,true,1,,,,,LES BRAUX,48300,CHASTANIER,,,48041,,,,,,,,,,,,,,,,,,,1984-12-25,F,,,,,,,N,3.748209,44.725429,0.36,locality,Le Pont de Braye 48300 Chastanier,48041_B600,G,LE PONT DE BRAYE,
776102444,00010,77610244400010,O,,,,,,true,1,,,,,LES BRAUX,48300,CHASTANIER,,,48041,,,,,,,,,,,,,,,,,,,1997-12-31,F,,,,,45.2V,NAF1993,N,3.748209,44.725429,0.36,locality,Le Pont de Braye 48300 Chastanier,48041_B600,G,LE PONT DE BRAYE,
790802797,00015,79080279700015,O,2012-12-29,,,,2019-03-20T08:42:12,true,1,LES MOULINS,,,,,48300,CHASTANIER,,,48041,,,,,,,,,,,,,,,,,,,2012-12-29,A,,,,,68.20B,NAFRev2,N,,,0,,,,,,
795840172,00014,79584017200014,O,2005-06-01,NN,,,2010-11-16T00:22:21,false,11,,,,,PONT DE CHASTANIER,48300,CHASTANIER,,,48041,,,,,,,,,,,,,,,,,,,2007-08-31,F,CAMPING DU PONT DE BRAYE,,,,55.2C,NAFRev1,O,3.748209,44.725429,0.91,locality,Le Pont de Braye 48300 Chastanier,48041_B600,G,LE PONT DE BRAYE,
795840172,00022,79584017200022,O,2006-06-01,,,,2008-09-02T05:19:27,true,3,,,,,CAMPING PONT DE BRAYE,48300,CHASTANIER,,,48041,,,,,,,,,,,,,,,,,,,2008-08-31,F,CAMPING DU PONT DE BRAYE,,,,55.30Z,NAFRev2,N,3.748209,44.725429,0.62,locality,Le Pont de Braye 48300 Chastanier,48041_B600,G,LE PONT DE BRAYE,
797140308,00017,79714030800017,O,,NN,,,,true,1,,,,LD,FONFREYDE,48300,CHASTANIER,,,48041,,,,,,,,,,,,,,,,,,,1988-12-31,F,,,,,57.02,NAP,N,,,0,,,,,,
800329039,00013,80032903900013,O,2014-02-01,,,,2022-03-05T12:22:23,true,1,,,,,LA COMBE DES MOULINS,48300,CHASTANIER,,,48041,,,,,,,,,,,,,,,,,,,2014-02-01,A,,,,,01.41Z,NAFRev2,N,6.3173213,45.2775883,0.9,poi.stream,Ruisseau de la Combe des Moulins Jarrier,https://osm.org/way/313807440,G,,
813753324,00017,81375332400017,O,2015-10-01,NN,,,2019-06-24T14:01:54,true,2,,,,HAM,VILLEVIEILLETTE,48300,CHASTANIER,,,48041,,,,,,,,,,,,,,,,,,,2017-10-11,A,,,,,90.02Z,NAFRev2,N,,,0,,,,,,
821421633,00016,82142163300016,O,2016-07-10,,,,2022-04-05T04:16:13,false,2,,,,,FONFREDE,48300,CHASTANIER,,,48041,,,,,,,,,,,,,,,,,,,2017-08-31,F,DOMIANE DES YOURTES,,,DOMAINE DES YOURTES,55.20Z,NAFRev2,N,-0.5726547,44.8250686,0.88,poi.bus_stop,Fonfrède (Arrêt de bus) Bordeaux,https://osm.org/node/1984337129,G,,
823002712,00011,82300271200011,O,2016-10-12,,,,2016-10-11T08:26:38,true,1,,,,LD,VILLEVIEILLETTE,48300,CHASTANIER,,,48041,,,,,,,,,,,,,,,,,,,2016-10-12,A,,,,,68.20A,NAFRev2,N,,,0,,,,,,
824463038,00037,82446303800037,O,2018-06-15,,,,2019-05-16T19:34:51,false,2,LES BESSETTES,,,,BESSETTES,48300,CHASTANIER,,,48041,,,,,,,,,,,,,,,,,,,2018-09-07,F,,,,,56.10A,NAFRev2,O,3.773218,44.729349,0.55,locality,Besses Basses 48300 Chastanier,48041_B018,G,BESSES BASSES,
827629783,00016,82762978300016,O,2016-09-30,,,,2022-02-02T04:05:29,true,2,,,,,VILLEVIEILLETTE,48300,CHASTANIER,,,48041,,,,,,,,,,,,,,,,,,,2020-02-04,F,,,,,68.20A,NAFRev2,N,,,0,,,,,,
829279918,00017,82927991800017,O,2017-04-11,,,,2017-04-28T10:19:39,true,1,LE HAUT DU VILLAGE,,,,,48300,CHASTANIER,,,48041,,,,,,,,,,,,,,,,,,,2017-04-11,A,,,,,68.20B,NAFRev2,N,3.751493,44.725501,0.4,locality,Chastanier Village 48300 Chastanier,48041_B570,D,CHASTANIER VILLAGE,
837529718,00012,83752971800012,O,2018-03-14,,,,2021-05-26T07:58:19,true,2,,,,,LE BOURG,48300,CHASTANIER,,,48041,,,,,,,,,,,,,,,,,,,2020-12-31,F,CONSULTANTE PETITE ENFANCE,,,,85.60Z,NAFRev2,N,3.748209,44.725429,0.39,locality,Le Pont de Braye 48300 Chastanier,48041_B600,G,LE PONT DE BRAYE,
894821198,00013,89482119800013,O,2020-12-01,,,,2021-03-05T14:47:30,true,1,,,,,LIEU DIT FONFREYDE,48300,CHASTANIER,,,48041,,,,,,,,,,,,,,,,,,,2020-12-01,A,,,,,94.99Z,NAFRev2,N,,,0,,,,,,
901433375,00028,90143337500028,O,2021-10-21,,,,2021-12-23T08:33:15,true,1,,,,,LE PONT DE BRAYE,48300,CHASTANIER,,,48041,,,,,,,,,,,,,,,,,,,2021-10-21,A,,,,,68.20B,NAFRev2,N,3.748209,44.725429,0.93,locality,Le Pont de Braye 48300 Chastanier,48041_B600,G,LE PONT DE BRAYE,
901693572,00025,90169357200025,O,2021-10-21,,,,2022-01-01T15:54:51,true,1,,,,,LE PONT DE BRAYE,48300,CHASTANIER,,,48041,,,,,,,,,,,,,,,,,,,2021-10-21,A,,,,,55.30Z,NAFRev2,N,3.748209,44.725429,0.93,locality,Le Pont de Braye 48300 Chastanier,48041_B600,G,LE PONT DE BRAYE,
904580768,00011,90458076800011,O,2021-10-04,,,,2021-10-27T09:52:04,true,1,,,,,LES MOULINS,48300,CHASTANIER,,,48041,,,,,,,,,,,,,,,,,,,2021-10-04,A,,,,,70.10Z,NAFRev2,N,6.0696786,45.0810872,0.9,poi.ruins,Les Moulins (Ruines) Huez,https://osm.org/node/3672385307,G,,
918755729,00012,91875572900012,O,2022-08-01,,,,2022-09-09T07:24:30,true,1,,,,,FONFREYDE,48300,CHASTANIER,,,48041,,,,,,,,,,,,,,,,,,,2022-08-01,A,,,,JUSIFER,25.50A,NAFRev2,N,,,0,,,,,,
