siren,nic,siret,statutDiffusionEtablissement,dateCreationEtablissement,trancheEffectifsEtablissement,anneeEffectifsEtablissement,activitePrincipaleRegistreMetiersEtablissement,dateDernierTraitementEtablissement,etablissementSiege,nombrePeriodesEtablissement,complementAdresseEtablissement,numeroVoieEtablissement,indiceRepetitionEtablissement,typeVoieEtablissement,libelleVoieEtablissement,codePostalEtablissement,libelleCommuneEtablissement,libelleCommuneEtrangerEtablissement,distributionSpecialeEtablissement,codeCommuneEtablissement,codeCedexEtablissement,libelleCedexEtablissement,codePaysEtrangerEtablissement,libellePaysEtrangerEtablissement,complementAdresse2Etablissement,numeroVoie2Etablissement,indiceRepetition2Etablissement,typeVoie2Etablissement,libelleVoie2Etablissement,codePostal2Etablissement,libelleCommune2Etablissement,libelleCommuneEtranger2Etablissement,distributionSpeciale2Etablissement,codeCommune2Etablissement,codeCedex2Etablissement,libelleCedex2Etablissement,codePaysEtranger2Etablissement,libellePaysEtranger2Etablissement,dateDebut,etatAdministratifEtablissement,enseigne1Etablissement,enseigne2Etablissement,enseigne3Etablissement,denominationUsuelleEtablissement,activitePrincipaleEtablissement,nomenclatureActivitePrincipaleEtablissement,caractereEmployeurEtablissement,longitude,latitude,geo_score,geo_type,geo_adresse,geo_id,geo_ligne,geo_l4,geo_l5
215101379,00018,21510137900018,O,1983-03-01,02,2020,,2022-08-29T09:07:31,true,4,,,,PL,DE LA MAIRIE,51600,LA CHEPPE,,,51147,,,,,,,,,,,,,,,,,,,2008-01-01,A,MAIRIE,,,,84.11Z,NAFRev2,O,4.499911,49.049961,0.82,street,Place de la Mairie 51600 La Cheppe,51147_0056,G,PLACE DE LA MAIRIE,
215101379,00026,21510137900026,O,1983-03-16,NN,,,2008-01-04T18:35:24,false,3,,,,,,51600,LA CHEPPE,,,51147,,,,,,,,,,,,,,,,,,,2008-01-01,A,SAPEURS POMPIERS,,,,84.25Z,NAFRev2,N,,,0,,,,,,
215101379,00034,21510137900034,O,1983-12-21,NN,,,,false,4,,,,,,51600,LA CHEPPE,,,51147,,,,,,,,,,,,,,,,,,,1998-09-01,F,ECOLE PRIMAIRE PUBLIQUE JEAN NATY BOYER,,,,80.1Z,NAF1993,N,,,0,,,,,,
215101379,00042,21510137900042,O,1986-09-01,NN,,,,false,4,,,,,,51600,LA CHEPPE,,,51147,,,,,,,,,,,,,,,,,,,1998-09-01,F,ECOLE MATERNELLE PUBLIQUE J NATY BOYER,,,,80.1Z,NAF1993,N,,,0,,,,,,
255100646,00017,25510064600017,O,1983-03-01,NN,,,2010-10-21T17:30:22,true,3,,,,,,51600,LA CHEPPE,,,51147,,,,,,,,,,,,,,,,,,,1995-03-09,F,,,,,75.1C,NAF1993,,,,0,,,,,,
265101311,00016,26510131100016,O,1983-03-01,NN,,,2018-09-06T09:58:51,true,4,MAIRIE,,,PL,DE LA MAIRIE,51600,LA CHEPPE,,,51147,,,,,,,,,,,,,,,,,,,2017-01-01,F,CCAS,,,,88.99B,NAFRev2,N,4.499911,49.049961,0.82,street,Place de la Mairie 51600 La Cheppe,51147_0056,G,PLACE DE LA MAIRIE,
295102883,00010,29510288300010,O,1983-08-10,NN,,,2008-01-04T19:06:56,true,3,MAIRIE,,,PL,DE LA MAIRIE,51600,LA CHEPPE,,,51147,,,,,,,,,,,,,,,,,,,2008-01-01,A,,,,,42.99Z,NAFRev2,N,4.499911,49.049961,0.82,street,Place de la Mairie 51600 La Cheppe,51147_0056,G,PLACE DE LA MAIRIE,
313744658,00011,31374465800011,O,1978-01-01,,,,2008-01-04T20:24:05,true,4,,,,,,51600,LA CHEPPE,,,51147,,,,,,,,,,,,,,,,,,,2008-01-01,A,,,,,01.21Z,NAFRev2,N,,,0,,,,,,
315814533,00024,31581453300024,O,2008-12-17,12,2020,,2022-08-29T09:15:04,true,1,,,,,MAIRIE,51600,LA CHEPPE,,,51147,,,,,,,,,,,,,,,,,,,2008-12-17,A,,,,,88.10A,NAFRev2,O,4.499911,49.049961,0.91,street,Place de la Mairie 51600 La Cheppe,51147_0056,G,PLACE DE LA MAIRIE,
316521723,00015,31652172300015,O,1979-01-01,NN,,,2019-04-18T09:36:27,true,3,MAIRIE,,,,,51600,LA CHEPPE,,,51147,,,,,,,,,,,,,,,,,,,2008-01-01,A,,,,,01.61Z,NAFRev2,N,4.499911,49.049961,0.91,street,Place de la Mairie 51600 La Cheppe,51147_0056,D,PLACE DE LA MAIRIE,
321783540,00016,32178354000016,O,1981-05-11,NN,,,2019-05-21T19:32:56,true,3,MR GOMARD MICHEL,11,,RUE,DE LA NOBLETTE,51600,LA CHEPPE,,,51147,,,,,,,,,,,,,,,,,,,2008-01-01,A,,,,,01.11Z,NAFRev2,N,4.49959,49.047545,0.95,housenumber,11 Rue de la Noblette 51600 La Cheppe,51147_0066_00011,G,11 RUE DE LA NOBLETTE,
321783540,00024,32178354000024,O,2018-12-04,,,,2018-12-17T08:09:41,false,1,,,,,DEPARTEMENTALE 994,51600,LA CHEPPE,,,51147,,,,,,,,,,,,,,,,,,,2018-12-04,A,,,,,35.11Z,NAFRev2,N,2.2226308,48.9136657,0.71,poi.hospital,Hôpital Max Fourestier Nanterre,https://osm.org/way/43453588,G,,
325347342,00017,32534734200017,O,1982-09-01,00,2020,,2022-08-29T09:18:49,true,3,,,,,,51600,LA CHEPPE,,,51147,,,,,,,,,,,,,,,,,,,2008-01-01,A,,,,,94.99Z,NAFRev2,O,,,0,,,,,,
332736800,00019,33273680000019,O,,NN,,,,true,1,,,,,,51600,LA CHEPPE,,,51147,,,,,,,,,,,,,,,,,,,1995-01-01,F,,,,,65.1D,NAF1993,N,,,0,,,,,,
339460164,00017,33946016400017,O,,NN,,,,true,1,,,,,,51600,LA CHEPPE,,,51147,,,,,,,,,,,,,,,,,,,1990-12-16,F,,,,,67.01,NAP,N,,,0,,,,,,
347848699,00018,34784869900018,O,1988-07-01,NN,,,2017-09-24T04:06:48,true,4,,,,,,51600,LA CHEPPE,,,51147,,,,,,,,,,,,,,,,,,,2017-03-18,F,,,,,01.11Z,NAFRev2,N,,,0,,,,,,
381164474,00011,38116447400011,O,,NN,,,,true,1,,,,,PETITE RUE,51600,LA CHEPPE,,,51147,,,,,,,,,,,,,,,,,,,1991-11-20,F,,,,,57.04,NAP,N,4.498327,49.047231,0.43,street,Rue de la Noblette 51600 La Cheppe,51147_0066,G,RUE DE LA NOBLETTE,
385230511,00011,38523051100011,O,,NN,,,,true,1,,,,,GRANDE RUE,51600,LA CHEPPE,,,51147,,,,,,,,,,,,,,,,,,,1995-12-31,F,,,,,55.3A,NAF1993,N,4.49781,49.050413,0.51,street,Rue de la Voie Romaine 51600 La Cheppe,51147_0105,G,RUE DE LA VOIE ROMAINE,
385269188,00012,38526918800012,O,1992-04-01,,,,2008-01-04T22:52:16,true,3,AU DOM DE MR GERARD LAPIE,,,,,51600,LA CHEPPE,,,51147,,,,,,,,,,,,,,,,,,,2008-01-01,A,,,,,01.11Z,NAFRev2,N,,,0,,,,,,
387738909,00010,38773890900010,O,1984-02-10,NN,,,2009-02-17T08:42:59,false,4,CHEZ MR APPERT COLLIN JEAN,,,,,51600,LA CHEPPE,,,51147,,,,,,,,,,,,,,,,,,,2008-12-21,F,,,,,01.11Z,NAFRev2,N,,,0,,,,,,
387738909,00028,38773890900028,O,2008-12-21,NN,,,2021-02-23T11:13:46,true,1,,12,,RUE,DE LA CAPPELLE,51600,LA CHEPPE,,,51147,,,,,,,,,,,,,,,,,,,2008-12-21,A,,,,,01.11Z,NAFRev2,N,4.498979,49.051478,0.89,housenumber,12 Rue de la Capelle 51600 La Cheppe,51147_0007_00012,G,12 RUE DE LA CAPELLE,
389000613,00015,38900061300015,O,1992-10-01,NN,,,2019-06-24T13:15:59,true,3,,,,,,51600,LA CHEPPE,,,51147,,,,,,,,,,,,,,,,,,,2008-01-01,A,,,,,01.11Z,NAFRev2,N,,,0,,,,,,
393406186,00014,39340618600014,O,1993-12-01,NN,,,,true,3,,,,,,51600,LA CHEPPE,,,51147,,,,,,,,,,,,,,,,,,,1997-12-31,F,,,,,70.2B,NAF1993,N,,,0,,,,,,
393994546,00017,39399454600017,O,1994-02-01,NN,,,2008-04-26T12:42:28,false,3,,,,RUE,DE LA NOBLETTE,51600,LA CHEPPE,,,51147,,,,,,,,,,,,,,,,,,,2007-03-01,F,,,,,01.1A,NAFRev1,N,4.498327,49.047231,0.95,street,Rue de la Noblette 51600 La Cheppe,51147_0066,G,RUE DE LA NOBLETTE,
393994546,00025,39399454600025,O,2007-03-01,01,2020,,2022-08-29T09:17:48,true,3,,29,,RUE,DE LA NOBLETTE,51600,LA CHEPPE,,,51147,,,,,,,,,,,,,,,,,,,2012-12-31,A,,,,,01.11Z,NAFRev2,O,4.496145,49.046882,0.95,housenumber,29 Rue de la Noblette 51600 La Cheppe,51147_0066_00029,G,29 RUE DE LA NOBLETTE,
394779748,00018,39477974800018,O,1990-04-01,NN,,,2008-01-04T18:13:24,true,3,,,,,,51600,LA CHEPPE,,,51147,,,,,,,,,,,,,,,,,,,2008-01-01,A,,,,,01.11Z,NAFRev2,N,,,0,,,,,,
394952766,00019,39495276600019,O,1980-01-01,NN,,,,true,4,,,,,,51600,LA CHEPPE,,,51147,,,,,,,,,,,,,,,,,,,2003-04-02,F,,,,,01.1A,NAFRev1,N,,,0,,,,,,
398826826,00016,39882682600016,O,1994-10-01,NN,,,2011-03-23T14:28:00,true,4,,,,,,51600,LA CHEPPE,,,51147,,,,,,,,,,,,,,,,,,,2011-03-30,F,,,,,68.20B,NAFRev2,N,,,0,,,,,,
398956862,00013,39895686200013,O,1994-11-01,01,2020,,2022-08-29T09:20:11,true,3,,,,RUE,DU CAMP D'ATTILA,51600,LA CHEPPE,,,51147,,,,,,,,,,,,,,,,,,,2008-01-01,A,,,,,01.11Z,NAFRev2,N,4.494811,49.049539,0.94,street,Rue du Camp d’Attila 51600 La Cheppe,51147_0006,G,RUE DU CAMP D ATTILA,
399181791,00019,39918179100019,O,1994-11-01,NN,,,2008-01-04T19:04:11,true,3,,,,,,51600,LA CHEPPE,,,51147,,,,,,,,,,,,,,,,,,,2008-01-01,A,,,,,68.20B,NAFRev2,N,,,0,,,,,,
399972298,00018,39997229800018,O,1968-01-01,NN,,,,true,1,,,,,,51600,LA CHEPPE,,,51147,,,,,,,,,,,,,,,,,,,1999-06-14,F,,,,,01.1A,NAF1993,N,,,0,,,,,,
400833711,00015,40083371100015,O,1995-04-01,NN,,,2017-07-10T08:46:18,true,2,,,,RUE,DU MONT DES VIGNES,51600,LA CHEPPE,,,51147,,,,,,,,,,,,,,,,,,,1999-12-30,F,,,,,,,,4.495455,49.051882,0.94,street,Rue du Mont des Vignes 51600 La Cheppe,51147_0057,G,RUE DU MONT DES VIGNES,
403809932,00011,40380993200011,O,1996-02-01,01,2020,,2022-08-29T09:24:21,true,3,,,,RUE,SAINT MARTIN,51600,LA CHEPPE,,,51147,,,,,,,,,,,,,,,,,,,2008-01-01,A,,,,,01.11Z,NAFRev2,N,4.503271,49.048539,0.94,street,Rue Saint-Martin 51600 La Cheppe,51147_0086,G,RUE SAINT MARTIN,
404393019,00025,40439301900025,O,2016-10-15,01,2020,,2022-08-29T09:24:46,true,1,CHEZ MME CAROLE GOMARD,17,,RUE,DE LA VOIE ROMAINE,51600,LA CHEPPE,,,51147,,,,,,,,,,,,,,,,,,,2016-10-15,A,,,,,01.11Z,NAFRev2,O,4.498664,49.049291,0.94,housenumber,17 Rue de la Voie Romaine 51600 La Cheppe,51147_0105_00017,G,17 RUE DE LA VOIE ROMAINE,
404450488,00014,40445048800014,O,1996-01-01,NN,,,,true,4,,,,,,51600,LA CHEPPE,,,51147,,,,,,,,,,,,,,,,,,,2003-04-02,F,,,,,01.1A,NAFRev1,N,,,0,,,,,,
405160896,00016,40516089600016,O,1996-05-06,NN,,,2008-11-08T01:18:17,true,4,CHEZ MME LEBEL EDITH,,,,,51600,LA CHEPPE,,,51147,,,,,,,,,,,,,,,,,,,1999-03-04,F,,,,,74.7Z,NAF1993,O,,,0,,,,,,
405244930,00013,40524493000013,O,1996-04-01,NN,,,2006-10-28T03:27:03,true,3,,,,,,51600,LA CHEPPE,,,51147,,,,,,,,,,,,,,,,,,,2006-03-31,F,,,,,70.2B,NAFRev1,N,,,0,,,,,,
407665181,00027,40766518100027,O,2006-07-01,,,,2008-01-04T20:57:58,true,2,,17,,RUE,DE LA NOBLETTE,51600,LA CHEPPE,,,51147,,,,,,,,,,,,,,,,,,,2007-05-31,F,,,,,74.1C,NAFRev1,N,4.498853,49.047218,0.95,housenumber,17 Rue de la Noblette 51600 La Cheppe,51147_0066_00017,G,17 RUE DE LA NOBLETTE,
408880508,00010,40888050800010,O,1976-03-01,NN,,,2018-12-21T19:36:48,true,6,,,,,LA VOIE DE SOUAIN,51600,LA CHEPPE,,,51147,,,,,,,,,,,,,,,,,,,2018-12-31,F,,,,,01.11Z,NAFRev2,O,4.49781,49.050413,0.62,street,Rue de la Voie Romaine 51600 La Cheppe,51147_0105,G,RUE DE LA VOIE ROMAINE,
408880904,00011,40888090400011,O,1979-11-01,NN,,,2016-02-18T04:44:06,true,4,,,,,PETITE RUE,51600,LA CHEPPE,,,51147,,,,,,,,,,,,,,,,,,,2015-12-31,F,,,,,01.11Z,NAFRev2,N,4.498327,49.047231,0.43,street,Rue de la Noblette 51600 La Cheppe,51147_0066,G,RUE DE LA NOBLETTE,
409012226,00018,40901222600018,O,1979-09-01,NN,,,2016-04-26T03:53:19,true,4,,,,RUE,DE LA NOBLETTE,51600,LA CHEPPE,,,51147,,,,,,,,,,,,,,,,,,,2015-02-16,F,,,,,01.11Z,NAFRev2,N,4.498327,49.047231,0.95,street,Rue de la Noblette 51600 La Cheppe,51147_0066,G,RUE DE LA NOBLETTE,
410737639,00014,41073763900014,O,1997-01-01,NN,,,2018-11-26T08:51:18,false,4,,,,,LA TONNE,51600,LA CHEPPE,,,51147,,,,,,,,,,,,,,,,,,,2017-01-01,F,,,,,01.11Z,NAFRev2,N,4.499089,49.051218,0.5,street,Impasse du Hanneton 51600 La Cheppe,51147_0048,G,IMPASSE DU HANNETON,
411043490,00019,41104349000019,O,1997-02-01,NN,,,2018-09-29T12:35:57,true,4,,,,,,51600,LA CHEPPE,,,51147,,,,,,,,,,,,,,,,,,,2012-12-31,A,,,,,01.11Z,NAFRev2,O,,,0,,,,,,
411062839,00013,41106283900013,O,1997-02-10,NN,,,,false,4,,,,,LA FOSSE LELOUP,51600,LA CHEPPE,,,51147,,,,,,,,,,,,,,,,,,,2003-08-01,F,,,,,92.3A,NAFRev1,N,,,0,,,,,,
411325004,00017,41132500400017,O,1997-02-01,NN,,,2011-07-12T03:45:34,true,4,,,,RUE,DE L'EGLISE,51600,LA CHEPPE,,,51147,,,,,,,,,,,,,,,,,,,2011-04-30,F,,,,,68.20B,NAFRev2,N,4.500631,49.052319,0.94,street,Rue de l’Eglise 51600 La Cheppe,51147_0015,G,RUE DE L EGLISE,
411340730,00018,41134073000018,O,1983-09-01,NN,,,,true,1,,,,RUE,DU CAMP D ATTILA,51600,LA CHEPPE,,,51147,,,,,,,,,,,,,,,,,,,2001-06-09,F,,,,,01.1A,NAF1993,N,4.494811,49.049539,0.94,street,Rue du Camp d’Attila 51600 La Cheppe,51147_0006,G,RUE DU CAMP D ATTILA,
411340748,00010,41134074800010,O,,NN,,,,true,1,,,,,,51600,LA CHEPPE,,,51147,,,,,,,,,,,,,,,,,,,1997-01-31,F,,,,,01.1A,NAF1993,N,,,0,,,,,,
412813503,00015,41281350300015,O,,NN,,,,true,1,,,,,,51600,LA CHEPPE,,,51147,,,,,,,,,,,,,,,,,,,1997-12-31,F,,,,,01.1F,NAF1993,N,,,0,,,,,,
417655560,00015,41765556000015,O,1997-11-28,NN,,,2008-01-04T23:08:30,true,3,,,,RUE,DU CAMP D'ATTILA,51600,LA CHEPPE,,,51147,,,,,,,,,,,,,,,,,,,2008-01-01,A,,,,,63.91Z,NAFRev2,N,4.494811,49.049539,0.94,street,Rue du Camp d’Attila 51600 La Cheppe,51147_0006,G,RUE DU CAMP D ATTILA,
418264743,00026,41826474300026,O,1999-09-11,,,,2011-05-03T00:34:00,false,6,,21,,RUE,NOBLETTE,51600,LA CHEPPE,,,51147,,,,,,,,,,,,,,,,,,,2008-12-02,F,,,,,43.99C,NAFRev2,N,4.498424,49.04716,0.88,housenumber,21 Rue de la Noblette 51600 La Cheppe,51147_0066_00021,G,21 RUE DE LA NOBLETTE,
419792510,00010,41979251000010,O,1998-08-04,01,2020,,2022-08-29T09:33:27,true,3,,,,RTE,LA VOIE ROMAINE,51600,LA CHEPPE,,,51147,,,,,,,,,,,,,,,,,,,2008-01-01,A,,,,,01.46Z,NAFRev2,N,4.49781,49.050413,0.8,street,Rue de la Voie Romaine 51600 La Cheppe,51147_0105,G,RUE DE LA VOIE ROMAINE,
420078628,00021,42007862800021,O,2008-04-28,,,,2013-06-19T08:38:12,true,2,,16,,RUE,DE LA NOBLETTE,51600,LA CHEPPE,,,51147,,,,,,,,,,,,,,,,,,,2011-12-31,F,PRIM'FOREST,,,,46.17B,NAFRev2,N,4.498765,49.047285,0.95,housenumber,16 Rue de la Noblette 51600 La Cheppe,51147_0066_00016,G,16 RUE DE LA NOBLETTE,
422953554,00017,42295355400017,O,1962-09-01,NN,,,,true,1,,7,,RUE,DU CHAMP D ATTILA,51600,LA CHEPPE,,,51147,,,,,,,,,,,,,,,,,,,2001-06-09,F,,,,,01.1A,NAF1993,N,4.495657,49.049872,0.86,housenumber,7 Rue du Camp d’Attila 51600 La Cheppe,51147_0006_00007,G,7 RUE DU CAMP D ATTILA,
423053818,00054,42305381800054,O,2018-10-19,,,8122ZZ,2022-06-17T11:03:36,true,1,,5,,RUE,DE L'EGLISE,51600,LA CHEPPE,,,51147,,,,,,,,,,,,,,,,,,,2018-10-19,A,,,,,81.22Z,NAFRev2,N,4.499756,49.052017,0.94,housenumber,5 Rue de l’Eglise 51600 La Cheppe,51147_0015_00005,G,5 RUE DE L EGLISE,
427980222,00017,42798022200017,O,1968-01-01,NN,,,2008-01-05T01:21:03,true,3,,11,,RUE,DE L'EGLISE,51600,LA CHEPPE,,,51147,,,,,,,,,,,,,,,,,,,2008-01-01,A,,,,,01.50Z,NAFRev2,N,4.500344,49.052316,0.94,housenumber,11 Rue de l’Eglise 51600 La Cheppe,51147_0015_00011,G,11 RUE DE L EGLISE,
428799282,00010,42879928200010,O,1999-12-01,NN,,,2008-01-05T01:31:13,true,3,,1,,RUE,ST MARTIN,51600,LA CHEPPE,,,51147,,,,,,,,,,,,,,,,,,,2008-01-01,A,,,,,68.20B,NAFRev2,N,4.502275,49.04842,0.82,housenumber,1 Rue Saint-Martin 51600 La Cheppe,51147_0086_00001,G,1 RUE SAINT MARTIN,
431163054,00015,43116305400015,O,1990-01-01,NN,,,2010-02-07T05:10:46,true,4,CIDEX 411,17,,RUE,DE L EGLISE,51600,LA CHEPPE,,,51147,,,,,,,,,,,,,,,,,,,2008-12-31,F,,,,,01.11Z,NAFRev2,N,4.500921,49.0525,0.94,housenumber,17 Rue de l’Eglise 51600 La Cheppe,51147_0015_00017,G,17 RUE DE L EGLISE,
431240514,00015,43124051400015,O,2000-05-02,NN,,,2019-11-06T10:20:40,true,4,CHEZ M JEAN-PAUL JAUMOTTE,,,,PETITE RUE,51600,LA CHEPPE,,,51147,,,,,,,,,,,,,,,,,,,2019-07-11,F,,,,,68.20B,NAFRev2,N,4.498327,49.047231,0.43,street,Rue de la Noblette 51600 La Cheppe,51147_0066,G,RUE DE LA NOBLETTE,
433169992,00016,43316999200016,O,2000-05-01,NN,,,2014-01-11T12:41:13,true,4,,,,,PETITE RUE,51600,LA CHEPPE,,,51147,,,,,,,,,,,,,,,,,,,2013-12-25,F,,,,,68.20B,NAFRev2,N,4.498327,49.047231,0.43,street,Rue de la Noblette 51600 La Cheppe,51147_0066,G,RUE DE LA NOBLETTE,
438595753,00015,43859575300015,O,2001-06-09,NN,,,2008-04-13T05:51:37,true,4,,7,,RUE,DU CAMP D'ATTILA,51600,LA CHEPPE,,,51147,,,,,,,,,,,,,,,,,,,2008-01-15,F,,,,,01.11Z,NAFRev2,N,4.495657,49.049872,0.94,housenumber,7 Rue du Camp d’Attila 51600 La Cheppe,51147_0006_00007,G,7 RUE DU CAMP D ATTILA,
439017914,00011,43901791400011,O,2001-09-05,NN,,,2017-03-02T08:51:19,false,4,,17,,RUE,DU CAMP D'ATTILA,51600,LA CHEPPE,,,51147,,,,,,,,,,,,,,,,,,,2002-01-31,F,,,,,45.4C,NAF1993,O,4.494509,49.049385,0.94,housenumber,17 Rue du Camp d’Attila 51600 La Cheppe,51147_0006_00017,G,17 RUE DU CAMP D ATTILA,
443169800,00010,44316980000010,O,2002-01-19,NN,,,2008-01-04T21:57:32,true,3,,9,,RUE,DE LA CAPELLE,51600,LA CHEPPE,,,51147,,,,,,,,,,,,,,,,,,,2008-01-01,A,,,,,01.50Z,NAFRev2,N,4.498572,49.051323,0.94,housenumber,9 Rue de la Capelle 51600 La Cheppe,51147_0007_00009,G,9 RUE DE LA CAPELLE,
448349456,00013,44834945600013,O,2003-04-02,NN,,,2008-01-04T23:18:10,true,3,,27,,RUE,DE LA NOBLETTE,51600,LA CHEPPE,,,51147,,,,,,,,,,,,,,,,,,,2008-01-01,A,,,,,01.11Z,NAFRev2,N,4.497477,49.047049,0.95,housenumber,27 Rue de la Noblette 51600 La Cheppe,51147_0066_00027,G,27 RUE DE LA NOBLETTE,
449066695,00023,44906669500023,O,2018-11-01,,,,2022-12-16T03:49:05,true,1,CHEZ M. ET MME LAPIE,3,,RUE,DE LA NOBLETTE,51600,LA CHEPPE,,,51147,,,,,,,,,,,,,,,,,,,2018-11-01,A,,,,,68.20B,NAFRev2,N,4.50108,49.048123,0.95,housenumber,3 Rue de la Noblette 51600 La Cheppe,51147_0066_00003,G,3 RUE DE LA NOBLETTE,
479784084,00010,47978408400010,O,2004-12-06,NN,,,2008-01-05T21:43:24,true,3,,11,,,VOIE ROMAINE,51600,LA CHEPPE,,,51147,,,,,,,,,,,,,,,,,,,2008-01-01,A,,,,,68.20B,NAFRev2,N,4.500454,49.049374,0.94,housenumber,11 Voie Romaine 51600 La Cheppe,51147_1eil1s_00011,G,11 VOIE ROMAINE,
481772572,00022,48177257200022,O,2009-01-18,,,4399CZ,2022-12-16T19:36:26,true,2,,2,,RUE,DE LA NOBLETTE,51600,LA CHEPPE,,,51147,,,,,,,,,,,,,,,,,,,2022-12-07,F,,,,,43.99C,NAFRev2,N,4.501365,49.048245,0.95,housenumber,2 Rue de la Noblette 51600 La Cheppe,51147_0066_00002,G,2 RUE DE LA NOBLETTE,
481836013,00013,48183601300013,O,2005-04-01,,,,2015-12-01T04:13:39,true,3,,5,,RUE,DE LA CAPELLE,51600,LA CHEPPE,,,51147,,,,,,,,,,,,,,,,,,,2015-06-30,F,,,,,33.12Z,NAFRev2,N,4.49804,49.051006,0.94,housenumber,5 Rue de la Capelle 51600 La Cheppe,51147_0007_00005,G,5 RUE DE LA CAPELLE,
482507985,00018,48250798500018,O,2005-04-01,,,,2015-06-11T03:34:12,true,3,,4,,RUE,SAINT MARTIN,51600,LA CHEPPE,,,51147,,,,,,,,,,,,,,,,,,,2015-06-01,F,,,,,68.20B,NAFRev2,N,4.502994,49.048435,0.94,housenumber,4 Rue Saint-Martin 51600 La Cheppe,51147_0086_00004,G,4 RUE SAINT MARTIN,
488057308,00014,48805730800014,O,2003-07-26,,,,2010-10-13T11:41:25,true,2,,,,PL,DE LA MAIRIE,51600,LA CHEPPE,,,51147,,,,,,,,,,,,,,,,,,,2008-01-01,A,,,,,94.99Z,NAFRev2,N,4.499911,49.049961,0.82,street,Place de la Mairie 51600 La Cheppe,51147_0056,G,PLACE DE LA MAIRIE,
488516410,00013,48851641000013,O,2005-07-01,NN,,,2019-06-24T13:23:10,true,4,,5,,RUE,DE LA CAPELLE,51600,LA CHEPPE,,,51147,,,,,,,,,,,,,,,,,,,2018-06-30,F,,,,,78.30Z,NAFRev2,O,4.49804,49.051006,0.94,housenumber,5 Rue de la Capelle 51600 La Cheppe,51147_0007_00005,G,5 RUE DE LA CAPELLE,
489997379,00016,48999737900016,O,2006-05-01,,,,2015-04-26T04:06:28,true,2,,5,,RUE,DE LA CAPELLE,51600,LA CHEPPE,,,51147,,,,,,,,,,,,,,,,,,,2008-01-01,A,,,,,68.20B,NAFRev2,N,4.49804,49.051006,0.94,housenumber,5 Rue de la Capelle 51600 La Cheppe,51147_0007_00005,G,5 RUE DE LA CAPELLE,
491063426,00028,49106342600028,O,2008-06-16,,,,2021-02-23T13:57:08,true,1,,4,,PL,DE LA MAIRIE,51600,LA CHEPPE,,,51147,,,,,,,,,,,,,,,,,,,2008-06-16,A,,,,,68.20B,NAFRev2,N,4.500203,49.049784,0.84,housenumber,4 Place de la Mairie 51600 La Cheppe,51147_0056_00004,G,4 PLACE DE LA MAIRIE,
501108351,00013,50110835100013,O,2007-12-17,NN,,4332AA,2016-03-13T03:16:36,true,6,,10,,RUE,DE L EGLISE,51600,LA CHEPPE,,,51147,,,,,,,,,,,,,,,,,,,2016-03-11,A,,,,,01.49Z,NAFRev2,N,4.500395,49.052244,0.94,housenumber,10 Rue de l’Eglise 51600 La Cheppe,51147_0015_00010,G,10 RUE DE L EGLISE,
502054000,00018,50205400000018,O,2006-07-01,,,,2008-01-18T09:28:16,true,1,CHEZ MONSIEUR LAURIN JACQUES,,,RUE,DE L EGLISE,51600,LA CHEPPE,,,51147,,,,,,,,,,,,,,,,,,,2006-07-01,A,,,,,90.02Z,NAFRev2,N,4.500631,49.052319,0.94,street,Rue de l’Eglise 51600 La Cheppe,51147_0015,G,RUE DE L EGLISE,
503452419,00016,50345241900016,O,2008-04-01,,,,2021-02-23T14:15:20,true,1,,6,,RUE,DU CAMP D'ATTILA,51600,LA CHEPPE,,,51147,,,,,,,,,,,,,,,,,,,2008-04-01,A,,,,,66.29Z,NAFRev2,N,4.495949,49.050086,0.94,housenumber,6 Rue du Camp d’Attila 51600 La Cheppe,51147_0006_00006,G,6 RUE DU CAMP D ATTILA,
503858672,00010,50385867200010,O,2008-04-01,01,2020,,2022-08-29T09:07:21,true,1,,11,,RUE,DE LA NOBLETTE,51600,LA CHEPPE,,,51147,,,,,,,,,,,,,,,,,,,2008-04-01,A,,,,,01.61Z,NAFRev2,N,4.49959,49.047545,0.95,housenumber,11 Rue de la Noblette 51600 La Cheppe,51147_0066_00011,G,11 RUE DE LA NOBLETTE,
508218179,00010,50821817900010,O,2008-10-02,NN,,4331ZA,2015-09-22T04:24:47,true,2,,3,,RUE,SAINT MARTIN,51600,LA CHEPPE,,,51147,,,,,,,,,,,,,,,,,,,2013-04-04,A,,,,,43.31Z,NAFRev2,N,4.5029,49.048501,0.94,housenumber,3 Rue Saint-Martin 51600 La Cheppe,51147_0086_00003,G,3 RUE SAINT MARTIN,
509443933,00015,50944393300015,O,2008-11-27,,,,2015-04-26T04:06:27,true,1,,5,,RUE,DE LA CAPELLE,51600,LA CHEPPE,,,51147,,,,,,,,,,,,,,,,,,,2008-11-27,A,,,,,68.20B,NAFRev2,N,4.49804,49.051006,0.94,housenumber,5 Rue de la Capelle 51600 La Cheppe,51147_0007_00005,G,5 RUE DE LA CAPELLE,
511258287,00016,51125828700016,O,2009-04-01,NN,,,2017-05-04T04:46:10,true,1,,16,,,VOIE ROMAINE,51600,LA CHEPPE,,,51147,,,,,,,,,,,,,,,,,,,2009-04-01,A,,,,,01.13Z,NAFRev2,O,4.497082,49.050844,0.94,housenumber,16 Voie Romaine 51600 La Cheppe,51147_1eil1s_00016,G,16 VOIE ROMAINE,
511786824,00017,51178682400017,O,2009-04-15,,,,2015-12-08T04:14:29,true,1,,,,,VOIE ROMAINE,51600,LA CHEPPE,,,51147,,,,,,,,,,,,,,,,,,,2009-04-15,A,,,,,56.21Z,NAFRev2,N,4.49849,49.050037,0.94,street,Voie Romaine 51600 La Cheppe,51147_1eil1s,G,VOIE ROMAINE,
520187006,00017,52018700600017,O,2010-02-05,,,,2013-01-11T08:56:01,true,2,,18,,RUE,DE L'EGLISE,51600,LA CHEPPE,,,51147,,,,,,,,,,,,,,,,,,,2013-02-01,F,,,,,47.76Z,NAFRev2,N,4.501419,49.052507,0.94,housenumber,18 Rue de l’Eglise 51600 La Cheppe,51147_0015_00018,G,18 RUE DE L EGLISE,
530181189,00040,53018118900040,O,2014-08-11,,,8122ZZ,2016-04-26T04:42:04,false,2,,9,,RUE,DE L'EGLISE,51600,LA CHEPPE,,,51147,,,,,,,,,,,,,,,,,,,2015-01-01,F,DCM STEPH,,,,81.21Z,NAFRev2,N,4.500056,49.052216,0.94,housenumber,9 Rue de l’Eglise 51600 La Cheppe,51147_0015_00009,G,9 RUE DE L EGLISE,
537429276,00018,53742927600018,O,2011-10-01,,,,2017-02-28T09:34:41,false,2,,18,,,VOIE ROMAINE,51600,LA CHEPPE,,,51147,,,,,,,,,,,,,,,,,,,2013-06-26,F,,,,,85.52Z,NAFRev2,N,4.496756,49.051024,0.94,housenumber,18 Voie Romaine 51600 La Cheppe,51147_1eil1s_00018,G,18 VOIE ROMAINE,
539654954,00012,53965495400012,O,2012-02-01,,,,2012-11-10T03:51:40,true,1,,26,,RUE,DE LA NOBLETTE,51600,LA CHEPPE,,,51147,,,,,,,,,,,,,,,,,,,2012-02-01,A,,,,,11.05Z,NAFRev2,N,4.496219,49.046973,0.95,housenumber,26 Rue de la Noblette 51600 La Cheppe,51147_0066_00026,G,26 RUE DE LA NOBLETTE,
735911901,00016,73591190100016,O,,NN,,,,true,1,,,,,,51600,LA CHEPPE,,,51147,,,,,,,,,,,,,,,,,,,1987-09-30,F,,,,,69.12,NAP,N,,,0,,,,,,
749898292,00018,74989829200018,O,2012-02-15,01,2019,4332BB,2022-11-19T03:33:52,true,4,,4,,PL,DE LA MAIRIE,51600,LA CHEPPE,,,51147,,,,,,,,,,,,,,,,,,,2022-11-18,F,,,,FER PASSION,43.32B,NAFRev2,N,4.500203,49.049784,0.84,housenumber,4 Place de la Mairie 51600 La Cheppe,51147_0056_00004,G,4 PLACE DE LA MAIRIE,
775668965,00053,77566896500053,O,1990-01-01,,,,2016-06-20T09:45:35,false,1,,,,RTE,DE REIMS,51600,LA CHEPPE,,,51147,,,,,,,,,,,,,,,,,,,1990-01-01,A,,,,,52.10B,NAFRev2,N,4.49781,49.050413,0.38,street,Rue de la Voie Romaine 51600 La Cheppe,51147_0105,G,RUE DE LA VOIE ROMAINE,
781948427,00021,78194842700021,O,2000-01-01,NN,,,2017-01-16T10:11:26,false,4,MONSIEUR RABIET,4,,RUE,DE LA NOBLETTE,51600,LA CHEPPE,,,51147,,,,,,,,,,,,,,,,,,,2016-12-02,F,CEDTE,,,,85.59B,NAFRev2,N,4.501013,49.04819,0.95,housenumber,4 Rue de la Noblette 51600 La Cheppe,51147_0066_00004,G,4 RUE DE LA NOBLETTE,
789477825,00010,78947782500010,O,2012-11-26,,,,2019-01-07T11:06:05,true,1,,12,,RUE,DE LA CAPELLE,51600,LA CHEPPE,,,51147,,,,,,,,,,,,,,,,,,,2012-11-26,A,,,,,46.19B,NAFRev2,N,4.498979,49.051478,0.94,housenumber,12 Rue de la Capelle 51600 La Cheppe,51147_0007_00012,G,12 RUE DE LA CAPELLE,
791225980,00014,79122598000014,O,2013-01-01,,,,2020-02-18T19:34:05,true,1,,12,,RUE,DU CAMP D'ATTILA,51600,LA CHEPPE,,,51147,,,,,,,,,,,,,,,,,,,2013-01-01,A,,,,,01.11Z,NAFRev2,N,4.494928,49.04966,0.94,housenumber,12 Rue du Camp d’Attila 51600 La Cheppe,51147_0006_00012,G,12 RUE DU CAMP D ATTILA,