siren,nic,siret,statutDiffusionEtablissement,dateCreationEtablissement,trancheEffectifsEtablissement,anneeEffectifsEtablissement,activitePrincipaleRegistreMetiersEtablissement,dateDernierTraitementEtablissement,etablissementSiege,nombrePeriodesEtablissement,complementAdresseEtablissement,numeroVoieEtablissement,indiceRepetitionEtablissement,typeVoieEtablissement,libelleVoieEtablissement,codePostalEtablissement,libelleCommuneEtablissement,libelleCommuneEtrangerEtablissement,distributionSpecialeEtablissement,codeCommuneEtablissement,codeCedexEtablissement,libelleCedexEtablissement,codePaysEtrangerEtablissement,libellePaysEtrangerEtablissement,complementAdresse2Etablissement,numeroVoie2Etablissement,indiceRepetition2Etablissement,typeVoie2Etablissement,libelleVoie2Etablissement,codePostal2Etablissement,libelleCommune2Etablissement,libelleCommuneEtranger2Etablissement,distributionSpeciale2Etablissement,codeCommune2Etablissement,codeCedex2Etablissement,libelleCedex2Etablissement,codePaysEtranger2Etablissement,libellePaysEtranger2Etablissement,dateDebut,etatAdministratifEtablissement,enseigne1Etablissement,enseigne2Etablissement,enseigne3Etablissement,denominationUsuelleEtablissement,activitePrincipaleEtablissement,nomenclatureActivitePrincipaleEtablissement,caractereEmployeurEtablissement,longitude,latitude,geo_score,geo_type,geo_adresse,geo_id,geo_ligne,geo_l4,geo_l5
195600010,00019,19560001000019,O,1983-03-01,21,2020,,2022-08-29T09:04:31,true,3,,50,,RUE,PIERRE ALLIO,56400,BRECH,,BP 60624,56023,56406,AURAY CEDEX,,,,,,,,,,,,,,,,,2008-01-01,A,,,,,85.32Z,NAFRev2,N,-2.998815,47.685137,0.96,housenumber,50 Rue Pierre Allio 56400 Brech,56023_0315_00050,G,50 RUE PIERRE ALLIO,
215600230,00019,21560023000019,O,1983-03-01,21,2020,,2022-08-29T09:07:47,true,3,,9,,RUE,GEORGES CADOUDAL,56400,BRECH,,,56023,,,,,,,,,,,,,,,,,,,2008-01-01,A,MAIRIE,,,,84.11Z,NAFRev2,O,-2.997196,47.720638,0.96,housenumber,9 Rue Georges Cadoudal 56400 Brech,56023_0126_00009,G,9 RUE GEORGES CADOUDAL,
215600230,00027,21560023000027,O,1983-12-21,11,2020,,2022-08-29T09:07:47,false,3,,3,,RUE,DU PONT DOUAR,56400,BRECH,,,56023,,,,,,,,,,,,,,,,,,,2008-01-01,A,ECOLE PRIMAIRE PUBLIQUE,,,,85.20Z,NAFRev2,N,-2.999871,47.720026,0.96,housenumber,3 Rue du Pont Douar 56400 Brech,56023_0330_00003,G,3 RUE DU PONT DOUAR,
215600230,00035,21560023000035,O,1983-12-21,03,2020,,2022-08-29T09:07:47,false,3,,4,,RUE,DES TILLEULS,56400,BRECH,,,56023,,,,,,,,,,,,,,,,,,,2008-01-01,A,ECOLE PRIMAIRE PUBLIQUE KERSTRAN,,,,85.20Z,NAFRev2,N,-3.027407,47.689105,0.96,housenumber,4 Rue des Tilleuls 56400 Brech,56023_0398_00004,G,4 RUE DES TILLEULS,
215600230,00043,21560023000043,O,1994-12-31,NN,,,,false,3,MAIRIE,,,,LE BOURG,56400,BRECH,,,56023,,,,,,,,,,,,,,,,,,,2003-12-31,F,LOTISSEMENTS COMMUNAUX,,,,70.1C,NAFRev1,N,-3.055315,47.732195,0.63,street,Le Boulât 56400 Brech,56023_ar418n,G,LE BOULAT,
215600230,00050,21560023000050,O,1996-11-01,NN,,,,false,3,MAIRIE,9,,RUE,GEORGES CADOUDAL,56400,BRECH,,,56023,,,,,,,,,,,,,,,,,,,2003-12-31,F,LOTISSEMENT LA PETITE PRAIRIE,,,,70.1C,NAFRev1,N,-2.997196,47.720638,0.96,housenumber,9 Rue Georges Cadoudal 56400 Brech,56023_0126_00009,G,9 RUE GEORGES CADOUDAL,
215600230,00068,21560023000068,O,1998-01-01,NN,,,,false,4,MAIRIE,,,,BOURG,56400,BRECH,,,56023,,,,,,,,,,,,,,,,,,,2003-08-31,F,ATELIER RELAIS,,,,70.2C,NAFRev1,N,-3.055315,47.732195,0.44,street,Le Boulât 56400 Brech,56023_ar418n,G,LE BOULAT,
215600230,00076,21560023000076,O,2001-04-13,NN,,,2014-07-04T15:16:30,false,4,MAIRIE,9,,RUE,GEORGES CADOUDAL,56400,BRECH,,,56023,,,,,,,,,,,,,,,,,,,2012-12-25,F,ZONES ARTISANALES,,,,42.99Z,NAFRev2,N,-2.997196,47.720638,0.96,housenumber,9 Rue Georges Cadoudal 56400 Brech,56023_0126_00009,G,9 RUE GEORGES CADOUDAL,
215600230,00084,21560023000084,O,1995-12-25,NN,,,,false,2,MAIRIE,,,,LE BOURG,56400,BRECH,,,56023,,,,,,,,,,,,,,,,,,,2002-12-31,F,LOTISSEMENT GRAND CHAMP,,,,70.1C,NAF1993,N,-3.055315,47.732195,0.63,street,Le Boulât 56400 Brech,56023_ar418n,G,LE BOULAT,
215600230,00092,21560023000092,O,2001-12-25,NN,,,2013-10-05T12:36:08,false,3,MAIRIE,,,,LE BOURG,56400,BRECH,,,56023,,,,,,,,,,,,,,,,,,,2012-12-25,F,LOTISSEMENT DE LA MADELEINE,,,,42.99Z,NAFRev2,N,-3.055315,47.732195,0.63,street,Le Boulât 56400 Brech,56023_ar418n,G,LE BOULAT,
215600230,00100,21560023000100,O,2001-12-25,NN,,,2012-08-22T10:04:03,false,3,MAIRIE,9,,RUE,DE CADOUDAL,56400,BRECH,,,56023,,,,,,,,,,,,,,,,,,,2012-03-26,F,ZA DE KERSTAN,,,,42.99Z,NAFRev2,N,-2.997196,47.720638,0.75,housenumber,9 Rue Georges Cadoudal 56400 Brech,56023_0126_00009,G,9 RUE GEORGES CADOUDAL,
245614441,00021,24561444100021,O,2003-03-18,NN,,,2013-12-12T19:24:31,false,4,ESPACE TERTIAIRE DE PORTE OCEANE 2,,,RUE,DU DANEMARK,56400,BRECH,,,56023,,,,,,,,,,,,,,,,,,,2014-01-01,F,PARC D'ACTIVITES,,,,42.99Z,NAFRev2,N,-3.011687,47.66978,0.96,street,Rue du Danemark 56400 Brech,56023_0039,G,RUE DU DANEMARK,
245614441,00039,24561444100039,O,2008-05-12,NN,,,2015-05-14T03:44:36,true,4,ESPACE TERTIAIRE PORTE OCEANE 2,,,RUE,DU DANEMARK,56400,BRECH,,,56023,,,,,,,,,,,,,,,,,,,2014-01-01,F,,,,,84.11Z,NAFRev2,O,-3.011687,47.66978,0.96,street,Rue du Danemark 56400 Brech,56023_0039,G,RUE DU DANEMARK,
265601088,00015,26560108800015,O,1983-03-01,NN,,,2013-05-18T02:21:33,true,5,MAIRIE,9,,RUE,GEORGES CADOUDAL,56400,BRECH,,,56023,,,,,,,,,,,,,,,,,,,2008-01-01,A,,,,,88.99B,NAFRev2,O,-2.997196,47.720638,0.96,housenumber,9 Rue Georges Cadoudal 56400 Brech,56023_0126_00009,G,9 RUE GEORGES CADOUDAL,
265601088,00023,26560108800023,O,1996-07-08,NN,,,2011-04-23T04:21:45,false,4,MAIRIE,9,,RUE,GEORGES CADOUDAL,56400,BRECH,,,56023,,,,,,,,,,,,,,,,,,,2008-01-01,A,SERVICE AIDE MENAGERE A DOMICILE,,,,88.10A,NAFRev2,O,-2.997196,47.720638,0.96,housenumber,9 Rue Georges Cadoudal 56400 Brech,56023_0126_00009,G,9 RUE GEORGES CADOUDAL,
275600849,00010,27560084900010,O,1989-01-01,NN,,,,true,3,MAIRIE,,,,BOURG,56400,BRECH,,,56023,,,,,,,,,,,,,,,,,,,1996-12-31,F,,,,,70.3D,NAF1993,N,-3.055315,47.732195,0.44,street,Le Boulât 56400 Brech,56023_ar418n,G,LE BOULAT,
295601710,00011,29560171000011,O,1982-06-24,NN,,,,true,4,MAIRIE,,,,BOURG,56400,BRECH,,,56023,,,,,,,,,,,,,,,,,,,1993-01-29,F,,,,,70.1C,NAF1993,N,-3.055315,47.732195,0.44,street,Le Boulât 56400 Brech,56023_ar418n,G,LE BOULAT,
300409000,00035,30040900000035,O,1990-09-01,NN,,,2015-07-03T19:27:59,false,4,,,,LD,KERMELEN,56400,BRECH,,,56023,,,,,,,,,,,,,,,,,,,2015-06-30,F,,,,,68.20B,NAFRev2,N,-3.038509,47.725951,0.95,street,Kermelen 56400 Brech,56023_pxqafk,G,KERMELEN,
300409000,00043,30040900000043,O,2013-09-10,,,,2015-07-03T19:27:59,true,2,,,,,KERMELEN,56400,BRECH,,,56023,,,,,,,,,,,,,,,,,,,2015-06-30,F,MENUISERIE DE KERMELEN,,,MENUISERIE DE KERMELEN,43.32A,NAFRev2,N,-3.038509,47.725951,0.95,street,Kermelen 56400 Brech,56023_pxqafk,G,KERMELEN,
300409018,00011,30040901800011,O,,NN,,,,true,1,,17,,RUE,DE LEAULET,56400,BRECH,,,56023,,,,,,,,,,,,,,,,,,,1990-06-21,F,,,,,55.60,NAP,N,-3.011371,47.676425,0.96,housenumber,17 Rue de Léaulet 56400 Brech,56023_0180_00017,G,17 RUE DE LEAULET,
300459120,00048,30045912000048,O,1997-01-01,NN,,,2022-10-26T04:21:29,false,4,,,,RUE,DE LA PETITE VITESSE,56400,BRECH,,,56023,,,,,,,,,,,,,,,,,,,2020-10-30,F,,,,,47.76Z,NAFRev2,N,-2.997743,47.680536,0.95,street,Rue de la Petite Vitesse 56400 Brech,56023_0310,G,RUE DE LA PETITE VITESSE,
300488863,00014,30048886300014,O,1900-01-01,,,,,true,4,,,,LD,LES 4 CHEMINS,56400,BRECH,,BP47,56023,,,,,,,,,,,,,,,,,,,1992-12-25,F,,,,,20.3Z,NAF1993,N,-3.011673,47.724854,0.81,street,Impasse des 4 Chemins 56400 Brech,56023_0374,G,IMPASSE DES 4 CHEMINS,
300599123,03120,30059912303120,O,1900-01-01,NN,,,2019-06-24T13:14:45,false,5,,,,,KERVALH,56400,BRECH,,,56023,,,,,,,,,,,,,,,,,,,2017-01-01,F,CFPA,,,,85.59A,NAFRev2,O,-3.038481,47.702531,0.96,street,Kervalh 56400 Brech,56023_l07cah,G,KERVALH,
300949559,00029,30094955900029,O,1983-12-20,NN,,,2008-04-26T08:34:22,true,3,,,,,MOULIN DE TREUROUX,56400,BRECH,,,56023,,,,,,,,,,,,,,,,,,,2006-11-30,F,,,,,55.3B,NAFRev1,O,-2.987856,47.729457,0.95,locality,Moulin de Treuroux 56400 Brech,56023_C932,G,MOULIN DE TREUROUX,
301176483,00016,30117648300016,O,,NN,,,,true,1,,,,,LANN ER RHEU,56400,BRECH,,,56023,,,,,,,,,,,,,,,,,,,1987-12-01,F,,,,,49.05,NAP,N,-3.007463,47.705491,0.95,street,Lann Er Rheu 56400 Brech,56023_C341,G,LANN ER RHEU,
301249140,00023,30124914000023,O,1993-05-21,,,,2008-11-07T00:17:18,true,3,,,,LD,KERIQUELLAN,56400,BRECH,,,56023,,,,,,,,,,,,,,,,,,,1993-12-25,F,,,,,50.2Z,NAF1993,N,,,0,,,,,,
301358800,00011,30135880000011,O,,,,,,true,1,,,,,PENHOUET,56400,BRECH,,,56023,,,,,,,,,,,,,,,,,,,1984-12-25,F,,,,,81.21,NAP,N,-2.993849,47.721306,0.42,street,Impasse Ar Goh Penher 56400 Brech,56023_0128,G,IMPASSE AR GOH PENHER,
301941332,00340,30194133200340,O,2018-03-31,21,2020,,2022-08-29T09:11:25,false,1,,,,,ROND-POINT DE KERIZAN,56400,BRECH,,,56023,,,,,,,,,,,,,,,,,,,2018-03-31,A,KEOLIS ATLANTIQUE,,,,49.39A,NAFRev2,O,,,0,,,,,,
302364211,00136,30236421100136,O,1984-01-01,NN,,,,false,4,,,,RUE,GEORGES MOISAN,56400,BRECH,,,56023,,,,,,,,,,,,,,,,,,,1994-12-25,F,POINT P BRETAGNE,,,,51.5F,NAF1993,O,-2.995738,47.681219,0.82,street,Rue Georges Moizan 56400 Brech,56023_0125,G,RUE GEORGES MOIZAN,
302376942,00033,30237694200033,O,,NN,,,,true,1,,28,,RUE,NATIONALE,56400,BRECH,,,56023,,,,,,,,,,,,,,,,,,,1994-04-01,F,,,,,45.4M,NAF1993,N,-3.009337,47.678266,0.96,housenumber,28 Rue Nationale 56400 Brech,56023_0230_00028,G,28 RUE NATIONALE,
302889613,00014,30288961300014,O,,,,,,true,1,,,,QUAI,DE LA PAIX,56400,BRECH,,,56023,,,,,,,,,,,,,,,,,,,1984-12-25,F,,,,,81.21,NAP,N,4.6455727,43.8046136,0.9,poi,Quai de la Paix (Pont) Beaucaire,https://osm.org/way/189635521,G,,
302889621,00017,30288962100017,O,,,,,,true,1,,,,QUAI,DE LA PAIX,56400,BRECH,,,56023,,,,,,,,,,,,,,,,,,,1984-12-25,F,,,,,81.21,NAP,N,4.6455727,43.8046136,0.9,poi,Quai de la Paix (Pont) Beaucaire,https://osm.org/way/189635521,G,,
304585763,00036,30458576300036,O,2005-03-15,,,,2008-11-07T00:20:13,true,2,,,,IMP,DES VIOLETTES,56400,BRECH,,,56023,,,,,,,,,,,,,,,,,,,2006-12-31,F,,,,,52.4X,NAFRev1,N,-3.012024,47.677304,0.85,street,Impasse des Violettes 56400 Brech,56023_0360,G,IMPASSE DES VIOLETTES,
304716038,00035,30471603800035,O,1900-01-01,NN,,,2021-12-03T11:27:11,false,4,,13,,RUE,ALBERT LE GOSLES,56400,BRECH,,,56023,,,,,,,,,,,,,,,,,,,2002-12-25,F,,,,,74.1J,NAF1993,N,-2.995753,47.681685,0.96,housenumber,13 Rue Albert le Goslès 56400 Brech,56023_0010_00013,G,13 RUE ALBERT LE GOSLES,
304920333,00016,30492033300016,O,1976-01-01,NN,,,,false,4,,,,LD,KERSTRAN,56400,BRECH,,,56023,,,,,,,,,,,,,,,,,,,2000-09-30,F,,,,,70.2C,NAF1993,N,-3.022188,47.684771,0.95,street,Kerstran 56400 Brech,56023_3mwcz0,G,KERSTRAN,
304920549,00017,30492054900017,O,,,,,,true,1,,,,,BOURG,56400,BRECH,,,56023,,,,,,,,,,,,,,,,,,,1985-12-25,F,,,,,67.05,NAP,N,-3.055315,47.732195,0.44,street,Le Boulât 56400 Brech,56023_ar418n,G,LE BOULAT,
304940471,01018,30494047101018,O,2003-06-16,03,2020,,2022-08-29T09:12:06,false,3,,,,,ZA DE MANE SALUT,56400,BRECH,,,56023,,,,,,,,,,,,,,,,,,,2008-01-01,A,,,,,46.46Z,NAFRev2,O,-3.030733,47.690511,0.79,street,Impasse de Mané Salut 56400 Brech,56023_0004,G,IMPASSE DE MANE SALUT,
305162927,00043,30516292700043,O,1998-01-12,11,2020,,2022-08-29T09:12:10,true,4,,,,,KERSTRAN,56400,BRECH,,BP 301,56023,,,,,,,,,,,,,,,,,,,2008-01-01,A,,,,,46.33Z,NAFRev2,O,-3.022188,47.684771,0.95,street,Kerstran 56400 Brech,56023_3mwcz0,G,KERSTRAN,
305198095,00054,30519809500054,O,2016-06-01,,,,2016-08-09T08:24:04,true,2,,11,,,HENT TIGLAS,56400,BRECH,,,56023,,,,,,,,,,,,,,,,,,,2016-06-09,F,,,,,86.23Z,NAFRev2,N,-2.994337,47.710554,0.58,housenumber,11 Chemin Tiglas - St Degan 56400 Brech,56023_0352_00011,G,11 CHEMIN TIGLAS  ST DEGAN,
305583387,00066,30558338700066,O,2003-03-01,NN,,,2010-11-16T00:10:54,false,3,,20,,RTE,DE CORN ER HOET,56400,BRECH,,,56023,,,,,,,,,,,,,,,,,,,2006-02-24,F,,,,,70.2C,NAFRev1,N,-3.033519,47.7211,0.91,housenumber,20 Rte de Kerbiguet Corn Er Hoet 56400 Brech,56023_93fgdy_00020,G,20 RTE DE KERBIGUET CORN ER HOET,
306195769,00014,30619576900014,O,1976-01-01,NN,,,2008-11-07T00:21:57,true,4,,16,,RUE,PIERRE ALLIO,56400,BRECH,,,56023,,,,,,,,,,,,,,,,,,,2003-12-02,F,,,,,45.3E,NAFRev1,N,-2.997209,47.681455,0.96,housenumber,16 Rue Pierre Allio 56400 Brech,56023_0315_00016,G,16 RUE PIERRE ALLIO,
306271099,00088,30627109900088,O,1999-01-02,,,,,true,1,,9,,RUE,ST ANDRE,56400,BRECH,,,56023,,,,,,,,,,,,,,,,,,,2000-05-31,F,,,,,70.3A,NAF1993,N,-2.994474,47.720558,0.83,housenumber,9 Rue Saint André 56400 Brech,56023_0347_00009,G,9 RUE SAINT ANDRE,
306454067,00019,30645406700019,O,,NN,,,,true,1,,18,,RUE,PIERRE ALLIO,56400,BRECH,,,56023,,,,,,,,,,,,,,,,,,,1991-12-31,F,,,,,64.11,NAP,N,-2.997261,47.681573,0.96,housenumber,18 Rue Pierre Allio 56400 Brech,56023_0315_00018,G,18 RUE PIERRE ALLIO,
307334144,00010,30733414400010,O,1984-01-23,NN,,,,false,3,,3,,RUE,DE L EGALITE,56400,BRECH,,,56023,,,,,,,,,,,,,,,,,,,1993-10-14,F,,,,,92.3A,NAF1993,N,-3.008018,47.679477,0.96,housenumber,3 Rue de l’Egalité 56400 Brech,56023_0040_00003,G,3 RUE DE L EGALITE,
307334144,00028,30733414400028,O,1993-10-14,NN,,,,true,2,,,,,ROSTEVEL,56400,BRECH,,,56023,,,,,,,,,,,,,,,,,,,1993-12-25,F,,,,,92.3A,NAF1993,N,-2.984045,47.680091,0.93,street,Lieu Dit Rostevel 56400 Brech,56023_76dv92,G,LIEU DIT ROSTEVEL,
308369644,00015,30836964400015,O,,NN,,,,true,1,,1,,RUE,LEAULET,56400,BRECH,,,56023,,,,,,,,,,,,,,,,,,,1991-09-30,F,,,,,55.71,NAP,N,-3.009406,47.677828,0.95,housenumber,1 Rue de Léaulet 56400 Brech,56023_0180_00001,G,1 RUE DE LEAULET,
308369719,00015,30836971900015,O,,NN,,,,true,1,,1,,RUE,LEAULET,56400,BRECH,,,56023,,,,,,,,,,,,,,,,,,,1991-09-30,F,,,,,55.71,NAP,N,-3.009406,47.677828,0.95,housenumber,1 Rue de Léaulet 56400 Brech,56023_0180_00001,G,1 RUE DE LEAULET,
308620517,00018,30862051700018,O,,,,,,true,1,,1,,RUE,LEAULET,56400,BRECH,,,56023,,,,,,,,,,,,,,,,,,,1991-09-30,F,,,,,55.71,NAP,N,-3.009406,47.677828,0.95,housenumber,1 Rue de Léaulet 56400 Brech,56023_0180_00001,G,1 RUE DE LEAULET,
308636489,00020,30863648900020,O,2019-09-01,11,2020,4399CZ,2022-08-29T09:12:53,true,1,BOTULEN,,,,ZONE DE COET LANN,56400,BRECH,,,56023,,,,,,,,,,,,,,,,,,,2019-09-01,A,,,,,43.99C,NAFRev2,O,,,0,,,,,,
308851856,00028,30885185600028,O,2010-07-01,01,2020,,2022-08-29T09:12:55,true,1,PORTE OCEANE 2,,,,ESPACE TERTIAIRE,56400,BRECH,,,56023,,,,,,,,,,,,,,,,,,,2010-07-01,A,,,,,66.19A,NAFRev2,O,1.5479703,43.5154204,0.9,poi.commercial,Espace 61 (Zone tertiaire) Escalquens,https://osm.org/way/33169203,G,,
309022341,00072,30902234100072,O,2012-12-03,12,2020,,2022-08-29T09:12:59,false,2,,,,LD,PIPARK,56400,BRECH,,,56023,,,,,,,,,,,,,,,,,,,2013-02-10,A,,,,,41.20A,NAFRev2,O,-3.005872,47.68739,0.93,street,Route de Pipark 56400 Brech,56023_0317,G,ROUTE DE PIPARK,
309192037,00013,30919203700013,O,1900-01-01,11,2019,,2021-10-27T08:16:41,true,5,,,,,LA CHARTREUSE,56400,BRECH,,,56023,,,,,,,,,,,,,,,,,,,2020-01-01,F,,,,,94.91Z,NAFRev2,O,-2.999256,47.682079,0.94,street,Lotissement la Chartreuse 56400 Brech,56023_A030,G,LOTISSEMENT LA CHARTREUSE,
309249704,00029,30924970400029,O,1900-01-01,NN,,,2008-11-07T00:23:59,false,4,,21,,RUE,PIERRE ALLIOT,56400,BRECH,,,56023,,,,,,,,,,,,,,,,,,,1994-07-04,F,,,,,45.4J,NAF1993,N,-2.9976,47.682063,0.88,housenumber,21 Rue Pierre Allio 56400 Brech,56023_0315_00021,G,21 RUE PIERRE ALLIO,
309260933,00010,30926093300010,O,,,,,,true,1,,,,RUE,NATIONALE,56400,BRECH,,,56023,,,,,,,,,,,,,,,,,,,1984-12-25,F,,,,,65.02,NAP,N,-3.009348,47.678225,0.96,street,Rue Nationale 56400 Brech,56023_0230,G,RUE NATIONALE,
309573079,00048,30957307900048,O,,,,,,true,1,,,,,LE BEUDRECH,56400,BRECH,,,56023,,,,,,,,,,,,,,,,,,,1984-12-25,F,,,,,62.45,NAP,N,-3.039705,47.694019,0.93,street,Lieu Dit le Beudrec 56400 Brech,56023_jfa0l8,G,LIEU DIT LE BEUDREC,
309611473,00039,30961147300039,O,1999-09-15,,,,2006-11-25T09:24:57,true,1,,,,,ZA DE KERSTRAN,56400,BRECH,,,56023,,,,,,,,,,,,,,,,,,,1999-09-15,F,,,,,74.1J,NAF1993,N,-3.026054,47.691965,0.77,street,Rue de Kerstran 56400 Brech,56023_0144,G,RUE DE KERSTRAN,
309682227,00025,30968222700025,O,1990-01-02,NN,,,,false,3,,10,,RUE,PIERRE ALLIO,56400,BRECH,,,56023,,,,,,,,,,,,,,,,,,,1994-04-01,F,,,,,52.2C,NAF1993,,-2.996978,47.680923,0.96,housenumber,10 Rue Pierre Allio 56400 Brech,56023_0315_00010,G,10 RUE PIERRE ALLIO,
309895118,00029,30989511800029,O,1980-05-12,NN,,,2008-11-07T00:24:45,false,3,,,,,KERBERLUET,56400,BRECH,,,56023,,,,,,,,,,,,,,,,,,,2006-04-19,F,,,,,45.4D,NAFRev1,N,-3.003572,47.693319,0.95,street,Kerberluet 56400 Brech,56023_b260cq,G,KERBERLUET,
310010749,00011,31001074900011,O,,,,,,true,1,,,,,KERGUERO,56400,BRECH,,,56023,,,,,,,,,,,,,,,,,,,1987-03-31,F,,,,,55.72,NAP,N,-2.993642,47.700022,0.93,street,Impasse de Kerguero 56400 Brech,56023_0156,G,IMPASSE DE KERGUERO,
310278098,00010,31027809800010,O,,NN,,,,true,1,,23,,RUE,NATIONALE,56400,BRECH,,,56023,,,,,,,,,,,,,,,,,,,1988-09-09,F,,,,,81.21,NAP,N,-3.009348,47.678225,0.82,street,Rue Nationale 56400 Brech,56023_0230,G,RUE NATIONALE,
310529904,00032,31052990400032,O,,NN,,,,true,1,,,,LD,KERIQUELLAN,56400,BRECH,,,56023,,,,,,,,,,,,,,,,,,,1993-12-31,F,,,,,70.2C,NAF1993,N,,,0,,,,,,
310710009,00021,31071000900021,O,,NN,,,,true,1,,32,,RUE,NATIONALE,56400,BRECH,,,56023,,,,,,,,,,,,,,,,,,,1990-05-03,F,,,,,55.73,NAP,N,-3.009777,47.678497,0.96,housenumber,32 Rue Nationale 56400 Brech,56023_0230_00032,G,32 RUE NATIONALE,
311033203,00044,31103320300044,O,1900-01-01,NN,,,2016-09-26T11:23:40,false,3,,5,,RUE,DE L'ESPERANCE,56400,BRECH,,,56023,,,,,,,,,,,,,,,,,,,1995-06-29,F,,,,,45.2L,NAF1993,N,-3.009499,47.679336,0.84,housenumber,5 Rue l’Esperance 56400 Brech,56023_0080_00005,G,5 RUE L ESPERANCE,
311033203,00051,31103320300051,O,2016-09-22,,,,2016-09-26T11:25:40,true,1,,13,,RUE,DE L ESPERANCE,56400,BRECH,,,56023,,,,,,,,,,,,,,,,,,,2016-09-22,A,,,,,01.49Z,NAFRev2,N,-3.010359,47.679696,0.85,housenumber,13 Rue l’Esperance 56400 Brech,56023_0080_00013,G,13 RUE L ESPERANCE,
311355481,00020,31135548100020,O,,,,,,true,1,,,,LD,ST DEGAN,56400,BRECH,,,56023,,,,,,,,,,,,,,,,,,,1987-06-30,F,,,,,55.73,NAP,N,-2.993349,47.710507,0.93,street,Chemin du Lavoir - St Degan 56400 Brech,56023_0151,G,CHEMIN DU LAVOIR  ST DEGAN,
311557102,00010,31155710200010,O,,,,,,true,1,,,,,KERGUERO,56400,BRECH,,,56023,,,,,,,,,,,,,,,,,,,1997-09-23,F,,,,,45.4F,NAF1993,N,-2.993642,47.700022,0.93,street,Impasse de Kerguero 56400 Brech,56023_0156,G,IMPASSE DE KERGUERO,
312213457,00012,31221345700012,O,1978-01-01,NN,,,2010-04-18T03:38:17,false,5,,,,,CORN ER HOUET,56400,BRECH,,,56023,,,,,,,,,,,,,,,,,,,2008-06-01,F,,,,,43.99C,NAFRev2,O,-3.028897,47.720846,0.8,street,Rte de Kerbiguet Corn Er Hoet 56400 Brech,56023_93fgdy,G,RTE DE KERBIGUET CORN ER HOET,
312213457,00038,31221345700038,O,2008-06-01,NN,,,2014-06-14T00:30:12,true,3,,,,LD,PIPARK,56400,BRECH,,,56023,,,,,,,,,,,,,,,,,,,2014-03-31,F,,,,,43.99C,NAFRev2,N,-3.005872,47.68739,0.93,street,Route de Pipark 56400 Brech,56023_0317,G,ROUTE DE PIPARK,
312771967,01459,31277196701459,O,2018-09-01,11,2020,,2022-08-29T09:14:07,false,1,,21,,RUE,DU DANEMARK BLUE BOX,56400,BRECH,,,56023,,,,,,,,,,,,,,,,,,,2018-09-01,A,,,,,69.20Z,NAFRev2,O,,,0,,,,,,
312771967,01467,31277196701467,O,2018-09-01,,,,2019-06-25T08:39:20,false,1,BLUE BOX,21,,RUE,DU DANEMARK,56400,BRECH,,,56023,,,,,,,,,,,,,,,,,,,2018-09-01,F,,,,,69.20Z,NAFRev2,O,-3.010722,47.668989,0.96,housenumber,21 Rue du Danemark 56400 Brech,56023_0039_00021,G,21 RUE DU DANEMARK,
313006819,00061,31300681900061,O,2000-10-16,NN,,,2006-11-25T09:31:30,true,3,,52,,RUE,PIERRE ALLIO,56400,BRECH,,,56023,,,,,,,,,,,,,,,,,,,2004-04-18,F,,,,,55.4B,NAFRev1,O,-2.999481,47.686385,0.96,housenumber,52 Rue Pierre Allio 56400 Brech,56023_0315_00052,G,52 RUE PIERRE ALLIO,
313077455,00043,31307745500043,O,1999-07-02,NN,,,2008-11-07T00:28:20,false,3,,8,,RUE,GEORGES CADOUDAL,56400,BRECH,,,56023,,,,,,,,,,,,,,,,,,,2004-12-01,F,BPC,,,,45.4A,NAFRev1,N,-2.995828,47.720807,0.96,housenumber,8 Rue Georges Cadoudal 56400 Brech,56023_0126_00008,G,8 RUE GEORGES CADOUDAL,
313077455,00050,31307745500050,O,2004-12-01,NN,,4399CZ,2021-01-07T08:38:23,true,11,ZA DE KERIQUELLAN - KERSTR,,,ALL,DE LA LANDE,56400,BRECH,,,56023,,,,,,,,,,,,,,,,,,,2020-12-29,F,,,,,43.99C,NAFRev2,N,-3.026871,47.688001,0.69,street,Impasse de la Lande 56400 Brech,56023_2c7vvv,G,IMPASSE DE LA LANDE,
313094013,00015,31309401300015,O,1978-01-01,NN,,,2009-06-29T03:46:14,true,3,,,,,KERBEULEC,56400,BRECH,,,56023,,,,,,,,,,,,,,,,,,,2006-12-31,F,,,,,01.2E,NAFRev1,N,-3.001925,47.692098,0.49,street,Lotissement Kerberluet 56400 Brech,56023_A063,G,LOTISSEMENT KERBERLUET,
313094062,00012,31309406200012,O,,,,,,true,1,,,,,LA VILLENEUVE,56400,BRECH,,,56023,,,,,,,,,,,,,,,,,,,1994-05-26,F,,,,,01.2A,NAF1993,N,-3.021188,47.711417,0.95,street,La Villeneuve 56400 Brech,56023_2gn8ci,G,LA VILLENEUVE,
313110447,00049,31311044700049,O,2000-07-03,NN,,,2008-11-07T00:28:22,true,3,,,,,LE GRAND HERMITE,56400,BRECH,,,56023,,,,,,,,,,,,,,,,,,,2007-09-27,F,,,,,45.3A,NAFRev1,N,-3.063391,47.73396,0.95,locality,Le Grand Hermite 56400 Brech,56023_E439,G,LE GRAND HERMITE,
313251761,00067,31325176100067,O,1997-12-15,NN,,,2016-07-08T09:18:03,false,4,SARL HOLIDAYS GITES,2,B,RUE,ALLIO,56400,BRECH,,,56023,,,,,,,,,,,,,,,,,,,2003-03-31,F,,,,,74.1J,NAFRev1,N,-2.996679,47.680203,0.95,housenumber,2b Rue Pierre Allio 56400 Brech,56023_0315_00002_b,G,2B RUE PIERRE ALLIO,
313261885,00013,31326188500013,O,,,,,,true,1,,,,RTE,DE MENDON KERSTRAND,56400,BRECH,,,56023,,,,,,,,,,,,,,,,,,,1984-12-25,F,,,,,55.71,NAP,N,-3.026054,47.691965,0.5,street,Rue de Kerstran 56400 Brech,56023_0144,G,RUE DE KERSTRAN,
313283830,00070,31328383000070,O,1991-03-01,,,,,false,3,,,,,KERVALH,56400,BRECH,,,56023,,,,,,,,,,,,,,,,,,,1995-03-01,F,,,,,55.5C,NAF1993,,-3.038481,47.702531,0.96,street,Kervalh 56400 Brech,56023_l07cah,G,KERVALH,
313626772,00047,31362677200047,O,,NN,,,,true,1,,9,,AV,DES PINS,56400,BRECH,,,56023,,,,,,,,,,,,,,,,,,,1996-10-31,F,,,,,45.3F,NAF1993,O,-3.013492,47.715262,0.82,housenumber,9 Avenue des Pins 56400 Brech,56023_0313_00009,G,9 AVENUE DES PINS,
314598335,00011,31459833500011,O,,,,,,true,1,,14,,RUE,LE HELLEC,56400,BRECH,,,56023,,,,,,,,,,,,,,,,,,,1984-12-25,F,,,,,82.05,NAP,N,-3.007122,47.679191,0.9,housenumber,14 Rue Francis le Hellec 56400 Brech,56023_0100_00014,G,14 RUE FRANCIS LE HELLEC,
315004341,00022,31500434100022,O,,NN,,,,true,1,,,,,KERNANEC,56400,BRECH,,,56023,,,,,,,,,,,,,,,,,,,1992-06-30,F,,,,,51.2E,NAF1993,N,-3.027707,47.699112,0.95,street,Kernanec 56400 Brech,56023_na864g,G,KERNANEC,
315296913,00025,31529691300025,O,1982-07-01,NN,,,2014-07-08T00:19:17,true,5,,,,,LE CRELIN,56400,BRECH,,,56023,,,,,,,,,,,,,,,,,,,2011-03-31,F,,,,,43.34Z,NAFRev2,O,-2.999199,47.687988,0.95,street,Le Crelin 56400 Brech,56023_4u8zgb,G,LE CRELIN,
315838631,00036,31583863100036,O,2008-05-08,,,,2010-05-10T08:08:21,false,2,,7,,,ROUTE DE CORN ER HOET,56400,BRECH,,,56023,,,,,,,,,,,,,,,,,,,2008-10-30,F,,,,,86.90F,NAFRev2,N,-3.009308,47.715814,0.96,housenumber,7 Route de Corn Er Hoet 56400 Brech,56023_0024_00007,G,7 ROUTE DE CORN ER HOET,
315975821,00010,31597582100010,O,1979-01-01,NN,,,2017-05-04T02:39:38,false,5,,,,RUE,PIERRE ALLIO PENHOET,56400,BRECH,,,56023,,,,,,,,,,,,,,,,,,,2016-01-15,F,,,,,47.73Z,NAFRev2,O,-2.997477,47.682068,0.7,street,Rue Pierre Allio 56400 Brech,56023_0315,G,RUE PIERRE ALLIO,
316046127,00031,31604612700031,O,2016-09-12,,,4399CZ,2021-03-31T19:35:54,true,2,,7,A,RUE,PARK PITON,56400,BRECH,,,56023,,,,,,,,,,,,,,,,,,,2021-02-28,F,,,,,43.99C,NAFRev2,N,-3.011846,47.716759,0.96,housenumber,7a Rue Park Piton 56400 Brech,56023_0275_00007_a,G,7A RUE PARK PITON,
316725423,00016,31672542300016,O,,NN,,,,true,1,,16,,RUE,DE LA PETITE VITESSE,56400,BRECH,,,56023,,,,,,,,,,,,,,,,,,,1996-03-30,F,,,,,55.4B,NAF1993,O,-2.998736,47.680865,0.95,housenumber,16 Rue de la Petite Vitesse 56400 Brech,56023_0310_00016,G,16 RUE DE LA PETITE VITESSE,
316961945,00011,31696194500011,O,,NN,,,,true,1,,1,,RUE,DU MOULIN DE TALHOED,56400,BRECH,,,56023,,,,,,,,,,,,,,,,,,,1996-09-30,F,,,,,45.2J,NAF1993,N,-2.993809,47.719554,0.84,housenumber,1 Rue Moulin de Talhoed 56400 Brech,56023_036mjp_00001,G,1 RUE MOULIN DE TALHOED,