siren,nic,siret,statutDiffusionEtablissement,dateCreationEtablissement,trancheEffectifsEtablissement,anneeEffectifsEtablissement,activitePrincipaleRegistreMetiersEtablissement,dateDernierTraitementEtablissement,etablissementSiege,nombrePeriodesEtablissement,complementAdresseEtablissement,numeroVoieEtablissement,indiceRepetitionEtablissement,typeVoieEtablissement,libelleVoieEtablissement,codePostalEtablissement,libelleCommuneEtablissement,libelleCommuneEtrangerEtablissement,distributionSpecialeEtablissement,codeCommuneEtablissement,codeCedexEtablissement,libelleCedexEtablissement,codePaysEtrangerEtablissement,libellePaysEtrangerEtablissement,complementAdresse2Etablissement,numeroVoie2Etablissement,indiceRepetition2Etablissement,typeVoie2Etablissement,libelleVoie2Etablissement,codePostal2Etablissement,libelleCommune2Etablissement,libelleCommuneEtranger2Etablissement,distributionSpeciale2Etablissement,codeCommune2Etablissement,codeCedex2Etablissement,libelleCedex2Etablissement,codePaysEtranger2Etablissement,libellePaysEtranger2Etablissement,dateDebut,etatAdministratifEtablissement,enseigne1Etablissement,enseigne2Etablissement,enseigne3Etablissement,denominationUsuelleEtablissement,activitePrincipaleEtablissement,nomenclatureActivitePrincipaleEtablissement,caractereEmployeurEtablissement,longitude,latitude,geo_score,geo_type,geo_adresse,geo_id,geo_ligne,geo_l4,geo_l5
215700071,00016,21570007100016,O,1983-03-01,01,2020,,2022-08-29T09:07:48,true,3,,,,RUE,DES PRES,57580,ADAINCOURT,,,57007,,,,,,,,,,,,,,,,,,,2008-01-01,A,MAIRIE,,,,84.11Z,NAFRev2,N,6.436415,49.006294,0.94,street,Rue des Pres 57580 Adaincourt,57007_0150,G,RUE DES PRES,
265700245,00011,26570024500011,O,1983-03-01,NN,,,2010-06-26T03:12:20,true,3,MAIRIE,,,RUE,DES PRES,57580,ADAINCOURT,,,57007,,,,,,,,,,,,,,,,,,,2008-01-01,A,CCAS,,,,88.99B,NAFRev2,N,6.436415,49.006294,0.94,street,Rue des Pres 57580 Adaincourt,57007_0150,G,RUE DES PRES,
295702351,00012,29570235100012,O,,NN,,,2006-11-25T09:10:52,true,1,,,,,,57580,ADAINCOURT,,,57007,,,,,,,,,,,,,,,,,,,1997-12-31,F,,,,,70.1C,NAF1993,N,,,0,,,,,,
305094161,00018,30509416100018,O,1900-01-01,00,2019,,2021-10-27T08:15:27,false,5,,,,RUE,PRINCIPALE,57580,ADAINCOURT,,,57007,,,,,,,,,,,,,,,,,,,2019-01-01,F,,,,,47.22Z,NAFRev2,O,6.436401,49.00481,0.94,street,Rue Principale 57580 Adaincourt,57007_0160,G,RUE PRINCIPALE,
330977372,00011,33097737200011,O,1984-08-01,NN,,,2008-01-04T20:06:26,true,3,,,,RUE,PRINCIPALE,57580,ADAINCOURT,,,57007,,,,,,,,,,,,,,,,,,,2008-01-01,A,,,,,68.20B,NAFRev2,N,6.436401,49.00481,0.94,street,Rue Principale 57580 Adaincourt,57007_0160,G,RUE PRINCIPALE,
333721785,00017,33372178500017,O,,,,,2006-11-25T10:23:52,true,1,,15,,RUE,DES PRES,57580,ADAINCOURT,,,57007,,,,,,,,,,,,,,,,,,,1989-08-20,F,,,,,96.23,NAP,N,6.43578,49.005742,0.94,housenumber,15 Rue des Pres 57580 Adaincourt,57007_0150_00015,G,15 RUE DES PRES,
333864742,00015,33386474200015,O,1985-09-01,NN,,,2013-05-24T03:50:07,true,3,,,,RUE,PRINCIPALE,57580,ADAINCOURT,,,57007,,,,,,,,,,,,,,,,,,,2008-01-01,A,,,,,68.20B,NAFRev2,N,6.436401,49.00481,0.94,street,Rue Principale 57580 Adaincourt,57007_0160,G,RUE PRINCIPALE,
348362187,00018,34836218700018,O,1988-10-10,NN,,,2020-01-28T03:36:09,true,7,,15,,RUE,DES PRES,57580,ADAINCOURT,,,57007,,,,,,,,,,,,,,,,,,,2019-01-01,F,,,,,47.52A,NAFRev2,N,6.43578,49.005742,0.94,housenumber,15 Rue des Pres 57580 Adaincourt,57007_0150_00015,G,15 RUE DES PRES,
348469859,00014,34846985900014,O,1988-10-27,NN,,,2008-01-04T22:52:20,true,3,,,,,,57580,ADAINCOURT,,,57007,,,,,,,,,,,,,,,,,,,2008-01-01,A,,,,,68.20A,NAFRev2,N,,,0,,,,,,
352162119,00015,35216211900015,O,,NN,,,,true,1,,22,,RUE,PRINCIPALE,57580,ADAINCOURT,,,57007,,,,,,,,,,,,,,,,,,,1990-03-26,F,,,,,54.04,NAP,N,6.437388,49.006057,0.94,housenumber,22 Rue Principale 57580 Adaincourt,57007_0160_00022,G,22 RUE PRINCIPALE,
360706006,00010,36070600600010,O,,,,,,true,1,,30,,,,57580,ADAINCOURT,,,57007,,,,,,,,,,,,,,,,,,,1984-12-25,F,,,,,67.04,NAP,N,,,0,,,,,,
372704452,00047,37270445200047,O,2008-10-01,,,,2021-02-23T11:06:19,true,1,,2,,RUE,DE LA CHAPELLE,57580,ADAINCOURT,,,57007,,,,,,,,,,,,,,,,,,,2008-10-01,A,,,,,01.24Z,NAFRev2,N,6.438174,49.006433,0.94,housenumber,2 Rue de la Chapelle 57580 Adaincourt,57007_0032_00002,G,2 RUE DE LA CHAPELLE,
383296803,00018,38329680300018,O,1991-10-01,,,,2006-11-25T11:40:55,true,4,,23,,RUE,PRINCIPALE,57580,ADAINCOURT,,,57007,,,,,,,,,,,,,,,,,,,2000-01-20,F,,,,,92.3A,NAF1993,N,6.436921,49.005892,0.94,housenumber,23 Rue Principale 57580 Adaincourt,57007_0160_00023,G,23 RUE PRINCIPALE,
384752549,00012,38475254900012,O,1992-01-01,NN,,,,false,4,,13,,RUE,DES PRES,57580,ADAINCOURT,,,57007,,,,,,,,,,,,,,,,,,,1998-12-31,F,,,,,52.2C,NAF1993,O,6.435739,49.005619,0.94,housenumber,13 Rue des Pres 57580 Adaincourt,57007_0150_00013,G,13 RUE DES PRES,
391568045,00010,39156804500010,O,1993-07-01,NN,,,2022-11-09T11:32:59,true,3,,1,,RUE,PRINCIPALE,57580,ADAINCOURT,,,57007,,,,,,,,,,,,,,,,,,,2008-01-01,A,,,,,68.20A,NAFRev2,N,6.436138,49.004266,0.94,housenumber,1 Rue Principale 57580 Adaincourt,57007_0160_00001,G,1 RUE PRINCIPALE,
394080352,00013,39408035200013,O,1994-04-01,NN,,,2008-01-04T17:59:31,true,3,,1,,RUE,PRINCIPALE,57580,ADAINCOURT,,,57007,,,,,,,,,,,,,,,,,,,2008-01-01,A,,,,,68.20A,NAFRev2,N,6.436138,49.004266,0.94,housenumber,1 Rue Principale 57580 Adaincourt,57007_0160_00001,G,1 RUE PRINCIPALE,
398658435,00019,39865843500019,O,1994-09-01,NN,,,2008-01-04T18:54:28,true,3,,13,,RUE,DES PRES,57580,ADAINCOURT,,,57007,,,,,,,,,,,,,,,,,,,2008-01-01,A,,,,,68.20A,NAFRev2,N,6.435739,49.005619,0.94,housenumber,13 Rue des Pres 57580 Adaincourt,57007_0150_00013,G,13 RUE DES PRES,
399736768,00017,39973676800017,O,1995-02-01,NN,,,2008-01-04T19:15:15,true,3,,1,,RUE,PRINCIPALE,57580,ADAINCOURT,,,57007,,,,,,,,,,,,,,,,,,,2008-01-01,A,,,,,68.20A,NAFRev2,N,6.436138,49.004266,0.94,housenumber,1 Rue Principale 57580 Adaincourt,57007_0160_00001,G,1 RUE PRINCIPALE,
399853647,00010,39985364700010,O,1995-01-30,NN,,,2006-10-28T02:45:53,true,3,,,,,,57580,ADAINCOURT,,,57007,,,,,,,,,,,,,,,,,,,2005-01-30,F,,,,,70.2B,NAFRev1,N,,,0,,,,,,
403433931,00017,40343393100017,O,1995-11-30,NN,,,2022-03-02T04:29:29,false,4,MR NICOLAS,2,,RUE,DE LA CHAPELLE,57580,ADAINCOURT,,,57007,,,,,,,,,,,,,,,,,,,2022-02-01,F,,,,,68.20A,NAFRev2,N,6.438174,49.006433,0.94,housenumber,2 Rue de la Chapelle 57580 Adaincourt,57007_0032_00002,G,2 RUE DE LA CHAPELLE,
403547979,00019,40354797900019,O,1996-02-01,NN,,4399CZ,2015-06-12T11:10:36,true,3,,1,,RUE,PRINCIPALE,57580,ADAINCOURT,,,57007,,,,,,,,,,,,,,,,,,,2008-01-01,A,,,,,43.99C,NAFRev2,O,6.436138,49.004266,0.94,housenumber,1 Rue Principale 57580 Adaincourt,57007_0160_00001,G,1 RUE PRINCIPALE,
404436511,00012,40443651100012,O,1996-02-23,NN,,,2008-01-05T20:21:19,true,3,MONSIEUR NICOLAS PHILIPPE,6,,RTE,DE VITTONCOURT,57580,ADAINCOURT,,,57007,,,,,,,,,,,,,,,,,,,2008-01-01,A,,,,,68.20B,NAFRev2,N,6.437698,49.00752,0.81,housenumber,6 Rue de Vittoncourt 57580 Adaincourt,57007_0220_00006,G,6 RUE DE VITTONCOURT,
408591360,00016,40859136000016,O,1996-07-12,NN,,,2014-04-08T15:15:26,false,4,MR NICOLAS DANIEL,4,,RUE,DE VITTONCOURT,57580,ADAINCOURT,,,57007,,,,,,,,,,,,,,,,,,,2013-12-25,F,,,,,68.20A,NAFRev2,N,6.437658,49.00704,0.94,housenumber,4 Rue de Vittoncourt 57580 Adaincourt,57007_0220_00004,G,4 RUE DE VITTONCOURT,
408925469,00012,40892546900012,O,1980-01-01,NN,,,2016-08-31T07:51:17,true,5,,21,,RUE,PRINCIPALE,57580,ADAINCOURT,,,57007,,,,,,,,,,,,,,,,,,,2016-08-31,F,,,,,01.11Z,NAFRev2,N,6.436812,49.005815,0.94,housenumber,21 Rue Principale 57580 Adaincourt,57007_0160_00021,G,21 RUE PRINCIPALE,
410399257,00014,41039925700014,O,1974-11-01,NN,,,2021-02-23T11:32:34,true,3,,1,,RUE,PRINCIPALE,57580,ADAINCOURT,,,57007,,,,,,,,,,,,,,,,,,,2008-01-01,A,,,,,01.11Z,NAFRev2,N,6.436138,49.004266,0.94,housenumber,1 Rue Principale 57580 Adaincourt,57007_0160_00001,G,1 RUE PRINCIPALE,
410399265,00017,41039926500017,O,1980-01-01,NN,,,,true,4,,24,,RUE,PRINCIPALE,57580,ADAINCOURT,,,57007,,,,,,,,,,,,,,,,,,,2003-04-25,F,,,,,01.1A,NAFRev1,N,6.436401,49.00481,0.8,street,Rue Principale 57580 Adaincourt,57007_0160,G,RUE PRINCIPALE,
410445415,00012,41044541500012,O,1996-11-06,NN,,,2022-02-01T04:00:28,true,4,,6,,RTE,DE VITTONCOURT,57580,ADAINCOURT,,,57007,,,,,,,,,,,,,,,,,,,2008-01-01,A,,,,,68.20A,NAFRev2,O,6.437698,49.00752,0.81,housenumber,6 Rue de Vittoncourt 57580 Adaincourt,57007_0220_00006,G,6 RUE DE VITTONCOURT,
418653473,00011,41865347300011,O,1998-04-21,NN,,,2008-01-04T23:24:30,true,3,MR.SURLUTTE PIERRE,1,,RUE,PRINCIPALE,57580,ADAINCOURT,,,57007,,,,,,,,,,,,,,,,,,,2008-01-01,A,,,,,68.20A,NAFRev2,N,6.436138,49.004266,0.94,housenumber,1 Rue Principale 57580 Adaincourt,57007_0160_00001,G,1 RUE PRINCIPALE,
421617481,00013,42161748100013,O,1999-01-04,NN,,,2008-01-05T00:09:45,true,3,MR NICOLAS PHILIPPE,6,,RTE,DE VITTONCOURT,57580,ADAINCOURT,,,57007,,,,,,,,,,,,,,,,,,,2008-01-01,A,,,,,68.20A,NAFRev2,N,6.437698,49.00752,0.81,housenumber,6 Rue de Vittoncourt 57580 Adaincourt,57007_0220_00006,G,6 RUE DE VITTONCOURT,
423543495,00018,42354349500018,O,1988-10-09,NN,,,2008-01-05T00:38:47,true,3,,15,,RUE,DES PRES,57580,ADAINCOURT,,,57007,,,,,,,,,,,,,,,,,,,2008-01-01,A,,,,,01.43Z,NAFRev2,N,6.43578,49.005742,0.94,housenumber,15 Rue des Pres 57580 Adaincourt,57007_0150_00015,G,15 RUE DES PRES,
428087100,00056,42808710000056,O,2016-05-01,,,,2018-05-24T08:38:03,true,2,,3,,RUE,DE LA CHAPELLE,57580,ADAINCOURT,,,57007,,,,,,,,,,,,,,,,,,,2018-04-30,F,,,,,70.22Z,NAFRev2,N,6.439609,49.007022,0.94,housenumber,3 Rue de la Chapelle 57580 Adaincourt,57007_0032_00003,G,3 RUE DE LA CHAPELLE,
429970452,00018,42997045200018,O,2000-03-07,NN,,,2008-01-05T01:46:24,true,3,MR NICOLAS PHILIPPE,6,,RTE,VITTONCOURT,57580,ADAINCOURT,,,57007,,,,,,,,,,,,,,,,,,,2008-01-01,A,,,,,68.20A,NAFRev2,N,6.437698,49.00752,0.78,housenumber,6 Rue de Vittoncourt 57580 Adaincourt,57007_0220_00006,G,6 RUE DE VITTONCOURT,
433226891,00011,43322689100011,O,2000-10-23,NN,,,2010-04-18T08:51:05,false,5,,5,,RUE,DE VITTONCOURT,57580,ADAINCOURT,,,57007,,,,,,,,,,,,,,,,,,,2008-03-01,F,,,,,43.39Z,NAFRev2,O,6.437584,49.007485,0.94,housenumber,5 Rue de Vittoncourt 57580 Adaincourt,57007_0220_00005,G,5 RUE DE VITTONCOURT,
439208968,00016,43920896800016,O,2001-07-20,NN,,,2018-06-01T09:39:12,true,4,MR PREVOT GASTON,21,,RUE,PRINCIPALE,57580,ADAINCOURT,,,57007,,,,,,,,,,,,,,,,,,,2009-02-03,F,,,,,68.20A,NAFRev2,N,6.436812,49.005815,0.94,housenumber,21 Rue Principale 57580 Adaincourt,57007_0160_00021,G,21 RUE PRINCIPALE,
439776790,00016,43977679000016,O,2001-10-22,NN,,,2008-01-04T20:42:24,true,4,MR NICOLAS DANIEL,4,,RUE,DE VITTONCOURT,57580,ADAINCOURT,,,57007,,,,,,,,,,,,,,,,,,,2008-01-01,A,,,,,68.20A,NAFRev2,N,6.437658,49.00704,0.94,housenumber,4 Rue de Vittoncourt 57580 Adaincourt,57007_0220_00004,G,4 RUE DE VITTONCOURT,
442008983,00011,44200898300011,O,1981-01-01,NN,,,2013-02-09T12:43:55,true,4,,9,,RUE,DES PRES,57580,ADAINCOURT,,,57007,,,,,,,,,,,,,,,,,,,2010-07-26,F,,,,,01.11Z,NAFRev2,N,6.435671,49.005422,0.94,housenumber,9 Rue des Pres 57580 Adaincourt,57007_0150_00009,G,9 RUE DES PRES,
442553392,00014,44255339200014,O,2002-04-19,NN,,,2008-01-04T21:44:41,true,3,MR NICOLAS JEAN MARIE,2,,RUE,DE LA CHAPELLE,57580,ADAINCOURT,,,57007,,,,,,,,,,,,,,,,,,,2008-01-01,A,,,,,68.20A,NAFRev2,N,6.438174,49.006433,0.94,housenumber,2 Rue de la Chapelle 57580 Adaincourt,57007_0032_00002,G,2 RUE DE LA CHAPELLE,
443263181,00010,44326318100010,O,2002-09-01,NN,,,2017-10-20T03:36:05,true,3,MR SURLUTE PIERRE,1,,RUE,PRINCIPALE,57580,ADAINCOURT,,,57007,,,,,,,,,,,,,,,,,,,2008-01-01,A,,,,,68.20A,NAFRev2,N,6.436138,49.004266,0.94,housenumber,1 Rue Principale 57580 Adaincourt,57007_0160_00001,G,1 RUE PRINCIPALE,
478727621,00011,47872762100011,O,2004-07-31,NN,,,2008-01-05T03:48:07,true,3,,6,,RUE,DE VITTONCOURT,57580,ADAINCOURT,,,57007,,,,,,,,,,,,,,,,,,,2008-01-01,A,,,,,68.20A,NAFRev2,N,6.437698,49.00752,0.94,housenumber,6 Rue de Vittoncourt 57580 Adaincourt,57007_0220_00006,G,6 RUE DE VITTONCOURT,
483083655,00025,48308365500025,O,2013-05-20,,,,2019-09-12T03:58:30,true,2,,3,,RUE,DES PRES,57580,ADAINCOURT,,,57007,,,,,,,,,,,,,,,,,,,2019-09-11,F,,,,,93.29Z,NAFRev2,N,6.435997,49.005342,0.94,housenumber,3 Rue des Pres 57580 Adaincourt,57007_0150_00003,G,3 RUE DES PRES,
487699415,00013,48769941500013,O,2005-12-01,,,,2012-11-30T19:39:46,true,3,,2,,RUE,DE LA CHAPELLE,57580,ADAINCOURT,,,57007,,,,,,,,,,,,,,,,,,,2012-10-31,F,,,,,68.10Z,NAFRev2,N,6.438174,49.006433,0.94,housenumber,2 Rue de la Chapelle 57580 Adaincourt,57007_0032_00002,G,2 RUE DE LA CHAPELLE,
494137763,00012,49413776300012,O,2006-11-29,,,,2012-07-02T15:30:49,true,2,,4,,RUE,VITTONCOURT,57580,ADAINCOURT,,,57007,,,,,,,,,,,,,,,,,,,2008-01-01,A,,,,,68.20B,NAFRev2,N,6.437658,49.00704,0.93,housenumber,4 Rue de Vittoncourt 57580 Adaincourt,57007_0220_00004,G,4 RUE DE VITTONCOURT,
494387004,00034,49438700400034,O,2020-10-01,,,,2022-10-24T19:37:00,true,1,,18,,RUE,PRINCIPALE,57580,ADAINCOURT,,,57007,,,,,,,,,,,,,,,,,,,2020-10-01,A,,,,,43.22A,NAFRev2,N,6.437011,49.005549,0.94,housenumber,18 Rue Principale 57580 Adaincourt,57007_0160_00018,G,18 RUE PRINCIPALE,
499372621,00015,49937262100015,O,2007-04-16,,,,2008-11-28T05:14:09,true,3,,2,,RUE,PRINCIPALE,57580,ADAINCOURT,,,57007,,,,,,,,,,,,,,,,,,,2008-11-03,F,,,,,68.10Z,NAFRev2,N,6.43624,49.00403,0.94,housenumber,2 Rue Principale 57580 Adaincourt,57007_0160_00002,G,2 RUE PRINCIPALE,
507919868,00012,50791986800012,O,2008-10-01,NN,,,2018-09-29T12:15:51,false,4,,3,,RUE,DE LA CHAPELLE,57580,ADAINCOURT,,,57007,,,,,,,,,,,,,,,,,,,2016-12-27,F,,,,,43.33Z,NAFRev2,O,6.439609,49.007022,0.94,housenumber,3 Rue de la Chapelle 57580 Adaincourt,57007_0032_00003,G,3 RUE DE LA CHAPELLE,
517551107,00017,51755110700017,O,2009-09-30,,,,2010-08-25T09:26:14,true,1,,3,,RUE,DE LA CHAPELLE,57580,ADAINCOURT,,,57007,,,,,,,,,,,,,,,,,,,2009-09-30,F,,,,,70.10Z,NAFRev2,N,6.439609,49.007022,0.94,housenumber,3 Rue de la Chapelle 57580 Adaincourt,57007_0032_00003,G,3 RUE DE LA CHAPELLE,
520610817,00014,52061081700014,O,2005-11-08,,,,2010-03-02T05:59:56,true,1,,,,,EN BANSTA,57580,ADAINCOURT,,,57007,,,,,,,,,,,,,,,,,,,2005-11-08,A,,,,,01.49Z,NAFRev2,N,,,0,,,,,,
520695271,00012,52069527100012,O,2010-02-16,,,,2010-03-03T16:32:07,true,1,,2,,RUE,PRINCIPALE,57580,ADAINCOURT,,,57007,,,,,,,,,,,,,,,,,,,2010-02-16,A,,,,,41.10D,NAFRev2,N,6.43624,49.00403,0.94,housenumber,2 Rue Principale 57580 Adaincourt,57007_0160_00002,G,2 RUE PRINCIPALE,
523064855,00019,52306485500019,O,2010-04-09,,,,2010-06-11T13:38:43,true,1,,6,,RTE,DE VITTONCOURT,57580,ADAINCOURT,,,57007,,,,,,,,,,,,,,,,,,,2010-04-09,A,,,,,68.20B,NAFRev2,N,6.437698,49.00752,0.81,housenumber,6 Rue de Vittoncourt 57580 Adaincourt,57007_0220_00006,G,6 RUE DE VITTONCOURT,
523597623,00025,52359762300025,O,2014-02-01,,,,2015-08-20T08:32:00,true,2,,6,,RTE,DE VITTONCOURT,57580,ADAINCOURT,,,57007,,,,,,,,,,,,,,,,,,,2015-02-28,F,,,,,68.31Z,NAFRev2,N,6.437698,49.00752,0.81,housenumber,6 Rue de Vittoncourt 57580 Adaincourt,57007_0220_00006,G,6 RUE DE VITTONCOURT,
528615917,00010,52861591700010,O,2010-10-29,,,,2013-12-20T17:05:34,false,2,,15,B,RUE,DES PRES,57580,ADAINCOURT,,,57007,,,,,,,,,,,,,,,,,,,2011-12-01,F,,,,,86.90D,NAFRev2,N,6.435812,49.005826,0.83,housenumber,15bis Rue des Pres 57580 Adaincourt,57007_0150_00015_bis,G,15BIS RUE DES PRES,
530646876,00017,53064687600017,O,2011-02-21,,,,2012-11-10T02:58:22,true,2,,1,,IMP,DE LA FENOTTE,57580,ADAINCOURT,,,57007,,,,,,,,,,,,,,,,,,,2012-04-10,F,,,,,70.22Z,NAFRev2,N,6.437812,49.008846,0.84,housenumber,1 Impasse de la Fenotte 57580 Adaincourt,57007_vxsufn_00001,G,1 IMPASSE DE LA FENOTTE,
532776788,00012,53277678800012,O,2010-07-27,,,,2011-06-08T11:10:13,true,1,,9,,RUE,DES PRES,57580,ADAINCOURT,,,57007,,,,,,,,,,,,,,,,,,,2010-07-27,A,,,,,01.11Z,NAFRev2,N,6.435671,49.005422,0.94,housenumber,9 Rue des Pres 57580 Adaincourt,57007_0150_00009,G,9 RUE DES PRES,
533902458,00017,53390245800017,O,2011-05-30,,,,2013-10-31T04:08:20,true,1,,6,,RTE,DE VITTONCOURT,57580,ADAINCOURT,,,57007,,,,,,,,,,,,,,,,,,,2011-05-30,A,,,,,68.20B,NAFRev2,N,6.437698,49.00752,0.81,housenumber,6 Rue de Vittoncourt 57580 Adaincourt,57007_0220_00006,G,6 RUE DE VITTONCOURT,
752266866,00017,75226686600017,O,2012-07-09,,,1413ZB,2015-03-18T01:36:42,true,2,,13,,RUE,PRINCIPALE,57580,ADAINCOURT,,,57007,,,,,,,,,,,,,,,,,,,2014-04-14,F,,,,,14.13Z,NAFRev2,N,6.436325,49.004934,0.94,housenumber,13 Rue Principale 57580 Adaincourt,57007_0160_00013,G,13 RUE PRINCIPALE,
792129538,00015,79212953800015,O,2013-03-20,,,,2022-03-02T04:29:29,false,2,,2,,RUE,DE LA CHAPELLE,57580,ADAINCOURT,,,57007,,,,,,,,,,,,,,,,,,,2022-02-01,F,,,,,64.30Z,NAFRev2,N,6.438174,49.006433,0.94,housenumber,2 Rue de la Chapelle 57580 Adaincourt,57007_0032_00002,G,2 RUE DE LA CHAPELLE,
792808404,00018,79280840400018,O,2013-04-12,,,,2022-03-02T04:29:28,false,2,,2,,RUE,DE LA CHAPELLE,57580,ADAINCOURT,,,57007,,,,,,,,,,,,,,,,,,,2022-02-01,F,,,,,68.20B,NAFRev2,N,6.438174,49.006433,0.94,housenumber,2 Rue de la Chapelle 57580 Adaincourt,57007_0032_00002,G,2 RUE DE LA CHAPELLE,
792808453,00015,79280845300015,O,2013-04-12,,,,2022-03-02T04:29:28,false,2,,2,,RUE,DE LA CHAPELLE,57580,ADAINCOURT,,,57007,,,,,,,,,,,,,,,,,,,2022-02-01,F,,,,,68.20B,NAFRev2,N,6.438174,49.006433,0.94,housenumber,2 Rue de la Chapelle 57580 Adaincourt,57007_0032_00002,G,2 RUE DE LA CHAPELLE,
794277855,00019,79427785500019,O,2013-07-20,,,,2014-05-21T11:19:42,false,2,,15,B,RUE,DES PRES,57580,ADAINCOURT,,,57007,,,,,,,,,,,,,,,,,,,2014-03-01,F,,,,,56.21Z,NAFRev2,N,6.435812,49.005826,0.83,housenumber,15bis Rue des Pres 57580 Adaincourt,57007_0150_00015_bis,G,15BIS RUE DES PRES,
798590097,00019,79859009700019,O,2013-10-30,,,,2022-03-02T04:29:28,false,2,,2,,RUE,DE LA CHAPELLE,57580,ADAINCOURT,,,57007,,,,,,,,,,,,,,,,,,,2022-02-01,F,,,,,68.20B,NAFRev2,N,6.438174,49.006433,0.94,housenumber,2 Rue de la Chapelle 57580 Adaincourt,57007_0032_00002,G,2 RUE DE LA CHAPELLE,
801509852,00019,80150985200019,O,2014-04-01,NN,,,2018-09-29T13:40:01,false,3,,15,B,RUE,DES PRES,57580,ADAINCOURT,,,57007,,,,,,,,,,,,,,,,,,,2017-01-01,F,,,,,43.99C,NAFRev2,O,6.435812,49.005826,0.83,housenumber,15bis Rue des Pres 57580 Adaincourt,57007_0150_00015_bis,G,15BIS RUE DES PRES,
802786533,00017,80278653300017,O,2014-06-02,,,,2014-06-11T08:31:27,true,1,,3,,RUE,DE LA CHAPELLE,57580,ADAINCOURT,,,57007,,,,,,,,,,,,,,,,,,,2014-06-02,A,,,,,68.20B,NAFRev2,N,6.439609,49.007022,0.94,housenumber,3 Rue de la Chapelle 57580 Adaincourt,57007_0032_00003,G,3 RUE DE LA CHAPELLE,
813200961,00015,81320096100015,O,2015-08-07,,,,2022-03-02T04:29:29,false,2,,2,,RUE,DE LA CHAPELLE,57580,ADAINCOURT,,,57007,,,,,,,,,,,,,,,,,,,2022-02-01,F,,,,,68.20B,NAFRev2,N,6.438174,49.006433,0.94,housenumber,2 Rue de la Chapelle 57580 Adaincourt,57007_0032_00002,G,2 RUE DE LA CHAPELLE,
820722981,00017,82072298100017,O,2016-05-04,,,,2018-12-24T08:34:02,true,2,,27,,RUE,DES PRES,57580,ADAINCOURT,,,57007,,,,,,,,,,,,,,,,,,,2018-09-04,F,,,,,86.90D,NAFRev2,N,6.436813,49.006648,0.94,housenumber,27 Rue des Pres 57580 Adaincourt,57007_0150_00027,G,27 RUE DES PRES,
822240057,00015,82224005700015,O,2016-09-01,,,,2016-08-31T07:51:17,true,1,,21,,RUE,PRINCIPALE,57580,ADAINCOURT,,,57007,,,,,,,,,,,,,,,,,,,2016-09-01,A,,,,,01.50Z,NAFRev2,N,6.436812,49.005815,0.94,housenumber,21 Rue Principale 57580 Adaincourt,57007_0160_00021,G,21 RUE PRINCIPALE,
822240057,00023,82224005700023,O,2022-06-20,,,,2022-09-22T15:43:51,false,1,,17,,RUE,PRINCIPALE,57580,ADAINCOURT,,,57007,,,,,,,,,,,,,,,,,,,2022-06-20,A,,,,,35.11Z,NAFRev2,N,6.43625,49.005458,0.94,housenumber,17 Rue Principale 57580 Adaincourt,57007_0160_00017,G,17 RUE PRINCIPALE,
831255013,00011,83125501300011,O,2017-07-17,,,,2017-08-02T04:28:00,true,1,,2,,RUE,PRINCIPALE,57580,ADAINCOURT,,,57007,,,,,,,,,,,,,,,,,,,2017-07-17,A,,,,,68.20B,NAFRev2,N,6.43624,49.00403,0.94,housenumber,2 Rue Principale 57580 Adaincourt,57007_0160_00002,G,2 RUE PRINCIPALE,
833691165,00017,83369116500017,O,2017-11-21,,,,2018-03-09T04:22:19,true,1,,4,,RTE,DE VITTONCOURT,57580,ADAINCOURT,,,57007,,,,,,,,,,,,,,,,,,,2017-11-21,A,,,,,64.20Z,NAFRev2,N,6.437658,49.00704,0.81,housenumber,4 Rue de Vittoncourt 57580 Adaincourt,57007_0220_00004,G,4 RUE DE VITTONCOURT,
834714073,00014,83471407300014,O,2015-06-15,,,,2018-01-18T13:46:48,true,1,MAIRIE,,,,,57580,ADAINCOURT,,,57007,,,,,,,,,,,,,,,,,,,2015-06-15,A,,,,,94.99Z,NAFRev2,N,6.435123,49.006483,0.9,street,Impasse de la Mairie 57580 Adaincourt,57007_0125,D,IMPASSE DE LA MAIRIE,
838762011,00016,83876201100016,O,2018-04-14,,,,2022-11-18T19:35:47,true,2,,25,,RUE,DES PRES,57580,ADAINCOURT,,,57007,,,,,,,,,,,,,,,,,,,2022-11-14,F,,,,,56.21Z,NAFRev2,N,6.435802,49.006708,0.94,housenumber,25 Rue des Pres 57580 Adaincourt,57007_0150_00025,G,25 RUE DES PRES,
840125173,00012,84012517300012,O,2018-05-01,,,,2018-06-06T08:37:53,true,1,,17,,RUE,PRINCIPALE,57580,ADAINCOURT,,,57007,,,,,,,,,,,,,,,,,,,2018-05-01,A,,,,,47.99A,NAFRev2,N,6.43625,49.005458,0.94,housenumber,17 Rue Principale 57580 Adaincourt,57007_0160_00017,G,17 RUE PRINCIPALE,
843114224,00010,84311422400010,O,2018-10-01,,,,2020-01-21T08:41:19,true,1,,3,,RUE,DE LA CHAPELLE,57580,ADAINCOURT,,,57007,,,,,,,,,,,,,,,,,,,2018-10-01,A,COEPTO,,,COEPTO,70.22Z,NAFRev2,N,6.439609,49.007022,0.94,housenumber,3 Rue de la Chapelle 57580 Adaincourt,57007_0032_00003,G,3 RUE DE LA CHAPELLE,
889728374,00014,88972837400014,O,2020-09-14,,,,2020-10-08T04:01:13,true,1,,11,,RUE,DES PRES,57580,ADAINCOURT,,,57007,,,,,,,,,,,,,,,,,,,2020-09-14,A,,,,,68.20B,NAFRev2,N,6.435702,49.005516,0.94,housenumber,11 Rue des Pres 57580 Adaincourt,57007_0150_00011,G,11 RUE DES PRES,
899133029,00012,89913302900012,O,2021-05-03,,,,2022-01-13T10:10:28,true,1,,10,,RUE,DE LA CHAPELLE,57580,ADAINCOURT,,,57007,,,,,,,,,,,,,,,,,,,2021-05-03,A,,,,,68.20B,NAFRev2,N,6.440631,49.007308,0.94,housenumber,10 Rue de la Chapelle 57580 Adaincourt,57007_0032_00010,G,10 RUE DE LA CHAPELLE,
901998880,00016,90199888000016,O,2021-07-15,,,4332AA,2021-11-16T11:35:28,true,2,,17,,RUE,DES PRES,57580,ADAINCOURT,,,57007,,,,,,,,,,,,,,,,,,,2021-10-01,A,,,,,43.32A,NAFRev2,O,6.435816,49.005866,0.94,housenumber,17 Rue des Pres 57580 Adaincourt,57007_0150_00017,G,17 RUE DES PRES,
909182719,00015,90918271900015,O,2022-01-04,,,,2022-01-14T13:43:21,true,1,,10,,RUE,DE LA CHAPELLE,57580,ADAINCOURT,,,57007,,,,,,,,,,,,,,,,,,,2022-01-04,A,,,,,68.20B,NAFRev2,N,6.440631,49.007308,0.94,housenumber,10 Rue de la Chapelle 57580 Adaincourt,57007_0032_00010,G,10 RUE DE LA CHAPELLE,
918485459,00013,91848545900013,O,2022-05-01,,,,2022-08-20T03:57:11,true,1,,9,,R,DE LA CHAPELLE,57580,ADAINCOURT,,,57007,,,,,,,,,,,,,,,,,,,2022-05-01,A,,,,,01.49Z,NAFRev2,N,6.440535,49.007349,0.75,housenumber,9 Rue de la Chapelle 57580 Adaincourt,57007_0032_00009,G,9 RUE DE LA CHAPELLE,
919287417,00019,91928741700019,O,2022-09-08,,,,2022-09-26T09:00:16,true,1,,3,,R,DE LA CHAPELLE,57580,ADAINCOURT,,,57007,,,,,,,,,,,,,,,,,,,2022-09-08,A,,,,,68.20B,NAFRev2,N,6.439609,49.007022,0.75,housenumber,3 Rue de la Chapelle 57580 Adaincourt,57007_0032_00003,G,3 RUE DE LA CHAPELLE,
