siren,nic,siret,statutDiffusionEtablissement,dateCreationEtablissement,trancheEffectifsEtablissement,anneeEffectifsEtablissement,activitePrincipaleRegistreMetiersEtablissement,dateDernierTraitementEtablissement,etablissementSiege,nombrePeriodesEtablissement,complementAdresseEtablissement,numeroVoieEtablissement,indiceRepetitionEtablissement,typeVoieEtablissement,libelleVoieEtablissement,codePostalEtablissement,libelleCommuneEtablissement,libelleCommuneEtrangerEtablissement,distributionSpecialeEtablissement,codeCommuneEtablissement,codeCedexEtablissement,libelleCedexEtablissement,codePaysEtrangerEtablissement,libellePaysEtrangerEtablissement,complementAdresse2Etablissement,numeroVoie2Etablissement,indiceRepetition2Etablissement,typeVoie2Etablissement,libelleVoie2Etablissement,codePostal2Etablissement,libelleCommune2Etablissement,libelleCommuneEtranger2Etablissement,distributionSpeciale2Etablissement,codeCommune2Etablissement,codeCedex2Etablissement,libelleCedex2Etablissement,codePaysEtranger2Etablissement,libellePaysEtranger2Etablissement,dateDebut,etatAdministratifEtablissement,enseigne1Etablissement,enseigne2Etablissement,enseigne3Etablissement,denominationUsuelleEtablissement,activitePrincipaleEtablissement,nomenclatureActivitePrincipaleEtablissement,caractereEmployeurEtablissement,longitude,latitude,geo_score,geo_type,geo_adresse,geo_id,geo_ligne,geo_l4,geo_l5
185704186,00013,18570418600013,O,1986-03-19,,,,2019-11-14T14:00:46,true,3,,,,,,57340,VILLERS-SUR-NIED,,,57719,,,,,,,,,,,,,,,,,,,2008-01-01,A,,,,,94.91Z,NAFRev2,N,,,0,,,,,,
215707191,00015,21570719100015,O,1983-03-01,01,2019,,2021-10-27T08:09:07,true,4,,,,,,57340,VILLERS-SUR-NIED,,,57719,,,,,,,,,,,,,,,,,,,2008-01-01,A,MAIRIE,,,,84.11Z,NAFRev2,O,,,0,,,,,,
318432531,00016,31843253100016,O,,NN,,,2019-11-14T14:00:46,true,1,,,,,,57340,VILLERS-SUR-NIED,,,57719,,,,,,,,,,,,,,,,,,,1990-12-31,F,,,,,64.43,NAP,N,,,0,,,,,,
326258118,00016,32625811800016,O,1983-02-01,00,2020,,2022-08-29T09:19:13,true,4,,8,,RUE,PRINCIPALE,57340,VILLERS-SUR-NIED,,,57719,,,,,,,,,,,,,,,,,,,2021-12-20,A,,,,,01.50Z,NAFRev2,N,6.534889,48.921627,0.94,housenumber,8 Rue Principale 57340 Villers-sur-Nied,57719_0001_00008,G,8 RUE PRINCIPALE,
349751560,00013,34975156000013,O,1989-01-10,01,2020,,2022-08-29T09:31:32,true,4,,37,,RUE,PRINCIPALE,57340,VILLERS-SUR-NIED,,,57719,,,,,,,,,,,,,,,,,,,2012-12-31,A,,,,,01.50Z,NAFRev2,O,6.53642,48.921634,0.8,street,Rue Principale 57340 Villers-sur-Nied,57719_0001,G,RUE PRINCIPALE,
368703468,00018,36870346800018,O,,NN,,,2019-11-14T14:00:46,true,1,,,,,,57340,VILLERS-SUR-NIED,,,57719,,,,,,,,,,,,,,,,,,,1997-03-31,F,,,,,55.3A,NAF1993,O,,,0,,,,,,
383688074,00012,38368807400012,O,1991-01-01,NN,,,2019-11-14T14:00:46,true,3,,24,,RUE,PRINCIPALE,57340,VILLERS-SUR-NIED,,,57719,,,,,,,,,,,,,,,,,,,2004-11-15,F,,,,,52.6G,NAFRev1,N,6.536596,48.921749,0.94,housenumber,24 Rue Principale 57340 Villers-sur-Nied,57719_0001_00024,G,24 RUE PRINCIPALE,
395011232,00018,39501123200018,O,1994-05-11,NN,,,2019-11-14T14:00:46,true,1,,36,,RUE,RPINCIPALE,57340,VILLERS-SUR-NIED,,,57719,,,,,,,,,,,,,,,,,,,2001-12-31,F,,,,,70.2B,NAF1993,N,6.53713,48.921322,0.74,housenumber,36 Rue Principale 57340 Villers-sur-Nied,57719_0001_00036,G,36 RUE PRINCIPALE,
405407669,00010,40540766900010,O,1996-05-01,01,2020,,2022-08-29T09:25:23,true,4,,36,,RUE,PRINCIPALE,57340,VILLERS-SUR-NIED,,,57719,,,,,,,,,,,,,,,,,,,2014-12-31,A,,,,,01.41Z,NAFRev2,O,6.53713,48.921322,0.94,housenumber,36 Rue Principale 57340 Villers-sur-Nied,57719_0001_00036,G,36 RUE PRINCIPALE,
410652952,00012,41065295200012,O,1997-01-01,NN,,,2019-11-14T14:00:46,true,1,,36,,RUE,PRINCIPALE,57340,VILLERS-SUR-NIED,,,57719,,,,,,,,,,,,,,,,,,,2001-12-31,F,,,,,70.2B,NAF1993,N,6.53713,48.921322,0.94,housenumber,36 Rue Principale 57340 Villers-sur-Nied,57719_0001_00036,G,36 RUE PRINCIPALE,
411992803,00014,41199280300014,O,1997-04-01,NN,,,2019-11-14T14:00:46,true,3,,2,,RUE,PRINCIPALE,57340,VILLERS-SUR-NIED,,,57719,,,,,,,,,,,,,,,,,,,2007-12-31,F,,,,,55.3A,NAFRev1,O,6.536405,48.921632,0.94,housenumber,2 Rue Principale 57340 Villers-sur-Nied,57719_0001_00002,G,2 RUE PRINCIPALE,
481662930,00017,48166293000017,O,2005-03-01,01,2020,4520AA,2022-08-29T09:15:08,true,2,,16,,RUE,PRINCIPALE,57340,VILLERS-SUR-NIED,,,57719,,,,,,,,,,,,,,,,,,,2008-01-01,A,,,,,45.20A,NAFRev2,O,6.53642,48.921634,0.8,street,Rue Principale 57340 Villers-sur-Nied,57719_0001,G,RUE PRINCIPALE,
502000383,00013,50200038300013,O,2008-01-01,,,,2019-11-14T14:00:46,true,1,,19,,RUE,PRINCIPALE,57340,VILLERS-SUR-NIED,,,57719,,,,,,,,,,,,,,,,,,,2008-01-01,A,,,,,53.20Z,NAFRev2,N,6.535759,48.922031,0.94,housenumber,19 Rue Principale 57340 Villers-sur-Nied,57719_0001_00019,G,19 RUE PRINCIPALE,
511398422,00010,51139842200010,O,2009-04-01,,,,2019-11-14T14:00:46,true,1,,32,,RUE,PRINCIPALE,57340,VILLERS-SUR-NIED,,,57719,,,,,,,,,,,,,,,,,,,2009-04-01,A,,,,,47.99A,NAFRev2,N,6.537856,48.921526,0.94,housenumber,32 Rue Principale 57340 Villers-sur-Nied,57719_0001_00032,G,32 RUE PRINCIPALE,
533010039,00014,53301003900014,O,2011-06-16,,,4334ZC,2020-03-16T19:33:57,true,1,,31,,RUE,PRINCIPALE,57340,VILLERS-SUR-NIED,,,57719,,,,,,,,,,,,,,,,,,,2011-06-16,F,,,,,43.34Z,NAFRev2,N,6.53795,48.921633,0.94,housenumber,31 Rue Principale 57340 Villers-sur-Nied,57719_0001_00031,G,31 RUE PRINCIPALE,
539007245,00019,53900724500019,O,2011-05-05,,,,2019-11-14T14:00:46,true,1,,2,,RUE,PRINCIPALE,57340,VILLERS-SUR-NIED,,,57719,,,,,,,,,,,,,,,,,,,2011-05-05,A,,,,,47.99A,NAFRev2,N,6.536405,48.921632,0.94,housenumber,2 Rue Principale 57340 Villers-sur-Nied,57719_0001_00002,G,2 RUE PRINCIPALE,
751021965,00015,75102196500015,O,2012-04-18,,,,2019-11-14T14:00:46,true,2,,30,,RUE,PRINCIPALE,57340,VILLERS-SUR-NIED,,,57719,,,,,,,,,,,,,,,,,,,2013-02-14,F,,,,BF BATIMENT ET RENOVATION,43.99C,NAFRev2,N,6.537814,48.921655,0.94,housenumber,30 Rue Principale 57340 Villers-sur-Nied,57719_0001_00030,G,30 RUE PRINCIPALE,
780047064,00016,78004706400016,O,,NN,,,2019-11-14T14:00:46,true,1,,,,,,57340,VILLERS-SUR-NIED,,,57719,,,,,,,,,,,,,,,,,,,,F,,,,,97.22,NAP,N,,,0,,,,,,
794426783,00021,79442678300021,O,2020-05-11,,,4321AB,2021-12-15T08:43:20,true,1,,30,,RUE,PRINCIPAL,57340,VILLERS-SUR-NIED,,,57719,,,,,,,,,,,,,,,,,,,2020-05-11,A,RI2F FERMETURE,,,BOUKAYOUH ENERGIE,43.21A,NAFRev2,N,6.537814,48.921655,0.88,housenumber,30 Rue Principale 57340 Villers-sur-Nied,57719_0001_00030,G,30 RUE PRINCIPALE,
799153911,00018,79915391100018,O,2013-01-01,,,,2019-11-14T14:00:46,true,2,,27,,RUE,PRINCIPALE,57340,VILLERS-SUR-NIED,,,57719,,,,,,,,,,,,,,,,,,,2015-11-01,F,,,,,47.99A,NAFRev2,N,6.536975,48.921698,0.94,housenumber,27 Rue Principale 57340 Villers-sur-Nied,57719_0001_00027,G,27 RUE PRINCIPALE,
814844346,06305,81484434606305,O,2015-12-11,,,,2019-11-14T14:00:46,false,2,B1,,,,DERRIERE LE MOULIN,57340,VILLERS-SUR-NIED,,,57719,,,,,,,,,,,,,,,,,,,2017-03-27,F,NEWCO MOULIN B1,,,,35.11Z,NAFRev2,N,6.536096,48.921176,0.38,street,Rue du Moulin 57340 Villers-sur-Nied,57719_0010,G,RUE DU MOULIN,
814844346,09119,81484434609119,O,2016-02-19,,,,2019-11-14T14:00:46,false,2,,,,,DERRIERE LE MOULIN 102,57340,VILLERS-SUR-NIED,,,57719,,,,,,,,,,,,,,,,,,,2017-03-27,F,NEWCO MOULIN 102,,,,35.11Z,NAFRev2,N,,,0,,,,,,
878035161,00016,87803516100016,O,2019-10-17,,,,2019-11-14T14:00:46,true,1,,27,,RUE,PRINCIPALE,57340,VILLERS-SUR-NIED,,,57719,,,,,,,,,,,,,,,,,,,2019-10-17,A,,,,JOLAIN BOIS,47.78B,NAFRev2,N,6.536975,48.921698,0.94,housenumber,27 Rue Principale 57340 Villers-sur-Nied,57719_0001_00027,G,27 RUE PRINCIPALE,
881603112,00015,88160311200015,O,2020-01-17,,,,2021-02-08T15:45:22,true,2,,9,,RUE,PRINCIPALE,57340,VILLERS-SUR-NIED,,,57719,,,,,,,,,,,,,,,,,,,2020-04-14,F,,,,,01.11Z,NAFRev2,N,6.534921,48.921801,0.94,housenumber,9 Rue Principale 57340 Villers-sur-Nied,57719_0001_00009,G,9 RUE PRINCIPALE,
904001369,00019,90400136900019,O,2021-06-01,,,4322AZ,2021-11-09T11:38:00,true,2,,30,,RUE,PRINCIPALE,57340,VILLERS-SUR-NIED,,,57719,,,,,,,,,,,,,,,,,,,2021-08-01,A,,,,,43.22A,NAFRev2,O,6.537814,48.921655,0.94,housenumber,30 Rue Principale 57340 Villers-sur-Nied,57719_0001_00030,G,30 RUE PRINCIPALE,
918364258,00015,91836425800015,O,2022-05-04,,,,2022-08-16T07:13:26,true,1,,44,,RUE,DU MOULIN,57340,VILLERS-SUR-NIED,,,57719,,,,,,,,,,,,,,,,,,,2022-05-04,A,,,,,35.11Z,NAFRev2,N,6.536233,48.921263,0.93,housenumber,44 Rue du Moulin 57340 Villers-sur-Nied,57719_0010_00044,G,44 RUE DU MOULIN,
