siren,nic,siret,statutDiffusionEtablissement,dateCreationEtablissement,trancheEffectifsEtablissement,anneeEffectifsEtablissement,activitePrincipaleRegistreMetiersEtablissement,dateDernierTraitementEtablissement,etablissementSiege,nombrePeriodesEtablissement,complementAdresseEtablissement,numeroVoieEtablissement,indiceRepetitionEtablissement,typeVoieEtablissement,libelleVoieEtablissement,codePostalEtablissement,libelleCommuneEtablissement,libelleCommuneEtrangerEtablissement,distributionSpecialeEtablissement,codeCommuneEtablissement,codeCedexEtablissement,libelleCedexEtablissement,codePaysEtrangerEtablissement,libellePaysEtrangerEtablissement,complementAdresse2Etablissement,numeroVoie2Etablissement,indiceRepetition2Etablissement,typeVoie2Etablissement,libelleVoie2Etablissement,codePostal2Etablissement,libelleCommune2Etablissement,libelleCommuneEtranger2Etablissement,distributionSpeciale2Etablissement,codeCommune2Etablissement,codeCedex2Etablissement,libelleCedex2Etablissement,codePaysEtranger2Etablissement,libellePaysEtranger2Etablissement,dateDebut,etatAdministratifEtablissement,enseigne1Etablissement,enseigne2Etablissement,enseigne3Etablissement,denominationUsuelleEtablissement,activitePrincipaleEtablissement,nomenclatureActivitePrincipaleEtablissement,caractereEmployeurEtablissement,longitude,latitude,geo_score,geo_type,geo_adresse,geo_id,geo_ligne,geo_l4,geo_l5
130022767,00946,13002276700946,O,2017-01-01,,,,2020-02-04T11:24:16,false,2,LIEU DIT LA MUSEAU,,,RTE,DEPARTEMENTAL NUMERO 228,67203,OBERSCHAEFFOLSHEIM,,,67350,,,,,,,,,,,,,,,,,,,2020-01-01,F,AFB SERVICE DEPARTEMENTAL DU BAS RHIN,,,,84.12Z,NAFRev2,O,,,0,,,,,,
130025919,01450,13002591901450,O,2020-01-01,02,2020,,2022-08-29T09:03:47,false,2,LIEU DIT LA MUSEAU,,,RTE,DEPARTEMENTAL NUMERO 228,67203,OBERSCHAEFFOLSHEIM,,,67350,,,,,,,,,,,,,,,,,,,2021-12-31,F,OFB SERVICE DEPARTEMENTAL DU BAS RHIN,,,,84.13Z,NAFRev2,N,,,0,,,,,,
180068017,01928,18006801701928,O,2011-12-31,NN,,,2019-06-24T13:07:37,false,4,,,,LD,LA MUSAU,67203,OBERSCHAEFFOLSHEIM,,,67350,,,,,,,,,,,,,,,,,,,2017-01-01,F,SERVICE DEPARTEMENTAL DU BAS RHIN,,,,84.12Z,NAFRev2,O,7.648481,48.587186,0.93,street,Rue de la Musau 67203 Oberschaeffolsheim,67350_0200,G,RUE DE LA MUSAU,
186706461,00016,18670646100016,O,1985-11-19,01,2020,,2022-08-29T09:04:12,true,3,,,,,,67203,OBERSCHAEFFOLSHEIM,,,67350,,,,,,,,,,,,,,,,,,,2008-01-01,A,,,,,94.91Z,NAFRev2,N,,,0,,,,,,
216703504,00011,21670350400011,O,1983-03-01,11,2020,,2022-08-29T09:08:27,true,4,,1,,RUE,DE LEGLISE,67203,OBERSCHAEFFOLSHEIM,,,67350,,,,,,,,,,,,,,,,,,,2008-01-01,A,MAIRIE,,,,84.11Z,NAFRev2,O,7.648373,48.584064,0.85,housenumber,1 Rue de l’Eglise 67203 Oberschaeffolsheim,67350_0080_00001,G,1 RUE DE L EGLISE,
216703504,00029,21670350400029,O,1983-12-21,02,2020,,2022-08-29T09:08:27,false,4,,19,,RUE,DE LA MAIRIE,67203,OBERSCHAEFFOLSHEIM,,,67350,,,,,,,,,,,,,,,,,,,2022-05-13,A,ECOLE PRIMAIRE LES CIGOGNES,,,,85.20Z,NAFRev2,N,7.649628,48.584308,0.96,housenumber,19 Rue de la Mairie 67203 Oberschaeffolsheim,67350_0140_00019,G,19 RUE DE LA MAIRIE,
216703504,00037,21670350400037,O,1983-12-21,02,2020,,2022-08-29T09:08:27,false,3,,14,,RUE,DE LA MAIRIE,67203,OBERSCHAEFFOLSHEIM,,,67350,,,,,,,,,,,,,,,,,,,2008-01-01,A,ECOLE MATERNELLE PUBLIQUE,,,,85.10Z,NAFRev2,N,7.648368,48.584784,0.96,housenumber,14 Rue de la Mairie 67203 Oberschaeffolsheim,67350_0140_00014,G,14 RUE DE LA MAIRIE,
256701723,00015,25670172300015,O,1983-03-01,NN,,,2006-10-26T23:44:18,true,3,,,,,MAIRIE,67203,OBERSCHAEFFOLSHEIM,,,67350,,,,,,,,,,,,,,,,,,,1993-06-07,F,ACHENHEIM OBERSCH WOLFISHEIM,,,,90.0A,NAF1993,N,7.650903,48.584109,0.93,street,Rue de la Mairie 67203 Oberschaeffolsheim,67350_0140,G,RUE DE LA MAIRIE,
266703586,00013,26670358600013,O,1995-12-25,NN,,,2010-06-26T03:14:24,true,2,MAIRIE,,,RUE,DE L EGLISE,67203,OBERSCHAEFFOLSHEIM,,,67350,,,,,,,,,,,,,,,,,,,2008-01-01,A,CCAS DE OBERSCHAEFFOLSHEIM,,,,88.99B,NAFRev2,N,7.64758,48.584059,0.95,street,Rue de l’Eglise 67203 Oberschaeffolsheim,67350_0080,G,RUE DE L EGLISE,
296702053,00012,29670205300012,O,1983-08-10,NN,,,2010-04-18T03:19:40,true,3,,,,,MAIRIE,67203,OBERSCHAEFFOLSHEIM,,,67350,,,,,,,,,,,,,,,,,,,2008-01-01,A,,,,,42.99Z,NAFRev2,N,7.650903,48.584109,0.93,street,Rue de la Mairie 67203 Oberschaeffolsheim,67350_0140,G,RUE DE LA MAIRIE,
300333234,00015,30033323400015,O,1900-01-01,NN,,,2015-10-23T15:00:23,true,4,,3,,RUE,DE GRIESHEIM,67203,OBERSCHAEFFOLSHEIM,,,67350,,,,,,3,,RUE,DE GRIESHEIM,67203,OBERSCHAEFFOLSHEIM,,,67350,,,,,2015-10-09,F,,,,,68.20B,NAFRev2,N,7.646329,48.587032,0.95,housenumber,3 Rue de Griesheim 67203 Oberschaeffolsheim,67350_0130_00003,G,3 RUE DE GRIESHEIM,
300501632,00040,30050163200040,O,1998-12-01,,,,2006-10-26T23:48:09,true,3,,48,,RUE,DE LA MAIRIE,67203,OBERSCHAEFFOLSHEIM,,,67350,,,,,,,,,,,,,,,,,,,2004-10-11,F,,,,,51.6N,NAFRev1,N,7.652091,48.583724,0.96,housenumber,48 Rue de la Mairie 67203 Oberschaeffolsheim,67350_0140_00048,G,48 RUE DE LA MAIRIE,
300542560,00028,30054256000028,O,1980-09-01,01,2020,,2022-08-29T09:11:05,true,5,,48,,RUE,DE LA MAIRIE,67203,OBERSCHAEFFOLSHEIM,,,67350,,,,,,,,,,,,,,,,,,,2021-09-30,F,,,,,69.20Z,NAFRev2,O,7.652091,48.583724,0.96,housenumber,48 Rue de la Mairie 67203 Oberschaeffolsheim,67350_0140_00048,G,48 RUE DE LA MAIRIE,
302581590,00015,30258159000015,O,,,,,,true,1,,,,,RN 4,67203,OBERSCHAEFFOLSHEIM,,,67350,,,,,,,,,,,,,,,,,,,1988-07-10,F,,,,,65.03,NAP,N,,,0,,,,,,
303332324,00027,30333232400027,O,,,,,,true,1,,4,,RUE,DE LA CHAPELLE,67203,OBERSCHAEFFOLSHEIM,,,67350,,,,,,,,,,,,,,,,,,,1984-12-25,F,,,,,55.70,NAP,N,7.646417,48.585962,0.95,housenumber,4 Rue de la Chapelle 67203 Oberschaeffolsheim,67350_0040_00004,G,4 RUE DE LA CHAPELLE,
303386502,00023,30338650200023,O,,NN,,,,true,1,,26,,RUE,DU GAL DE GAULLE,67203,OBERSCHAEFFOLSHEIM,,,67350,,,,,,,,,,,,,,,,,,,,F,,,,,67.01,NAP,N,7.652928,48.586841,0.92,housenumber,26 Rue du Général de Gaulle 67203 Oberschaeffolsheim,67350_0120_00026,G,26 RUE DU GENERAL DE GAULLE,
305348997,00076,30534899700076,O,2014-05-01,,,4312BA,2014-10-24T11:41:35,false,1,CARREFOUR BELLEVUE,,,CHE,DU HITZTHAL,67203,OBERSCHAEFFOLSHEIM,,,67350,,,,,,,,,,,,,,,,,,,2014-05-01,A,,,,,43.12B,NAFRev2,N,7.650018,48.585995,0.34,street,Rue du Général de Gaulle 67203 Oberschaeffolsheim,67350_0120,G,RUE DU GENERAL DE GAULLE,
307000034,00065,30700003400065,O,1992-05-02,NN,,,2006-12-15T00:16:16,false,2,,12,,RUE,DU CANAL,67203,OBERSCHAEFFOLSHEIM,,,67350,,,,,,,,,,,,,,,,,,,1996-01-29,F,,,,,,,,7.646301,48.583742,0.8,street,Rue du Canal 67203 Oberschaeffolsheim,67350_0020,G,RUE DU CANAL,
307085084,00019,30708508400019,O,,,,,,true,1,,9,,RUE,DU NOYER,67203,OBERSCHAEFFOLSHEIM,,,67350,,,,,,,,,,,,,,,,,,,1984-12-25,F,,,,,55.73,NAP,N,7.651489,48.587838,0.95,housenumber,9 Rue du Noyer 67203 Oberschaeffolsheim,67350_0240_00009,G,9 RUE DU NOYER,
307085092,00012,30708509200012,O,,,,,,true,1,,68,,RUE,DE LA MUSAU,67203,OBERSCHAEFFOLSHEIM,,,67350,,,,,,,,,,,,,,,,,,,1984-12-25,F,,,,,,,N,7.648481,48.587186,0.82,street,Rue de la Musau 67203 Oberschaeffolsheim,67350_0200,G,RUE DE LA MUSAU,
307919183,00011,30791918300011,O,,NN,,,,true,1,,61,,RUE,DU GENERAL DE GAULLE,67203,OBERSCHAEFFOLSHEIM,,,67350,,,,,,,,,,,,,,,,,,,,F,,,,,77.14,NAP,N,7.647694,48.585786,0.96,housenumber,61 Rue du Général de Gaulle 67203 Oberschaeffolsheim,67350_0120_00061,G,61 RUE DU GENERAL DE GAULLE,
308094879,00035,30809487900035,O,2020-10-01,,,9602AB,2020-10-23T19:34:33,true,1,,9,,RUE,DES FAUVETTES,67203,OBERSCHAEFFOLSHEIM,,,67350,,,,,,,,,,,,,,,,,,,2020-10-01,A,,,,,96.02A,NAFRev2,N,7.653391,48.589776,0.95,housenumber,9 Rue des Fauvettes 67203 Oberschaeffolsheim,67350_0113_00009,G,9 RUE DES FAUVETTES,
309377497,00016,30937749700016,O,1977-01-01,NN,,,2006-10-27T00:22:02,true,4,,26,,RUE,DU GENERAL DE GAULLE,67203,OBERSCHAEFFOLSHEIM,,,67350,,,,,,,,,,,,,,,,,,,2005-09-19,F,,,,,70.2C,NAFRev1,N,7.652928,48.586841,0.96,housenumber,26 Rue du Général de Gaulle 67203 Oberschaeffolsheim,67350_0120_00026,G,26 RUE DU GENERAL DE GAULLE,
309526952,00010,30952695200010,O,1977-01-01,NN,,,,true,1,,43,,RUE,DE LA MAIRIE,67203,OBERSCHAEFFOLSHEIM,,,67350,,,,,,,,,,,,,,,,,,,2001-06-30,F,,,,,45.3E,NAF1993,O,7.652447,48.583916,0.96,housenumber,43 Rue de la Mairie 67203 Oberschaeffolsheim,67350_0140_00043,G,43 RUE DE LA MAIRIE,
310188065,00042,31018806500042,O,2009-01-01,11,2020,,2022-08-29T09:13:20,true,2,LIEUDIT LA MUSAU,,,,ROUTE DEPARTEMENTALE 228,67203,OBERSCHAEFFOLSHEIM,,,67350,,,,,,,,,,,,,,,,,,,2010-01-10,A,,,,,94.99Z,NAFRev2,O,6.2322097,48.3888613,0.76,poi.track,Route Départementale (Chemin) Avrainville,https://osm.org/way/492497059,G,,
310237474,00013,31023747400013,O,,NN,,,,true,1,,12,,RUE,DES CERISES,67203,OBERSCHAEFFOLSHEIM,,,67350,,,,,,,,,,,,,,,,,,,,F,,,,,55.73,NAP,N,7.650532,48.587762,0.95,housenumber,12 Rue des Cerises 67203 Oberschaeffolsheim,67350_0030_00012,G,12 RUE DES CERISES,
310498217,01265,31049821701265,O,2021-09-01,,,,2021-09-13T08:33:55,false,1,,,,IMP,DU MOULIN,67203,OBERSCHAEFFOLSHEIM,,,67350,,,,,,,,,,,,,,,,,,,2021-09-01,A,ALEF - ALSH D'OBERSCHAEFFOLSHEIM,,,,88.99A,NAFRev2,O,7.649573,48.583871,0.81,street,Impasse du Moulin 67203 Oberschaeffolsheim,67350_0180,G,IMPASSE DU MOULIN,
311154868,00013,31115486800013,O,,NN,,,,true,1,,48,,RUE,DU GENERAL DE GAULLE,67203,OBERSCHAEFFOLSHEIM,,,67350,,,,,,,,,,,,,,,,,,,1989-12-13,F,,,,,55.40,NAP,N,7.650546,48.586753,0.96,housenumber,48 Rue du Général de Gaulle 67203 Oberschaeffolsheim,67350_0120_00048,G,48 RUE DU GENERAL DE GAULLE,
311888200,00012,31188820000012,O,1978-01-01,01,2020,4520AB,2022-08-29T09:13:48,true,4,,19,,RUE,DU GENERAL DE GAULLE,67203,OBERSCHAEFFOLSHEIM,,,67350,,,,,,,,,,,,,,,,,,,2008-01-01,A,,,,,45.11Z,NAFRev2,O,7.653104,48.586563,0.96,housenumber,19 Rue du Général de Gaulle 67203 Oberschaeffolsheim,67350_0120_00019,G,19 RUE DU GENERAL DE GAULLE,
312478266,04985,31247826604985,O,2019-11-01,,,,2022-01-12T04:31:53,false,2,,7,,IMP,DU MOULIN,67203,OBERSCHAEFFOLSHEIM,,,67350,,,,,,,,,,,,,,,,,,,2020-12-31,F,650200,,,,56.29B,NAFRev2,O,7.649526,48.583715,0.83,housenumber,7 Impasse du Moulin 67203 Oberschaeffolsheim,67350_0180_00007,G,7 IMPASSE DU MOULIN,
312686363,00028,31268636300028,O,1989-09-01,NN,,,2013-10-15T11:55:25,true,6,,7,,RUE,DU CANAL,67203,OBERSCHAEFFOLSHEIM,,,67350,,,,,,,,,,,,,,,,,,,2013-10-14,A,,,,,85.59A,NAFRev2,N,7.64699,48.58467,0.96,housenumber,7 Rue du Canal 67203 Oberschaeffolsheim,67350_0020_00007,G,7 RUE DU CANAL,
313236028,00046,31323602800046,O,1992-02-17,NN,,,,true,1,,16,,RUE,DU GENERAL DE GAULLE,67203,OBERSCHAEFFOLSHEIM,,,67350,,,,,,,,,,,,,,,,,,,2000-03-31,F,,,,,45.3A,NAF1993,O,7.654013,48.586805,0.96,housenumber,16 Rue du Général de Gaulle 67203 Oberschaeffolsheim,67350_0120_00016,G,16 RUE DU GENERAL DE GAULLE,
313772857,00022,31377285700022,O,,NN,,,,true,1,,61,,RUE,DU GENERAL DE GAULLE,67203,OBERSCHAEFFOLSHEIM,,,67350,,,,,,,,,,,,,,,,,,,1990-06-30,F,,,,,64.48,NAP,N,7.647694,48.585786,0.96,housenumber,61 Rue du Général de Gaulle 67203 Oberschaeffolsheim,67350_0120_00061,G,61 RUE DU GENERAL DE GAULLE,
314350513,00060,31435051300060,O,2023-01-01,,,,2022-12-17T02:27:25,true,1,,17,,RUE,DES CHATAIGNIERS,67203,OBERSCHAEFFOLSHEIM,,,67350,,,,,,,,,,,,,,,,,,,2023-01-01,A,,,,SACONNEY,96.09Z,NAFRev2,N,7.648567,48.587879,0.95,housenumber,17 Rue des Châtaigniers 67203 Oberschaeffolsheim,67350_0051_00017,G,17 RUE DES CHATAIGNIERS,
315424382,00028,31542438200028,O,,NN,,,,true,1,,45,,RUE,DU GENERAL DE GAULLE,67203,OBERSCHAEFFOLSHEIM,,,67350,,,,,,,,,,,,,,,,,,,1989-05-31,F,,,,,67.04,NAP,N,7.649667,48.586346,0.96,housenumber,45 Rue du Général de Gaulle 67203 Oberschaeffolsheim,67350_0120_00045,G,45 RUE DU GENERAL DE GAULLE,
316301324,00042,31630132400042,O,1988-11-18,NN,,,2011-05-04T00:20:42,true,7,,44,,RUE,DU CANAL,67203,OBERSCHAEFFOLSHEIM,,,67350,,,,,,,,,,,,,,,,,,,2008-01-01,A,,,,,01.43Z,NAFRev2,N,7.644494,48.581926,0.96,housenumber,44 Rue du Canal 67203 Oberschaeffolsheim,67350_0020_00044,G,44 RUE DU CANAL,
317155554,00080,31715555400080,O,2013-12-16,,,,2018-01-25T08:40:59,true,2,,7,,IMP,DE L'EST,67203,OBERSCHAEFFOLSHEIM,,,67350,,,,,,,,,,,,,,,,,,,2017-12-30,F,,,,,86.90D,NAFRev2,N,7.650821,48.585964,0.82,housenumber,7 Impasse de l’Est 67203 Oberschaeffolsheim,67350_0100_00007,G,7 IMPASSE DE L EST,
319319414,00037,31931941400037,O,1998-07-02,NN,,,2010-04-18T03:53:05,true,4,,63,,RUE,DU GENERAL DE GAULLE,67203,OBERSCHAEFFOLSHEIM,,,67350,,,,,,,,,,,,,,,,,,,2008-06-11,F,,,,,10.71C,NAFRev2,N,7.64747,48.58577,0.96,housenumber,63 Rue du Général de Gaulle 67203 Oberschaeffolsheim,67350_0120_00063,G,63 RUE DU GENERAL DE GAULLE,
321008260,00010,32100826000010,O,,NN,,,,true,1,,,,,ROUTE NATIONALE 4,67203,OBERSCHAEFFOLSHEIM,,,67350,,,,,,,,,,,,,,,,,,,1986-05-26,F,,,,,67.01,NAP,N,1.043065,46.8800625,0.79,poi.track,Chemin rural des Quatre Bornec à la Route Nationale 675 Obterre,https://osm.org/way/164500487,G,,
321524092,00012,32152409200012,O,,NN,,,,true,1,,4,,,RN 4,67203,OBERSCHAEFFOLSHEIM,,,67350,,,,,,,,,,,,,,,,,,,1990-12-31,F,,,,,81.21,NAP,N,,,0,,,,,,
321601858,00012,32160185800012,O,,,,,,true,1,,61,,RUE,DU GENERAL DE GAULLE,67203,OBERSCHAEFFOLSHEIM,,,67350,,,,,,,,,,,,,,,,,,,1984-12-25,F,,,,,64.48,NAP,N,7.647694,48.585786,0.96,housenumber,61 Rue du Général de Gaulle 67203 Oberschaeffolsheim,67350_0120_00061,G,61 RUE DU GENERAL DE GAULLE,
321608747,00010,32160874700010,O,1981-01-01,NN,,,,false,4,,16,,RUE,DE LA MAIRIE,67203,OBERSCHAEFFOLSHEIM,,,67350,,,,,,,,,,,,,,,,,,,2002-03-01,F,,,,,01.1A,NAF1993,N,7.648899,48.585065,0.96,housenumber,16 Rue de la Mairie 67203 Oberschaeffolsheim,67350_0140_00016,G,16 RUE DE LA MAIRIE,
321608747,00028,32160874700028,O,2002-03-01,01,2020,,2022-08-29T09:17:11,true,3,LD MITTELWEG,,,RUE,DE LA MUSAU,67203,OBERSCHAEFFOLSHEIM,,,67350,,,,,,,,,,,,,,,,,,,2008-01-01,A,,,,,01.11Z,NAFRev2,N,7.648481,48.587186,0.95,street,Rue de la Musau 67203 Oberschaeffolsheim,67350_0200,G,RUE DE LA MUSAU,
324575851,00013,32457585100013,O,,,,,,true,1,,13,,IMP,DES CHAMPS,67203,OBERSCHAEFFOLSHEIM,,,67350,,,,,,,,,,,,,,,,,,,1984-12-25,F,,,,,55.72,NAP,N,7.657197,48.585565,0.85,housenumber,13 Impasse des Champs 67203 Oberschaeffolsheim,67350_0035_00013,G,13 IMPASSE DES CHAMPS,
324944958,00036,32494495800036,O,1987-04-14,NN,,,2018-09-29T12:21:39,false,6,,4,,IMP,DES MERLES,67203,OBERSCHAEFFOLSHEIM,,,67350,,,,,,,,,,,,,,,,,,,2017-06-30,F,,,,,86.21Z,NAFRev2,N,7.656085,48.588596,0.83,housenumber,4 Impasse des Merles 67203 Oberschaeffolsheim,67350_0144_00004,G,4 IMPASSE DES MERLES,
325118933,00044,32511893300044,O,2010-01-15,,,,2012-11-09T00:23:31,false,2,,9,,RUE,DE LA CHAPELLE,67203,OBERSCHAEFFOLSHEIM,,,67350,,,,,,,,,,,,,,,,,,,2012-06-01,F,,,,,81.21Z,NAFRev2,N,7.645903,48.586423,0.95,housenumber,9 Rue de la Chapelle 67203 Oberschaeffolsheim,67350_0040_00009,G,9 RUE DE LA CHAPELLE,
325118933,00051,32511893300051,O,2012-06-01,,,,2013-04-22T19:27:00,true,2,,74,A,RUE,DU GENERAL DE GAULLE,67203,OBERSCHAEFFOLSHEIM,,,67350,,,,,,,,,,,,,,,,,,,2013-03-31,F,,,,,81.21Z,NAFRev2,N,7.647723,48.586256,0.96,housenumber,74a Rue du Général de Gaulle 67203 Oberschaeffolsheim,67350_0120_00074_a,G,74A RUE DU GENERAL DE GAULLE,
325214534,00019,32521453400019,O,,,,,,true,1,,61,,RUE,DU GENERAL DE GAULLE,67203,OBERSCHAEFFOLSHEIM,,,67350,,,,,,,,,,,,,,,,,,,1990-12-03,F,,,,,77.07,NAP,N,7.647694,48.585786,0.96,housenumber,61 Rue du Général de Gaulle 67203 Oberschaeffolsheim,67350_0120_00061,G,61 RUE DU GENERAL DE GAULLE,
325469799,00028,32546979900028,O,,NN,,,,true,1,,1,,IMP,DU BOSQUET,67203,OBERSCHAEFFOLSHEIM,,,67350,,,,,,,,,,,,,,,,,,,1991-02-12,F,,,,,69.12,NAP,N,7.655742,48.585347,0.63,housenumber,1 Impasse des Bosquets 67203 Oberschaeffolsheim,67350_0014_00001,G,1 IMPASSE DES BOSQUETS,
325781599,00015,32578159900015,O,,,,,,true,1,,6,,RUE,DE LA CHAPELLE,67203,OBERSCHAEFFOLSHEIM,,,67350,,,,,,,,,,,,,,,,,,,1984-12-25,F,,,,,35.01,NAP,N,7.646359,48.586035,0.95,housenumber,6 Rue de la Chapelle 67203 Oberschaeffolsheim,67350_0040_00006,G,6 RUE DE LA CHAPELLE,
326152337,00019,32615233700019,O,1982-12-10,NN,,1061AZ,2014-06-27T00:12:40,false,3,,7,,IMP,DU MOULIN,67203,OBERSCHAEFFOLSHEIM,,,67350,,,,,,,,,,,,,,,,,,,2008-01-01,A,,,,,10.61A,NAFRev2,N,7.649526,48.583715,0.83,housenumber,7 Impasse du Moulin 67203 Oberschaeffolsheim,67350_0180_00007,G,7 IMPASSE DU MOULIN,
326776721,00010,32677672100010,O,,,,,,true,1,,2,,RUE,DE MUHLBACH,67203,OBERSCHAEFFOLSHEIM,,,67350,,,,,,,,,,,,,,,,,,,1984-12-25,F,,,,,64.49,NAP,N,7.657012,48.586235,0.81,housenumber,2 Rue du Muhlbach 67203 Oberschaeffolsheim,67350_0189_00002,G,2 RUE DU MUHLBACH,
327028460,00019,32702846000019,O,,NN,,,,true,1,,46,,RUE,DU CANAL,67203,OBERSCHAEFFOLSHEIM,,,67350,,,,,,,,,,,,,,,,,,,1992-03-31,F,,,,,01.2C,NAF1993,N,7.645023,48.580713,0.96,housenumber,46 Rue du Canal 67203 Oberschaeffolsheim,67350_0020_00046,G,46 RUE DU CANAL,
327045282,00016,32704528200016,O,,,,,,true,1,,11,,IMP,DU BOSQUET,67203,OBERSCHAEFFOLSHEIM,,,67350,,,,,,,,,,,,,,,,,,,1985-12-25,F,,,,,60.10,NAP,N,7.656045,48.585047,0.65,housenumber,11 Impasse des Bosquets 67203 Oberschaeffolsheim,67350_0014_00011,G,11 IMPASSE DES BOSQUETS,
328240163,00050,32824016300050,O,2013-09-10,,,,2021-02-23T10:49:30,true,1,,2,,IMP,DES MERLES,67203,OBERSCHAEFFOLSHEIM,,,67350,,,,,,,,,,,,,,,,,,,2013-09-10,A,,,,,35.11Z,NAFRev2,N,7.656251,48.588462,0.83,housenumber,2 Impasse des Merles 67203 Oberschaeffolsheim,67350_0144_00002,G,2 IMPASSE DES MERLES,
328293600,00040,32829360000040,O,2006-02-01,NN,,,2013-05-18T03:23:13,false,3,,6,,IMP,DES ERABLES,67203,OBERSCHAEFFOLSHEIM,,,67350,,,,,,,,,,,,,,,,,,,2011-04-15,F,,,,,71.12B,NAFRev2,O,7.64903,48.587271,0.84,housenumber,6 Impasse des Erables 67203 Oberschaeffolsheim,67350_0094_00006,G,6 IMPASSE DES ERABLES,
328293600,00081,32829360000081,O,2019-06-01,,,,2021-02-23T10:49:32,true,1,,10,,RUE,DE LA MUSAU,67203,OBERSCHAEFFOLSHEIM,,,67350,,,,,,,,,,,,,,,,,,,2019-06-01,A,,,,,71.11Z,NAFRev2,N,7.648481,48.587186,0.95,housenumber,10 Rue de la Musau 67203 Oberschaeffolsheim,67350_0200_00010,G,10 RUE DE LA MUSAU,
328377700,00054,32837770000054,O,1993-07-01,NN,,,,false,3,,3,,RUE,DES FAUVETTES,67203,OBERSCHAEFFOLSHEIM,,,67350,,,,,,,,,,,,,,,,,,,1994-07-05,F,,,,,85.1C,NAF1993,N,7.653836,48.589417,0.95,housenumber,3 Rue des Fauvettes 67203 Oberschaeffolsheim,67350_0113_00003,G,3 RUE DES FAUVETTES,
329173827,00018,32917382700018,O,,,,,,true,1,,80,,RUE,DU GENERAL DE GAULLE,67203,OBERSCHAEFFOLSHEIM,,,67350,,,,,,,,,,,,,,,,,,,1985-12-25,F,,,,,21.11,NAP,N,7.647227,48.585986,0.96,housenumber,80 Rue du Général de Gaulle 67203 Oberschaeffolsheim,67350_0120_00080,G,80 RUE DU GENERAL DE GAULLE,
329193700,00047,32919370000047,O,1994-05-01,NN,,,,false,4,,18,,RUE,DES VERGERS,67203,OBERSCHAEFFOLSHEIM,,,67350,,,,,,,,,,,,,,,,,,,1998-01-01,F,,,,,52.6G,NAF1993,N,7.655115,48.585974,0.95,housenumber,18 Rue des Vergers 67203 Oberschaeffolsheim,67350_0319_00018,G,18 RUE DES VERGERS,
329690358,00018,32969035800018,O,1983-10-01,NN,,,2018-09-29T12:25:14,true,3,,8,,IMP,DE L ESPACE VERT,67203,OBERSCHAEFFOLSHEIM,,,67350,,,,,,,,,,,,,,,,,,,2008-01-01,A,,,,,94.99Z,NAFRev2,O,7.654309,48.584259,0.87,housenumber,8 Impasse de l’Espace Vert 67203 Oberschaeffolsheim,67350_0097_00008,G,8 IMPASSE DE L ESPACE VERT,
330235847,00036,33023584700036,O,2001-01-01,NN,,7410ZP,2021-07-19T08:37:32,true,4,,7,,RUE,DE L4EGLISE,67203,OBERSCHAEFFOLSHEIM,,,67350,,,,,,,,,,,,,,,,,,,2018-12-31,F,,,,,82.99Z,NAFRev2,N,7.647199,48.583898,0.8,housenumber,7 Rue de l’Eglise 67203 Oberschaeffolsheim,67350_0080_00007,G,7 RUE DE L EGLISE,
330414988,00056,33041498800056,O,1993-10-22,11,2020,,2022-08-29T09:21:28,true,6,,13,,RUE,DU CANAL,67203,OBERSCHAEFFOLSHEIM,,,67350,,,,,,,,,,,,,,,,,,,2013-12-31,A,,,,,63.11Z,NAFRev2,O,7.646667,48.583593,0.96,housenumber,13 Rue du Canal 67203 Oberschaeffolsheim,67350_0020_00013,G,13 RUE DU CANAL,
330550435,00011,33055043500011,O,1984-09-15,01,2020,4332AA,2022-08-29T09:21:33,true,4,,39,,RUE,DU GENERAL DE GAULLE,67203,OBERSCHAEFFOLSHEIM,,,67350,,,,,,,,,,,,,,,,,,,2008-01-01,A,,,,,31.09B,NAFRev2,O,7.650261,48.586552,0.96,housenumber,39 Rue du Général de Gaulle 67203 Oberschaeffolsheim,67350_0120_00039,G,39 RUE DU GENERAL DE GAULLE,
331090324,00038,33109032400038,O,1993-09-01,NN,,,2019-06-24T13:26:07,true,7,FERME DU SCHELISHANS,13,,RUE,DE L EGLISE,67203,OBERSCHAEFFOLSHEIM,,,67350,,,,,,,,,,,,,,,,,,,2018-01-31,A,LOGISTIQUE COMMERCIALISATION GESTION,LA CIGOGNE GOURMANDE,,LOGISTIQUE COMMERCIALISATION GESTION - LA CIGOGNE GOURMANDE,47.91B,NAFRev2,N,7.646738,48.583758,0.95,housenumber,13 Rue de l’Eglise 67203 Oberschaeffolsheim,67350_0080_00013,G,13 RUE DE L EGLISE,
331226845,00039,33122684500039,O,2018-08-27,,,,2021-02-23T10:51:24,true,1,,11,B,RUE,DU GENERAL DE GAULLE,67203,OBERSCHAEFFOLSHEIM,,,67350,,,,,,,,,,,,,,,,,,,2018-08-27,A,,,,,85.51Z,NAFRev2,N,7.654348,48.586481,0.96,housenumber,11b Rue du Général de Gaulle 67203 Oberschaeffolsheim,67350_0120_00011_b,G,11B RUE DU GENERAL DE GAULLE,
331910083,00012,33191008300012,O,,NN,,,,true,1,,18,,RUE,DU NOTARIAT,67203,OBERSCHAEFFOLSHEIM,,,67350,,,,,,,,,,,,,,,,,,,1995-03-31,F,,,,,52.4Y,NAF1993,N,7.652352,48.585395,0.95,housenumber,18 Rue du Notariat 67203 Oberschaeffolsheim,67350_0220_00018,G,18 RUE DU NOTARIAT,
332369446,00015,33236944600015,O,,NN,,,,true,1,,3,,IMP,DU MOULIN,67203,OBERSCHAEFFOLSHEIM,,,67350,,,,,,,,,,,,,,,,,,,1988-03-31,F,,,,,59.08,NAP,N,7.649661,48.583973,0.83,housenumber,3 Impasse du Moulin 67203 Oberschaeffolsheim,67350_0180_00003,G,3 IMPASSE DU MOULIN,
332401918,00013,33240191800013,O,1985-03-18,NN,,,2022-09-03T03:56:28,true,4,,6,,IMP,DES CHAMPS,67203,OBERSCHAEFFOLSHEIM,,,67350,,,,,,,,,,,,,,,,,,,2022-02-02,F,,,,,41.10D,NAFRev2,N,7.656735,48.585432,0.84,housenumber,6 Impasse des Champs 67203 Oberschaeffolsheim,67350_0035_00006,G,6 IMPASSE DES CHAMPS,
332494582,00023,33249458200023,O,1997-04-01,NN,,,2006-10-27T02:20:56,true,3,,21,,RUE,DES MESANGES,67203,OBERSCHAEFFOLSHEIM,,,67350,,,,,,,,,,,,,,,,,,,2004-08-24,F,,,,,70.2C,NAFRev1,N,7.654242,48.587942,0.96,housenumber,21 Rue des Mésanges 67203 Oberschaeffolsheim,67350_0147_00021,G,21 RUE DES MESANGES,
333203479,00014,33320347900014,O,,NN,,,,true,1,,8,,RUE,DU MUHLBACH,67203,OBERSCHAEFFOLSHEIM,,,67350,,,,,,,,,,,,,,,,,,,1989-06-21,F,,,,,79.03,NAP,N,7.656733,48.586125,0.96,housenumber,8 Rue du Muhlbach 67203 Oberschaeffolsheim,67350_0189_00008,G,8 RUE DU MUHLBACH,
333293777,00012,33329377700012,O,1985-07-15,NN,,,,false,4,,74,,RUE,DU GENERAL DE GAULLE,67203,OBERSCHAEFFOLSHEIM,,,67350,,,,,,,,,,,,,,,,,,,1996-12-25,F,,,,,85.1E,NAF1993,O,7.647792,48.585954,0.96,housenumber,74 Rue du Général de Gaulle 67203 Oberschaeffolsheim,67350_0120_00074,G,74 RUE DU GENERAL DE GAULLE,
333293777,00020,33329377700020,O,1996-08-26,01,2020,,2022-08-29T09:23:06,true,3,,42,A,RUE,DU GAL DE GAULLE,67203,OBERSCHAEFFOLSHEIM,,,67350,,,,,,,,,,,,,,,,,,,2008-01-01,A,,,,,86.23Z,NAFRev2,O,7.651016,48.587199,0.92,housenumber,42a Rue du Général de Gaulle 67203 Oberschaeffolsheim,67350_0120_00042_a,G,42A RUE DU GENERAL DE GAULLE,
333682870,00071,33368287000071,O,2011-01-01,,,8211ZP,2015-03-17T00:22:09,false,2,,5,,RUE,DU RIED,67203,OBERSCHAEFFOLSHEIM,,,67350,,,,,,,,,,,,,,,,,,,2013-01-02,F,,,,,82.99Z,NAFRev2,N,7.647194,48.587435,0.95,housenumber,5 Rue du Ried 67203 Oberschaeffolsheim,67350_0278_00005,G,5 RUE DU RIED,
334003357,00012,33400335700012,O,,NN,,,,true,1,,4,,RUE,DU MUHLBACH,67203,OBERSCHAEFFOLSHEIM,,,67350,,,,,,,,,,,,,,,,,,,,F,,,,,77.10,NAP,N,7.656907,48.586212,0.96,housenumber,4 Rue du Muhlbach 67203 Oberschaeffolsheim,67350_0189_00004,G,4 RUE DU MUHLBACH,
334106283,00024,33410628300024,O,1997-07-01,,,,,true,1,,12,,RUE,DU CANAL,67203,OBERSCHAEFFOLSHEIM,,,67350,,,,,,,,,,,,,,,,,,,2000-12-28,F,,,,,45.3C,NAF1993,N,7.646301,48.583742,0.8,street,Rue du Canal 67203 Oberschaeffolsheim,67350_0020,G,RUE DU CANAL,
334806353,00010,33480635300010,O,1986-01-01,NN,,,2015-09-15T11:19:44,true,3,,46,,RUE,DU CANAL,67203,OBERSCHAEFFOLSHEIM,,,67350,,,,,,,,,,,,,,,,,,,2008-01-01,A,,,,,68.20B,NAFRev2,N,7.645023,48.580713,0.96,housenumber,46 Rue du Canal 67203 Oberschaeffolsheim,67350_0020_00046,G,46 RUE DU CANAL,