siren,nic,siret,statutDiffusionEtablissement,dateCreationEtablissement,trancheEffectifsEtablissement,anneeEffectifsEtablissement,activitePrincipaleRegistreMetiersEtablissement,dateDernierTraitementEtablissement,etablissementSiege,nombrePeriodesEtablissement,complementAdresseEtablissement,numeroVoieEtablissement,indiceRepetitionEtablissement,typeVoieEtablissement,libelleVoieEtablissement,codePostalEtablissement,libelleCommuneEtablissement,libelleCommuneEtrangerEtablissement,distributionSpecialeEtablissement,codeCommuneEtablissement,codeCedexEtablissement,libelleCedexEtablissement,codePaysEtrangerEtablissement,libellePaysEtrangerEtablissement,complementAdresse2Etablissement,numeroVoie2Etablissement,indiceRepetition2Etablissement,typeVoie2Etablissement,libelleVoie2Etablissement,codePostal2Etablissement,libelleCommune2Etablissement,libelleCommuneEtranger2Etablissement,distributionSpeciale2Etablissement,codeCommune2Etablissement,codeCedex2Etablissement,libelleCedex2Etablissement,codePaysEtranger2Etablissement,libellePaysEtranger2Etablissement,dateDebut,etatAdministratifEtablissement,enseigne1Etablissement,enseigne2Etablissement,enseigne3Etablissement,denominationUsuelleEtablissement,activitePrincipaleEtablissement,nomenclatureActivitePrincipaleEtablissement,caractereEmployeurEtablissement,longitude,latitude,geo_score,geo_type,geo_adresse,geo_id,geo_ligne,geo_l4,geo_l5
038422473,00017,03842247300017,O,1994-12-25,01,2020,,2022-08-29T09:00:44,true,2,,,,RUE,DE L ABATTOIR,68360,SOULTZ-HAUT-RHIN,,,68315,,,,,,,,,,,,,,,,,,,2008-01-01,A,,,,,81.10Z,NAFRev2,O,7.231142,47.889772,0.95,street,Rue de l’Abattoir 68360 Soultz-Haut-Rhin,68315_0010,G,RUE DE L ABATTOIR,
130012909,00169,13001290900169,O,2010-11-15,,,,2019-11-14T14:00:53,false,2,,35,B,RUE,JEAN JAURES,68360,SOULTZ-HAUT-RHIN,,BP   13,68315,,,,,,,,,,,,,,,,,,,2012-09-17,F,TRESORERIE DE SOULTZ-HAUT-RHIN,,,,84.11Z,NAFRev2,N,7.22944,47.885611,0.87,housenumber,35bis Rue Jean Jaurès 68360 Soultz-Haut-Rhin,68315_0480_00035_bis,G,35BIS RUE JEAN JAURES,
130012909,00623,13001290900623,O,2012-09-17,11,2020,,2022-08-29T09:03:36,false,2,,62,,RUE,JEAN JAURES,68360,SOULTZ-HAUT-RHIN,,,68315,,,,,,,,,,,,,,,,,,,2022-01-01,F,SERVICE DE GESTION COMPTABLE GUEBWILLER,,,,84.11Z,NAFRev2,N,7.229222,47.885665,0.96,housenumber,62 Rue Jean Jaurès 68360 Soultz-Haut-Rhin,68315_0480_00062,G,62 RUE JEAN JAURES,
176802114,00304,17680211400304,O,1983-03-16,,,,2019-11-14T14:00:53,false,4,,13,,RUE,DES VOSGES,68360,SOULTZ-HAUT-RHIN,,,68315,,,,,,,,,,,,,,,,,,,1996-12-01,F,TRESORERIE DE SOULTZ-HAUT-RHIN,,,,75.1A,NAF1993,N,7.228247,47.885588,0.81,street,Rue des Vosges 68360 Soultz-Haut-Rhin,68315_0900,G,RUE DES VOSGES,
176802114,00502,17680211400502,O,1996-12-01,,,,2019-11-14T14:00:53,false,4,,35,B,RUE,JEAN JAURES,68360,SOULTZ-HAUT-RHIN,,,68315,,,,,,,,,,,,,,,,,,,2010-11-15,F,TRESORERIE DE SOULTZ HAUT RHIN,,,,84.11Z,NAFRev2,N,7.22944,47.885611,0.87,housenumber,35bis Rue Jean Jaurès 68360 Soultz-Haut-Rhin,68315_0480_00035_bis,G,35BIS RUE JEAN JAURES,
186804597,00018,18680459700018,O,1985-09-30,02,2020,,2022-08-29T09:04:13,true,5,PRESBYTERE,5,,RUE,DE L EGLISE,68360,SOULTZ-HAUT-RHIN,,,68315,,,,,,,,,,,,,,,,,,,2017-01-22,A,,,,,94.91Z,NAFRev2,O,7.229457,47.887105,0.95,housenumber,5 Rue de l’Eglise 68360 Soultz-Haut-Rhin,68315_0290_00005,G,5 RUE DE L EGLISE,
196801286,00010,19680128600010,O,1983-03-01,32,2020,,2022-08-29T09:04:37,true,4,,18,,RTE,DE JUNGHOLTZ,68360,SOULTZ-HAUT-RHIN,,,68315,,,,,,,,,,,,,,,,,,,2011-02-13,A,,,,,85.31Z,NAFRev2,O,7.219631,47.881144,0.87,housenumber,18 Route de Jungholtz 68360 Soultz-Haut-Rhin,68315_0490_00018,G,18 ROUTE DE JUNGHOLTZ,
200011971,00013,20001197100013,O,2008-01-01,31,2020,,2022-08-29T09:04:56,true,1,,80,,RTE,DE GUEBWILLER,68360,SOULTZ-HAUT-RHIN,,,68315,,,,,,,,,,,,,,,,,,,2008-01-01,A,,,,,86.10Z,NAFRev2,O,7.225924,47.890806,0.88,housenumber,80 Route de Guebwiller 68360 Soultz-Haut-Rhin,68315_0430_00080,G,80 ROUTE DE GUEBWILLER,
216803155,00011,21680315500011,O,1983-03-01,21,2020,,2022-08-29T09:08:31,true,4,,,,PL,DE LA REPUBLIQUE,68360,SOULTZ-HAUT-RHIN,,,68315,,,,,,,,,,,,,,,,,,,2008-01-01,A,MAIRIE,,,,84.11Z,NAFRev2,O,7.229302,47.886296,0.86,street,Place de la Republique 68360 Soultz-Haut-Rhin,68315_0690,G,PLACE DE LA REPUBLIQUE,
216803155,00029,21680315500029,O,1983-12-21,12,2020,,2022-08-29T09:08:31,false,4,,8,,PL,DE L EGLISE,68360,SOULTZ-HAUT-RHIN,,,68315,,,,,,,,,,,,,,,,,,,2011-11-14,A,ECOLE ELEMENTAIRE KATIA ET MAURICE KRAFFT,,,,85.20Z,NAFRev2,N,7.230568,47.886518,0.85,housenumber,8 Place de l’Eglise 68360 Soultz-Haut-Rhin,68315_0280_00008,G,8 PLACE DE L EGLISE,
216803155,00045,21680315500045,O,1983-12-21,02,2020,,2022-08-29T09:08:31,false,4,,22,,RUE,DE LA MARNE,68360,SOULTZ-HAUT-RHIN,,,68315,,,,,,,,,,,,,,,,,,,2008-01-01,A,ECOLE MATERNELLE SAINT JEAN,,,,85.10Z,NAFRev2,N,7.232798,47.888453,0.96,housenumber,22 Rue de la Marne 68360 Soultz-Haut-Rhin,68315_0570_00022,G,22 RUE DE LA MARNE,
216803155,00052,21680315500052,O,1983-12-21,02,2020,,2022-11-04T14:51:34,false,3,,26,,RUE,ALBERT SCHWEITZER,68360,SOULTZ-HAUT-RHIN,,,68315,,,,,,,,,,,,,,,,,,,2008-01-01,A,ECOLE MATERNELLE LES BRUYERES,,,,85.10Z,NAFRev2,N,7.221752,47.895882,0.87,street,Rue Albert Schweitzer 68360 Soultz-Haut-Rhin,68315_0030,G,RUE ALBERT SCHWEITZER,
216803155,00060,21680315500060,O,1983-12-21,NN,,,2019-11-14T14:00:53,false,4,,,,RUE,ALBERT SCHWEITZER,68360,SOULTZ-HAUT-RHIN,,,68315,,,,,,,,,,,,,,,,,,,2008-01-01,F,ECOLE PRIMAIRE LES BRUYERES,,,,85.20Z,NAFRev2,N,7.221752,47.895882,0.96,street,Rue Albert Schweitzer 68360 Soultz-Haut-Rhin,68315_0030,G,RUE ALBERT SCHWEITZER,
216803155,00078,21680315500078,O,1983-12-21,02,2020,,2022-08-29T09:08:31,false,3,,,,RTE,DE WUENHEIM,68360,SOULTZ-HAUT-RHIN,,,68315,,,,,,,,,,,,,,,,,,,2008-01-01,A,ECOLE MATERNELLE BELLE VUE,,,,85.10Z,NAFRev2,N,7.221095,47.878335,0.85,street,Route de Wuenheim 68360 Soultz-Haut-Rhin,68315_0930,G,ROUTE DE WUENHEIM,
216803155,00086,21680315500086,O,1997-05-01,NN,,,2019-11-14T14:00:53,false,3,,,,PL,DE LA REPUBLIQUE,68360,SOULTZ-HAUT-RHIN,,BP 21,68315,,,,,,,,,,,,,,,,,,,2008-01-01,A,LOTISSEMENT COMMUNAL,,,,42.99Z,NAFRev2,N,7.229302,47.886296,0.86,street,Place de la Republique 68360 Soultz-Haut-Rhin,68315_0690,G,PLACE DE LA REPUBLIQUE,
216803155,00094,21680315500094,O,1996-12-25,NN,,,2020-08-25T10:18:39,false,3,MAIRIE,,,PL,DE LA REPUBLIQUE,68360,SOULTZ-HAUT-RHIN,,,68315,,,,,,,,,,,,,,,,,,,2018-01-01,F,SERVICE EAU,,,,36.00Z,NAFRev2,N,7.229302,47.886296,0.86,street,Place de la Republique 68360 Soultz-Haut-Rhin,68315_0690,G,PLACE DE LA REPUBLIQUE,
216803155,00102,21680315500102,O,1985-01-01,NN,,,2019-11-14T14:00:53,false,3,,,,PL,DE LA REPUBLIQUE,68360,SOULTZ-HAUT-RHIN,,,68315,,,,,,,,,,,,,,,,,,,2008-01-01,A,,,,,02.20Z,NAFRev2,N,7.229302,47.886296,0.86,street,Place de la Republique 68360 Soultz-Haut-Rhin,68315_0690,G,PLACE DE LA REPUBLIQUE,
216803155,00110,21680315500110,O,1998-01-01,NN,,,2019-11-14T14:00:53,false,4,,,,PL,DE LA REPUBLIQUE,68360,SOULTZ-HAUT-RHIN,,,68315,,,,,,,,,,,,,,,,,,,2016-01-01,F,SERVICE FERME AUBERGE,,,,55.20Z,NAFRev2,N,7.229302,47.886296,0.86,street,Place de la Republique 68360 Soultz-Haut-Rhin,68315_0690,G,PLACE DE LA REPUBLIQUE,
216803155,00136,21680315500136,O,2014-12-25,02,2019,,2021-10-27T08:10:00,false,1,,7,,PL,DE L EGLISE,68360,SOULTZ-HAUT-RHIN,,,68315,,,,,,,,,,,,,,,,,,,2014-12-25,A,MEDIATHEQUE,,,,91.01Z,NAFRev2,N,7.230677,47.886561,0.85,housenumber,7 Place de l’Eglise 68360 Soultz-Haut-Rhin,68315_0280_00007,G,7 PLACE DE L EGLISE,
216803155,00144,21680315500144,O,2014-12-25,03,2019,,2021-10-27T08:10:00,false,1,,,,RUE,JEAN JAURES,68360,SOULTZ-HAUT-RHIN,,,68315,,,,,,,,,,,,,,,,,,,2014-12-25,A,MUSEES,,,,91.02Z,NAFRev2,N,7.229101,47.885873,0.96,street,Rue Jean Jaurès 68360 Soultz-Haut-Rhin,68315_0480,G,RUE JEAN JAURES,
216803155,00151,21680315500151,O,2014-12-25,02,2019,,2021-10-27T08:10:00,false,1,,,,RUE,DE LA MARNE,68360,SOULTZ-HAUT-RHIN,,,68315,,,,,,,,,,,,,,,,,,,2014-12-25,A,SERVICE JEUNESSE,,,,84.11Z,NAFRev2,N,7.231775,47.887029,0.96,street,Rue de la Marne 68360 Soultz-Haut-Rhin,68315_0570,G,RUE DE LA MARNE,
216803155,00169,21680315500169,O,2014-12-25,02,2019,,2021-10-27T08:10:00,false,1,,4,,RUE,JEAN JAURES,68360,SOULTZ-HAUT-RHIN,,,68315,,,,,,,,,,,,,,,,,,,2014-12-25,A,POLICE MUNICIPALE,,,,84.24Z,NAFRev2,N,7.22761,47.888394,0.96,housenumber,4 Rue Jean Jaurès 68360 Soultz-Haut-Rhin,68315_0480_00004,G,4 RUE JEAN JAURES,
216803155,00177,21680315500177,O,2014-12-25,12,2019,,2021-10-27T08:10:00,false,1,,,,RUE,DE L ABATTOIR,68360,SOULTZ-HAUT-RHIN,,,68315,,,,,,,,,,,,,,,,,,,2014-12-25,A,SERVICES TECHNIQUES,,,,84.11Z,NAFRev2,N,7.231142,47.889772,0.95,street,Rue de l’Abattoir 68360 Soultz-Haut-Rhin,68315_0010,G,RUE DE L ABATTOIR,
256800400,00010,25680040000010,O,,NN,,,2019-11-14T14:00:53,true,1,,18,,RTE,DE JUNGHOLTZ,68360,SOULTZ-HAUT-RHIN,,,68315,,,,,,,,,,,,,,,,,,,1997-01-01,F,,,,,75.1C,NAF1993,O,7.219631,47.881144,0.87,housenumber,18 Route de Jungholtz 68360 Soultz-Haut-Rhin,68315_0490_00018,G,18 ROUTE DE JUNGHOLTZ,
256800459,00016,25680045900016,O,1983-03-01,NN,,,2019-11-14T14:00:53,true,5,MAIRIE,,,PL,DE LA REPUBLIQUE,68360,SOULTZ-HAUT-RHIN,,,68315,,,,,,,,,,,,,,,,,,,2008-01-01,F,,,,,42.99Z,NAFRev2,N,7.229302,47.886296,0.86,street,Place de la Republique 68360 Soultz-Haut-Rhin,68315_0690,G,PLACE DE LA REPUBLIQUE,
256801598,00010,25680159800010,O,,NN,,,2019-11-14T14:00:53,true,1,,,,PL,DE LA REPUBLIQUE,68360,SOULTZ-HAUT-RHIN,,,68315,,,,,,,,,,,,,,,,,,,1991-07-01,F,,,,,90.11,NAP,N,7.229302,47.886296,0.86,street,Place de la Republique 68360 Soultz-Haut-Rhin,68315_0690,G,PLACE DE LA REPUBLIQUE,
256801606,00011,25680160600011,O,,NN,,,2019-11-14T14:00:53,true,1,,,,PL,DE LA REPUBLIQUE,68360,SOULTZ-HAUT-RHIN,,,68315,,,,,,,,,,,,,,,,,,,1991-07-01,F,,,,,90.11,NAP,N,7.229302,47.886296,0.86,street,Place de la Republique 68360 Soultz-Haut-Rhin,68315_0690,G,PLACE DE LA REPUBLIQUE,
256802091,00023,25680209100023,O,1989-05-05,NN,,,2019-11-14T14:00:53,false,3,,4,,RUE,JEAN JAURES,68360,SOULTZ-HAUT-RHIN,,,68315,,,,,,,,,,,,,,,,,,,1997-10-01,F,BRIGADE VERTE,,,,75.1G,NAF1993,O,7.22761,47.888394,0.96,housenumber,4 Rue Jean Jaurès 68360 Soultz-Haut-Rhin,68315_0480_00004,G,4 RUE JEAN JAURES,
256802091,00031,25680209100031,O,1997-10-01,21,2020,,2022-08-29T09:10:08,false,3,CHATEAU W.DE FREUNDSTEIN,92,,RUE,MAL DE LATTRE DE TASSIGNY,68360,SOULTZ-HAUT-RHIN,,,68315,,,,,,,,,,,,,,,,,,,2008-01-01,A,BRIGADE VERTE,,,,84.11Z,NAFRev2,O,7.225888,47.883806,0.97,housenumber,92 Rue Mal de Lattre de Tassigny 68360 Soultz-Haut-Rhin,68315_0560_00092,G,92 RUE MAL DE LATTRE DE TASSIGNY,
256802091,00049,25680209100049,O,2020-12-14,,,,2020-12-16T08:32:27,true,1,CHATEAU WALDNER DE FREUNDSTEIN,92,,RUE,MAL DE LATTRE DE TASSIGNY,68360,SOULTZ-HAUT-RHIN,,,68315,,,,,,,,,,,,,,,,,,,2020-12-14,A,,,,,84.11Z,NAFRev2,N,7.225888,47.883806,0.97,housenumber,92 Rue Mal de Lattre de Tassigny 68360 Soultz-Haut-Rhin,68315_0560_00092,G,92 RUE MAL DE LATTRE DE TASSIGNY,
256802711,00018,25680271100018,O,1997-01-01,NN,,,2019-11-14T14:00:53,true,4,,18,,RTE,DE JUNGHOLTZ,68360,SOULTZ-HAUT-RHIN,,,68315,,,,,,,,,,,,,,,,,,,2010-01-01,F,,,,,84.12Z,NAFRev2,N,7.219631,47.881144,0.87,housenumber,18 Route de Jungholtz 68360 Soultz-Haut-Rhin,68315_0490_00018,G,18 ROUTE DE JUNGHOLTZ,
266800812,00015,26680081200015,O,1983-03-01,NN,,,2019-11-14T14:00:53,true,3,MAIRIE,,,PL,DE LA REPUBLIQUE,68360,SOULTZ-HAUT-RHIN,,,68315,,,,,,,,,,,,,,,,,,,2008-01-01,A,CCAS SOULTZ,,,,88.99B,NAFRev2,N,7.229302,47.886296,0.86,street,Place de la Republique 68360 Soultz-Haut-Rhin,68315_0690,G,PLACE DE LA REPUBLIQUE,
266800952,00019,26680095200019,O,1983-03-01,NN,,,2019-11-14T14:00:53,true,4,,80,,RTE,DE GUEBWILLER,68360,SOULTZ-HAUT-RHIN,,,68315,,,,,,,,,,,,,,,,,,,2007-12-31,F,,,,,85.1A,NAFRev1,O,7.225924,47.890806,0.88,housenumber,80 Route de Guebwiller 68360 Soultz-Haut-Rhin,68315_0430_00080,G,80 ROUTE DE GUEBWILLER,
266800952,00027,26680095200027,O,1985-09-20,NN,,,2019-11-14T14:00:53,false,4,,80,,RTE,DE GUEBWILLER,68360,SOULTZ-HAUT-RHIN,,,68315,,,,,,,,,,,,,,,,,,,2007-12-31,F,MAISON DE RETRAITE HOPITAL LOCAL SOULTZ,,,,85.3D,NAFRev1,O,7.225924,47.890806,0.88,housenumber,80 Route de Guebwiller 68360 Soultz-Haut-Rhin,68315_0430_00080,G,80 ROUTE DE GUEBWILLER,
266800952,00035,26680095200035,O,1988-01-01,NN,,,2019-11-14T14:00:53,false,4,,80,,RTE,DE GUEBWILLER,68360,SOULTZ-HAUT-RHIN,,,68315,,,,,,,,,,,,,,,,,,,2007-12-31,F,LONG SEJOUR DE L'HOPITAL LOCAL DE SOULTZ,,,,85.1A,NAFRev1,O,7.225924,47.890806,0.88,housenumber,80 Route de Guebwiller 68360 Soultz-Haut-Rhin,68315_0430_00080,G,80 ROUTE DE GUEBWILLER,
266800952,00043,26680095200043,O,1993-05-01,NN,,,2019-11-14T14:00:53,false,3,HOPITAL DE SOULTZ,80,,RTE,DE GUEBWILLER,68360,SOULTZ-HAUT-RHIN,,,68315,,,,,,,,,,,,,,,,,,,2007-12-31,F,SSIDPA-SOULTZ,,,,85.3J,NAFRev1,N,7.225924,47.890806,0.88,housenumber,80 Route de Guebwiller 68360 Soultz-Haut-Rhin,68315_0430_00080,G,80 ROUTE DE GUEBWILLER,
266800952,00050,26680095200050,O,2002-12-25,,,,2019-11-14T14:00:53,false,2,,80,,RTE,DE GUEBWILLER,68360,SOULTZ-HAUT-RHIN,,,68315,,,,,,,,,,,,,,,,,,,2007-12-31,F,DOTATION NON AFFECTEE,,,,70.3E,NAFRev1,N,7.225924,47.890806,0.88,housenumber,80 Route de Guebwiller 68360 Soultz-Haut-Rhin,68315_0430_00080,G,80 ROUTE DE GUEBWILLER,
276800570,00018,27680057000018,O,,NN,,,2019-11-14T14:00:53,true,1,,,,PL,DE LA REPUBLIQUE,68360,SOULTZ-HAUT-RHIN,,,68315,,,,,,,,,,,,,,,,,,,1996-12-25,F,,,,,41.0Z,NAF1993,N,7.229302,47.886296,0.86,street,Place de la Republique 68360 Soultz-Haut-Rhin,68315_0690,G,PLACE DE LA REPUBLIQUE,
296800741,00013,29680074100013,O,1983-08-10,NN,,,2019-11-14T14:00:53,true,3,MAIRIE,,,PL,DE LA REPUBLIQUE,68360,SOULTZ-HAUT-RHIN,,,68315,,,,,,,,,,,,,,,,,,,2008-01-01,A,,,,,42.99Z,NAFRev2,N,7.229302,47.886296,0.86,street,Place de la Republique 68360 Soultz-Haut-Rhin,68315_0690,G,PLACE DE LA REPUBLIQUE,
300513231,00047,30051323100047,O,1982-10-01,NN,,,2019-11-14T14:00:53,true,4,,1,,RUE,DE L AVENIR,68360,SOULTZ-HAUT-RHIN,,,68315,,,,,,,,,,,,,,,,,,,2010-03-30,F,,,,,96.02A,NAFRev2,N,7.231467,47.880276,0.96,housenumber,1 Rue de l’Avenir 68360 Soultz-Haut-Rhin,68315_0075_00001,G,1 RUE DE L AVENIR,
301444527,00016,30144452700016,O,1974-01-01,NN,,,2019-11-14T14:00:53,true,1,,18,,RUE,MAL DE LATTRE DE TASSIGNY,68360,SOULTZ-HAUT-RHIN,,,68315,,,,,,,,,,,,,,,,,,,2000-04-30,F,,,,,52.2C,NAF1993,O,7.228681,47.88495,0.97,housenumber,18 Rue Mal de Lattre de Tassigny 68360 Soultz-Haut-Rhin,68315_0560_00018,G,18 RUE MAL DE LATTRE DE TASSIGNY,
301590253,00045,30159025300045,O,2008-09-05,NN,,,2019-11-14T14:00:53,false,2,,,,RTE,DE BOLLWILLER,68360,SOULTZ-HAUT-RHIN,,,68315,,,,,,,,,,,,,,,,,,,2010-01-20,F,,,,,45.20A,NAFRev2,O,7.234889,47.881498,0.86,street,Route de Bollwiller 68360 Soultz-Haut-Rhin,68315_0090,G,ROUTE DE BOLLWILLER,
301910691,00015,30191069100015,O,,,,,2019-11-14T14:00:53,true,1,,,,RUE,JEAN JAURES,68360,SOULTZ-HAUT-RHIN,,,68315,,,,,,,,,,,,,,,,,,,1984-12-25,F,,,,,67.07,NAP,N,7.229101,47.885873,0.96,street,Rue Jean Jaurès 68360 Soultz-Haut-Rhin,68315_0480,G,RUE JEAN JAURES,
301933073,00019,30193307300019,O,,NN,,,2019-11-14T14:00:53,true,1,,26,,RUE,MAL DE LATTRE DE TASSIGNY,68360,SOULTZ-HAUT-RHIN,,,68315,,,,,,,,,,,,,,,,,,,1987-03-31,F,,,,,64.48,NAP,N,7.228196,47.884626,0.97,housenumber,26 Rue Mal de Lattre de Tassigny 68360 Soultz-Haut-Rhin,68315_0560_00026,G,26 RUE MAL DE LATTRE DE TASSIGNY,
301962833,00010,30196283300010,O,1974-01-01,NN,,,2019-11-14T14:00:53,true,4,,1,,RUE,MAL DE LATTRE DE TASSIGNY,68360,SOULTZ-HAUT-RHIN,,,68315,,,,,,,,,,,,,,,,,,,2003-06-30,F,,,,,74.1J,NAFRev1,N,7.229511,47.885344,0.97,housenumber,1 Rue Mal de Lattre de Tassigny 68360 Soultz-Haut-Rhin,68315_0560_00001,G,1 RUE MAL DE LATTRE DE TASSIGNY,
301964730,00016,30196473000016,O,,,,,2019-11-14T14:00:53,true,1,,,,RUE,JEAN JAURES,68360,SOULTZ-HAUT-RHIN,,,68315,,,,,,,,,,,,,,,,,,,1984-12-25,F,,,,,67.04,NAP,N,7.229101,47.885873,0.96,street,Rue Jean Jaurès 68360 Soultz-Haut-Rhin,68315_0480,G,RUE JEAN JAURES,
302035415,00025,30203541500025,O,1985-08-01,NN,,,2019-11-14T14:00:53,true,3,,23,,RTE,DE BOLLWILLER,68360,SOULTZ-HAUT-RHIN,,,68315,,,,,,,,,,,,,,,,,,,2008-01-01,A,,,,,68.20B,NAFRev2,N,7.236597,47.880346,0.88,housenumber,23 Route de Bollwiller 68360 Soultz-Haut-Rhin,68315_0090_00023,G,23 ROUTE DE BOLLWILLER,
302131727,00018,30213172700018,O,,,,,2019-11-14T14:00:53,true,1,,9,,RUE,DES JARDINS,68360,SOULTZ-HAUT-RHIN,,,68315,,,,,,,,,,,,,,,,,,,1991-09-15,F,,,,,55.40,NAP,N,7.229167,47.880772,0.96,housenumber,9 Rue des Jardins 68360 Soultz-Haut-Rhin,68315_0470_00009,G,9 RUE DES JARDINS,
302302476,00049,30230247600049,O,,NN,,,2019-11-14T14:00:53,true,1,,9,,RTE,D ISSENHEIM,68360,SOULTZ-HAUT-RHIN,,,68315,,,,,,,,,,,,,,,,,,,1994-09-30,F,,,,,70.2C,NAF1993,N,7.22709,47.893887,0.86,housenumber,9 Route d’Issenheim 68360 Soultz-Haut-Rhin,68315_0460_00009,G,9 ROUTE D ISSENHEIM,
302581400,00017,30258140000017,O,,NN,,,2019-11-14T14:00:53,true,1,,28,,RTE,DE WUENHEIM,68360,SOULTZ-HAUT-RHIN,,,68315,,,,,,,,,,,,,,,,,,,1995-12-25,F,,,,,70.2C,NAF1993,N,7.220873,47.878182,0.87,housenumber,28 Route de Wuenheim 68360 Soultz-Haut-Rhin,68315_0930_00028,G,28 ROUTE DE WUENHEIM,
302582358,00016,30258235800016,O,,,,,2019-11-14T14:00:53,true,1,,28,,RTE,DE WUENHEIM,68360,SOULTZ-HAUT-RHIN,,,68315,,,,,,,,,,,,,,,,,,,1992-03-15,F,,,,,55.1A,NAF1993,N,7.220873,47.878182,0.87,housenumber,28 Route de Wuenheim 68360 Soultz-Haut-Rhin,68315_0930_00028,G,28 ROUTE DE WUENHEIM,
302589239,00086,30258923900086,O,1999-09-15,,,,2019-11-14T14:00:53,false,3,,17,,RTE,DE GUEBWILLER,68360,SOULTZ-HAUT-RHIN,,,68315,,,,,,,,,,,,,,,,,,,2000-12-31,F,,,,,52.4J,NAF1993,N,7.224162,47.895313,0.88,housenumber,17 Route de Guebwiller 68360 Soultz-Haut-Rhin,68315_0430_00017,G,17 ROUTE DE GUEBWILLER,
302589262,00021,30258926200021,O,,,,,2019-11-14T14:00:53,true,1,,2,,PL,DU 17 NOVEMBRE,68360,SOULTZ-HAUT-RHIN,,,68315,,,,,,,,,,,,,,,,,,,1988-10-31,F,,,,,64.42,NAP,N,7.231162,47.884061,0.87,housenumber,2 Place du 17 Novembre 68360 Soultz-Haut-Rhin,68315_0250_00002,G,2 PLACE DU 17 NOVEMBRE,
303215511,00146,30321551100146,O,1999-01-01,NN,,,2019-11-18T20:24:46,false,4,,25,,RTE,D ISSENHEIM,68360,SOULTZ-HAUT-RHIN,,,68315,,,,,,,,,,,,,,,,,,,2017-12-31,F,SA ALPHA,,,,38.11Z,NAFRev2,N,7.229278,47.896249,0.87,housenumber,25 Route d’Issenheim 68360 Soultz-Haut-Rhin,68315_0460_00025,G,25 ROUTE D ISSENHEIM,
303877856,00011,30387785600011,O,1900-01-01,NN,,,2019-11-14T14:00:53,true,5,,4,,RUE,DE L INDUSTRIE,68360,SOULTZ-HAUT-RHIN,,,68315,,,,,,,,,,,,,,,,,,,2010-03-23,F,,,,,28.30Z,NAFRev2,O,7.233411,47.894705,0.96,housenumber,4 Rue de l’Industrie 68360 Soultz-Haut-Rhin,68315_0455_00004,G,4 RUE DE L INDUSTRIE,
303928527,00017,30392852700017,O,,NN,,,2019-11-14T14:00:53,true,1,,4,,IMP,DES SORCIERES,68360,SOULTZ-HAUT-RHIN,,,68315,,,,,,,,,,,,,,,,,,,1983-03-01,F,,,,,55.72,NAP,N,7.22743,47.882205,0.85,housenumber,4 Impasse des Sorcieres 68360 Soultz-Haut-Rhin,68315_0780_00004,G,4 IMPASSE DES SORCIERES,
303951057,00023,30395105700023,O,,NN,,,2019-11-14T14:00:53,true,1,,5,,RTE,DE BOLLWILLER,68360,SOULTZ-HAUT-RHIN,,,68315,,,,,,,,,,,,,,,,,,,1981-12-31,F,,,,,55.60,NAP,N,7.233996,47.882088,0.87,housenumber,5 Route de Bollwiller 68360 Soultz-Haut-Rhin,68315_0090_00005,G,5 ROUTE DE BOLLWILLER,
303967350,00057,30396735000057,O,1989-01-01,NN,,,2019-11-14T14:00:53,false,3,,13,A,RUE,DES SOEURS,68360,SOULTZ-HAUT-RHIN,,,68315,,,,,,,,,,,,,,,,,,,2004-01-14,F,,,,,52.4C,NAFRev1,N,7.230754,47.885605,0.79,street,Rue des Soeurs 68360 Soultz-Haut-Rhin,68315_0770,G,RUE DES SOEURS,
303990485,00011,30399048500011,O,,,,,2019-11-14T14:00:53,true,1,,28,,RUE,SAINT GEORGES,68360,SOULTZ-HAUT-RHIN,,,68315,,,,,,,,,,,,,,,,,,,1987-12-31,F,,,,,55.70,NAP,N,7.23109,47.880357,0.96,housenumber,28 Rue Saint-Georges 68360 Soultz-Haut-Rhin,68315_0720_00028,G,28 RUE SAINT GEORGES,
304272271,00012,30427227100012,O,1975-01-01,NN,,,2019-11-14T14:00:53,true,4,,14,,RUE,MAL DE LATTRE DE TASSIGNY,68360,SOULTZ-HAUT-RHIN,,,68315,,,,,,,,,,,,,,,,,,,2003-05-31,F,,,,,15.8C,NAFRev1,O,7.228859,47.885054,0.97,housenumber,14 Rue Mal de Lattre de Tassigny 68360 Soultz-Haut-Rhin,68315_0560_00014,G,14 RUE MAL DE LATTRE DE TASSIGNY,
304394018,00028,30439401800028,O,1988-08-30,,,,2019-11-14T14:00:53,false,3,,22,,RUE,MAL DE LATTRE DE TASSIGNY,68360,SOULTZ-HAUT-RHIN,,,68315,,,,,,,,,,,,,,,,,,,1993-12-01,F,SALON VALERIE,,,,93.0D,NAF1993,,7.228428,47.884791,0.97,housenumber,22 Rue Mal de Lattre de Tassigny 68360 Soultz-Haut-Rhin,68315_0560_00022,G,22 RUE MAL DE LATTRE DE TASSIGNY,
304475650,00012,30447565000012,O,,NN,,,2019-11-14T14:00:53,true,1,,2,,PL,DU 17 NOVEMBRE,68360,SOULTZ-HAUT-RHIN,,,68315,,,,,,,,,,,,,,,,,,,2001-12-31,F,,,,,70.2C,NAF1993,N,7.231162,47.884061,0.87,housenumber,2 Place du 17 Novembre 68360 Soultz-Haut-Rhin,68315_0250_00002,G,2 PLACE DU 17 NOVEMBRE,
304771611,00015,30477161100015,O,,,,,2019-11-14T14:00:53,true,1,,4,,RUE,DES PRETES,68360,SOULTZ-HAUT-RHIN,,,68315,,,,,,,,,,,,,,,,,,,1984-12-25,F,,,,,,,N,7.23538,47.886032,0.8,housenumber,4 Rue des Prés 68360 Soultz-Haut-Rhin,68315_0640_00004,G,4 RUE DES PRES,
305918732,00044,30591873200044,O,1998-01-01,NN,,,2019-11-14T14:00:53,false,4,,27,B,RUE,DU VIEIL ARMAND,68360,SOULTZ-HAUT-RHIN,,,68315,,,,,,,,,,,,,,,,,,,2001-01-01,F,,,,,70.2A,NAF1993,O,7.228775,47.881569,0.89,housenumber,27bis Rue du Vieil Armand 68360 Soultz-Haut-Rhin,68315_0870_00027_bis,G,27BIS RUE DU VIEIL ARMAND,
305919193,00022,30591919300022,O,1996-05-02,NN,,,2019-11-14T14:00:53,false,3,,47,,RTE,DE GUEBWILLER,68360,SOULTZ-HAUT-RHIN,,,68315,,,,,,,,,,,,,,,,,,,2003-03-31,F,SOULTZ AUTOMOBILES,,,,50.2Z,NAFRev1,,7.225996,47.892775,0.88,housenumber,47 Route de Guebwiller 68360 Soultz-Haut-Rhin,68315_0430_00047,G,47 ROUTE DE GUEBWILLER,
306443128,00039,30644312800039,O,1980-08-01,NN,,,2019-11-14T14:00:53,true,4,,7,,RUE,DE L INDUSTRIE,68360,SOULTZ-HAUT-RHIN,,,68315,,,,,,,,,,,,,,,,,,,2005-05-01,F,,,,,18.2D,NAFRev1,O,7.234375,47.895116,0.96,housenumber,7 Rue de l’Industrie 68360 Soultz-Haut-Rhin,68315_0455_00007,G,7 RUE DE L INDUSTRIE,
306621350,00017,30662135000017,O,,NN,,,2019-11-14T14:00:53,true,1,,24,,RUE,MAL DE LATTRE DE TASSIGNY,68360,SOULTZ-HAUT-RHIN,,,68315,,,,,,,,,,,,,,,,,,,,F,,,,,64.49,NAP,N,7.228319,47.884706,0.97,housenumber,24 Rue Mal de Lattre de Tassigny 68360 Soultz-Haut-Rhin,68315_0560_00024,G,24 RUE MAL DE LATTRE DE TASSIGNY,
306658394,00045,30665839400045,O,2003-06-01,NN,,,2019-11-14T14:00:53,true,4,,14,,RUE,MAL DE LATTRE DE TASSIGNY,68360,SOULTZ-HAUT-RHIN,,,68315,,,,,,,,,,,,,,,,,,,2010-01-27,F,,,,,10.71C,NAFRev2,O,7.228859,47.885054,0.97,housenumber,14 Rue Mal de Lattre de Tassigny 68360 Soultz-Haut-Rhin,68315_0560_00014,G,14 RUE MAL DE LATTRE DE TASSIGNY,
307321992,00033,30732199200033,O,,,,,2019-11-14T14:00:53,true,1,,,,,ZONE INDUSTRIELLE,68360,SOULTZ-HAUT-RHIN,,,68315,,,,,,,,,,,,,,,,,,,1989-03-16,F,,,,,69.12,NAP,N,5.0269111,45.7705982,0.92,poi.industrial,Zone Industrielle Meyzieu,https://osm.org/way/117589602,G,,
307396861,00014,30739686100014,O,1900-01-01,NN,,,2019-11-14T14:00:53,true,5,,18,,RUE,JEAN JAURES,68360,SOULTZ-HAUT-RHIN,,,68315,,,,,,,,,,,,,,,,,,,2015-03-29,F,,,,,86.21Z,NAFRev2,O,7.228396,47.887692,0.96,housenumber,18 Rue Jean Jaurès 68360 Soultz-Haut-Rhin,68315_0480_00018,G,18 RUE JEAN JAURES,
307396945,00031,30739694500031,O,1998-03-25,NN,,,2019-11-14T14:00:53,true,3,,12,,RUE,GEICHLEN,68360,SOULTZ-HAUT-RHIN,,,68315,,,,,,,,,,,,,,,,,,,2004-06-30,F,,,,,85.1C,NAFRev1,N,7.225025,47.889024,0.9,housenumber,12 Rue du Geichlen 68360 Soultz-Haut-Rhin,68315_0380_00012,G,12 RUE DU GEICHLEN,
307711689,00017,30771168900017,O,1900-01-01,NN,,,2019-11-14T14:00:53,false,4,,25,,RUE,JEAN JAURES,68360,SOULTZ-HAUT-RHIN,,,68315,,,,,,,,,,,,,,,,,,,1999-03-01,F,,,,,52.4H,NAF1993,O,7.228676,47.886109,0.96,housenumber,25 Rue Jean Jaurès 68360 Soultz-Haut-Rhin,68315_0480_00025,G,25 RUE JEAN JAURES,
307729285,00014,30772928500014,O,,NN,,,2019-11-14T14:00:53,true,1,,23,,RUE,JEAN JAURES,68360,SOULTZ-HAUT-RHIN,,,68315,,,,,,,,,,,,,,,,,,,1990-06-30,F,,,,,67.04,NAP,N,7.22861,47.886223,0.96,housenumber,23 Rue Jean Jaurès 68360 Soultz-Haut-Rhin,68315_0480_00023,G,23 RUE JEAN JAURES,