siren,nic,siret,statutDiffusionEtablissement,dateCreationEtablissement,trancheEffectifsEtablissement,anneeEffectifsEtablissement,activitePrincipaleRegistreMetiersEtablissement,dateDernierTraitementEtablissement,etablissementSiege,nombrePeriodesEtablissement,complementAdresseEtablissement,numeroVoieEtablissement,indiceRepetitionEtablissement,typeVoieEtablissement,libelleVoieEtablissement,codePostalEtablissement,libelleCommuneEtablissement,libelleCommuneEtrangerEtablissement,distributionSpecialeEtablissement,codeCommuneEtablissement,codeCedexEtablissement,libelleCedexEtablissement,codePaysEtrangerEtablissement,libellePaysEtrangerEtablissement,complementAdresse2Etablissement,numeroVoie2Etablissement,indiceRepetition2Etablissement,typeVoie2Etablissement,libelleVoie2Etablissement,codePostal2Etablissement,libelleCommune2Etablissement,libelleCommuneEtranger2Etablissement,distributionSpeciale2Etablissement,codeCommune2Etablissement,codeCedex2Etablissement,libelleCedex2Etablissement,codePaysEtranger2Etablissement,libellePaysEtranger2Etablissement,dateDebut,etatAdministratifEtablissement,enseigne1Etablissement,enseigne2Etablissement,enseigne3Etablissement,denominationUsuelleEtablissement,activitePrincipaleEtablissement,nomenclatureActivitePrincipaleEtablissement,caractereEmployeurEtablissement,longitude,latitude,geo_score,geo_type,geo_adresse,geo_id,geo_ligne,geo_l4,geo_l5
216901561,00011,21690156100011,O,1983-03-01,12,2020,,2022-08-29T09:08:33,true,4,HOTEL DE VILLE,,,,,69480,POMMIERS,,,69156,,,,,,,,,,,,,,,,,,,2008-01-01,A,MAIRIE,,,,84.11Z,NAFRev2,O,4.705719,45.96332,0.35,street,Voie Communale Montee de Bellevue 69480 Pommiers,69156_0097,D,VOIE COMMUNALE MONT DE BELLEVUE,
216901561,00029,21690156100029,O,1983-12-21,11,2020,,2022-08-29T09:08:33,false,4,,97,,RUE,DE LA MAIRIE,69480,POMMIERS,,,69156,,,,,,,,,,,,,,,,,,,2008-01-01,A,ECOLE PRIMAIRE PUBLIQUE,,,,85.20Z,NAFRev2,N,4.693505,45.95596,0.95,housenumber,97 Rue de la Mairie 69480 Pommiers,69156_0086_00097,G,97 RUE DE LA MAIRIE,
216901561,00037,21690156100037,O,1994-01-01,NN,,,2006-10-26T23:41:30,false,3,MAIRIE,,,,,69480,POMMIERS,,,69156,,,,,,,,,,,,,,,,,,,2004-09-10,F,SERVICE ASSAINISSEMENT DE POMMIERS,,,,90.0A,NAFRev1,N,4.69444,45.956454,0.93,street,Rue de la Mairie 69480 Pommiers,69156_0086,D,RUE DE LA MAIRIE,
246900658,00054,24690065800054,O,2002-10-09,NN,,,2013-10-23T15:14:06,false,4,,,,,BEL AIR LOGERE,69480,POMMIERS,,,69156,,,,,,,,,,,,,,,,,,,2014-01-01,F,ZAC ZONE DE BEL AIR LOGERE,,,,42.99Z,NAFRev2,N,4.713935,45.963459,0.56,street,Bel Air 69480 Pommiers,69156_B001,G,BEL AIR,
266901271,00012,26690127100012,O,1994-02-28,NN,,,2010-06-26T03:14:35,true,3,,,,,HOTEL DE VILLE,69480,POMMIERS,,,69156,,,,,,,,,,,,,,,,,,,2008-01-01,A,CCAS,,,,88.99B,NAFRev2,N,4.705719,45.96332,0.35,street,Voie Communale Montee de Bellevue 69480 Pommiers,69156_0097,G,VOIE COMMUNALE MONT DE BELLEVUE,
296900665,00013,29690066500013,O,1995-03-02,NN,,,2008-01-04T19:07:48,true,3,,,,,MAIRIE,69480,POMMIERS,,,69156,,,,,,,,,,,,,,,,,,,2008-01-01,A,,,,,42.99Z,NAFRev2,N,4.69444,45.956454,0.93,street,Rue de la Mairie 69480 Pommiers,69156_0086,G,RUE DE LA MAIRIE,
300790573,00038,30079057300038,O,2012-02-01,,,8211ZP,2021-02-23T10:35:47,true,1,,51,,IMP,DU CHIRAT,69480,POMMIERS,,,69156,,,,,,,,,,,,,,,,,,,2012-02-01,A,,,,JO SAUNIER EIRL,82.19Z,NAFRev2,N,4.707468,45.959011,0.84,housenumber,51 Impasse du Chirat 69480 Pommiers,69156_0030_00051,G,51 IMPASSE DU CHIRAT,
300840659,00019,30084065900019,O,1974-01-01,NN,,,,true,1,,,,,LIEU DE BUISSANTE,69480,POMMIERS,,,69156,,,,,,,,,,,,,,,,,,,1999-04-15,F,,,,,70.2C,NAF1993,N,4.703345,45.963399,0.59,street,Voie Communale Boucle de Buisante 69480 Pommiers,69156_0033,G,VOIE COMMUNALE BOUC DE BUISANTE,
300840667,00012,30084066700012,O,,,,,,true,1,,,,RUE,DE BEL AIR,69480,POMMIERS,,,69156,,,,,,,,,,,,,,,,,,,1984-12-25,F,,,,,55.60,NAP,N,4.710312,45.960485,0.76,street,Montee de Bel Air 69480 Pommiers,69156_p15ixv,G,MONTEE DE BEL AIR,
301386785,00028,30138678500028,O,1900-01-01,NN,,,2008-01-04T19:14:46,true,3,,,,,LIEU DE CHAMPAGNE,69480,POMMIERS,,,69156,,,,,,,,,,,,,,,,,,,2008-01-01,A,,,,,68.20B,NAFRev2,N,4.69352,45.961116,0.69,street,Chemin de Champagne 69480 Pommiers,69156_0023,G,CHEMIN DE CHAMPAGNE,
301888202,00019,30188820200019,O,,NN,,,,true,1,,,,LD,DU BEL AIR,69480,POMMIERS,,,69156,,,,,,,,,,,,,,,,,,,,F,,,,,81.21,NAP,N,4.713935,45.963459,0.71,street,Bel Air 69480 Pommiers,69156_B001,G,BEL AIR,
302602149,00015,30260214900015,O,1975-01-01,NN,,,2008-11-07T00:18:36,false,4,,,,CHE,DE NEYRA,69480,POMMIERS,,,69156,,,,,,,,,,,,,,,,,,,2002-05-31,F,,,,,45.3A,NAF1993,N,4.690316,45.952595,0.6,street,Chemin du Neyra 69480 Pommiers,69156_0095,G,CHEMIN DU NEYRA,
302602149,00023,30260214900023,O,1997-05-28,NN,,,2008-01-04T19:21:17,true,3,,,,CHE,DE NEYRA,69480,POMMIERS,,,69156,,,,,,,,,,,,,,,,,,,2008-01-01,A,,,,,01.21Z,NAFRev2,N,4.690316,45.952595,0.6,street,Chemin du Neyra 69480 Pommiers,69156_0095,G,CHEMIN DU NEYRA,
302630249,00027,30263024900027,O,1991-08-15,NN,,,,true,1,,,,CHE,DE TREZETTE,69480,POMMIERS,,,69156,,,,,,,,,,,,,,,,,,,2002-06-30,F,,,,,15.8C,NAF1993,O,4.694315,45.955351,0.84,street,Chemin de Trezette 69480 Pommiers,69156_0140,G,CHEMIN DE TREZETTE,
302930862,00016,30293086200016,O,,,,,,true,1,,,,,BUISANTE,69480,POMMIERS,,,69156,,,,,,,,,,,,,,,,,,,1988-03-31,F,,,,,55.3A,NAF1993,N,4.700232,45.963036,0.93,street,Montee de Buisante 69480 Pommiers,69156_ob4906,G,MONTEE DE BUISANTE,
303386544,00033,30338654400033,O,2000-02-22,NN,,,2013-04-18T15:34:52,false,4,LE CARRY,,,IMP,DU MANOIR,69480,POMMIERS,,,69156,,,,,,,,,,,,,,,,,,,2013-01-17,F,,,,,66.22Z,NAFRev2,N,4.691933,45.970892,0.81,street,Impasse du Manoir 69480 Pommiers,69156_0088,G,IMPASSE DU MANOIR,
303386544,00041,30338654400041,O,2012-01-01,,,,2021-02-23T10:36:29,true,1,,,,IMP,DU MANOIR,69480,POMMIERS,,,69156,,,,,,,,,,,,,,,,,,,2012-01-01,A,,,,,01.21Z,NAFRev2,N,4.691933,45.970892,0.81,street,Impasse du Manoir 69480 Pommiers,69156_0088,G,IMPASSE DU MANOIR,
303442206,00015,30344220600015,O,1900-01-01,NN,,,2014-01-11T13:07:53,true,4,,,,,CHALIER,69480,POMMIERS,,,69156,,,,,,,,,,,,,,,,,,,2013-12-25,F,,,,,01.21Z,NAFRev2,N,4.677525,45.95518,0.93,street,Montee de Chalier 69480 Pommiers,69156_0m7w9i,G,MONTEE DE CHALIER,
303442438,00014,30344243800014,O,1900-01-01,NN,,,2015-07-22T03:54:19,true,4,,,,,CHALIER,69480,POMMIERS,,,69156,,,,,,,,,,,,,,,,,,,2012-12-31,F,,,,,01.21Z,NAFRev2,N,4.677525,45.95518,0.93,street,Montee de Chalier 69480 Pommiers,69156_0m7w9i,G,MONTEE DE CHALIER,
303442438,00022,30344243800022,O,2003-01-02,NN,,,2009-08-21T12:25:23,false,6,,,,MTE,DE CHALIER,69480,POMMIERS,,,69156,,,,,,,,,,,,,,,,,,,2008-12-31,F,GALOCH'EXPRESS,,,,49.41B,NAFRev2,N,4.677525,45.95518,0.77,street,Montee de Chalier 69480 Pommiers,69156_0m7w9i,G,MONTEE DE CHALIER,
304071053,00017,30407105300017,O,,NN,,,,true,1,,,,,CHALIERS,69480,POMMIERS,,,69156,,,,,,,,,,,,,,,,,,,1989-11-30,F,,,,,01.17,NAP,N,4.677525,45.95518,0.92,street,Montee de Chalier 69480 Pommiers,69156_0m7w9i,G,MONTEE DE CHALIER,
304696032,00016,30469603200016,O,,NN,,,,true,1,,,,LD,LE BOURG,69480,POMMIERS,,,69156,,,,,,,,,,,,,,,,,,,1996-11-26,F,,,,,93.0D,NAF1993,O,4.694159,45.954482,0.94,street,Le Bourg 69480 Pommiers,69156_0lns35,G,LE BOURG,
308709765,00025,30870976500025,O,1974-03-06,NN,,,2008-01-05T19:18:56,true,3,,,,,CHEMIN DU PARADIS,69480,POMMIERS,,,69156,,,,,,,,,,,,,,,,,,,2008-01-01,A,,,,,68.20B,NAFRev2,N,4.681677,45.966262,0.95,street,Chemin du Paradis 69480 Pommiers,69156_0104,G,CHEMIN DU PARADIS,
309156883,00014,30915688300014,O,,,,,,true,1,,,,,,69480,POMMIERS,,,69156,,,,,,,,,,,,,,,,,,,1984-12-25,F,,,,,00.98,NAP,N,,,0,,,,,,
309813681,00108,30981368100108,O,2021-09-13,,,,2022-01-31T10:45:44,false,2,ZAC DE BEL AIR LA LOGERE,117,,RUE,DES VERGERS,69480,POMMIERS,,,69156,,,,,,,,,,,,,,,,,,,2022-01-26,A,,,,,43.32B,NAFRev2,O,4.713586,45.961864,0.79,street,Rue des Vergers 69480 Pommiers,69156_0149,G,RUE DES VERGERS,
309843175,00014,30984317500014,O,,NN,,,,true,1,,,,LD,BUISANTE,69480,POMMIERS,,,69156,,,,,,,,,,,,,,,,,,,1988-12-31,F,,,,,87.07,NAP,N,4.700232,45.963036,0.93,street,Montee de Buisante 69480 Pommiers,69156_ob4906,G,MONTEE DE BUISANTE,
310040209,00028,31004020900028,O,1900-01-01,NN,,,,true,4,,,,,LIEU DE CHALLIER,69480,POMMIERS,,,69156,,,,,,,,,,,,,,,,,,,1993-12-16,F,,,,,93.0E,NAF1993,N,4.677595,45.955612,0.61,street,Voie Communale Montee de Chalier 69480 Pommiers,69156_0013,G,VOIE COMMUNALE MONTEE DE CHALIER,
311114086,00052,31111408600052,O,1991-12-20,NN,,,,false,3,,,,RUE,DE L'EGLISE,69480,POMMIERS,,,69156,,,,,,,,,,,,,,,,,,,1996-01-06,F,,,,,92.3A,NAF1993,N,4.692447,45.955881,0.95,street,Rue de l’’Eglise 69480 Pommiers,69156_0032,G,RUE DE L EGLISE,
311200612,00027,31120061200027,O,1985-01-01,NN,,,,true,1,,,,,BETHLEEM,69480,POMMIERS,,,69156,,,,,,,,,,,,,,,,,,,2001-09-30,F,,,,,01.1G,NAF1993,N,4.691987,45.956352,0.93,street,Chemin de Bethléem 69480 Pommiers,69156_0008,G,CHEMIN DE BETHLEEM,
312524218,00012,31252421800012,O,,NN,,,,true,1,,,,,LE BOURG,69480,POMMIERS,,,69156,,,,,,,,,,,,,,,,,,,1990-09-30,F,,,,,51.5L,NAF1993,N,4.694159,45.954482,0.94,street,Le Bourg 69480 Pommiers,69156_0lns35,G,LE BOURG,
312636921,00024,31263692100024,O,,NN,,,,true,1,,,,LD,LE BOURG,69480,POMMIERS,,,69156,,,,,,,,,,,,,,,,,,,1989-09-28,F,,,,,62.46,NAP,N,4.694159,45.954482,0.94,street,Le Bourg 69480 Pommiers,69156_0lns35,G,LE BOURG,
313249054,00047,31324905400047,O,,NN,,,,true,1,,29,,RUE,DES VIGNES,69480,POMMIERS,,,69156,,,,,,,,,,,,,,,,,,,,F,,,,,84.12,NAP,N,4.692322,45.957784,0.81,street,Rue des Vignes 69480 Pommiers,69156_0151,G,RUE DES VIGNES,
313325797,00063,31332579700063,O,2020-11-05,,,,2021-02-23T10:40:06,true,1,,42,,ALL,DES CELESTINS,69480,POMMIERS,,,69156,,,,,,,,,,,,,,,,,,,2020-11-05,A,,,,,47.82Z,NAFRev2,N,4.707991,45.956816,0.86,housenumber,42 Allee des Celestins 69480 Pommiers,69156_0052_00042,G,42 ALLEE DES CELESTINS,
313704462,00057,31370446200057,O,2008-08-01,,,,2013-03-21T04:23:33,true,2,,,,LD,BUISANTE,69480,POMMIERS,,,69156,,,,,,,,,,,,,,,,,,,2013-01-01,F,,,,,01.21Z,NAFRev2,N,4.700232,45.963036,0.93,street,Montee de Buisante 69480 Pommiers,69156_ob4906,G,MONTEE DE BUISANTE,
314151515,00017,31415151500017,O,1978-01-01,NN,,,2008-06-20T15:42:23,true,3,,,,LD,BUISANTE,69480,POMMIERS,,,69156,,,,,,,,,,,,,,,,,,,2007-12-08,F,,,,,15.9G,NAFRev1,N,4.700232,45.963036,0.93,street,Montee de Buisante 69480 Pommiers,69156_ob4906,G,MONTEE DE BUISANTE,
315144063,00015,31514406300015,O,,NN,,,,true,1,,,,LD,LES POTHIERES,69480,POMMIERS,,,69156,,,,,,,,,,,,,,,,,,,1980-12-15,F,,,,,69.11,NAP,N,4.695648,45.952272,0.8,street,Chemin des Pothières 69480 Pommiers,69156_0112,G,CHEMIN DES POTHIERES,
315251488,00013,31525148800013,O,1979-01-01,,,,,true,3,,,,,DOMAINE DE LA HUMBERTIERE,69480,POMMIERS,,,69156,,,,,,,,,,,,,,,,,,,1997-12-25,F,,,,,91.3E,NAF1993,N,4.684294,45.965005,0.39,street,Allée de la Galochère 69480 Pommiers,69156_0062,G,ALLEE DE LA GALOCHERE,
315296541,00016,31529654100016,O,1979-01-01,NN,,,2008-01-04T20:37:50,true,3,,,,RTE,DE ST FONDS,69480,POMMIERS,,,69156,,,,,,,,,,,,,,,,,,,2008-01-01,A,,,,,68.20B,NAFRev2,N,4.683014,45.964071,0.73,street,Route de Saint-Fonds 69480 Pommiers,69156_0118,G,ROUTE DE SAINT FONDS,
315687624,00033,31568762400033,O,2005-01-01,NN,,,2018-12-05T04:21:19,true,5,,,,CHE,DU DEO,69480,POMMIERS,,,69156,,,,,,,,,,,,,,,,,,,2018-12-31,F,,,,,70.22Z,NAFRev2,N,4.68824,45.954796,0.78,street,Chemin du Déo 69480 Pommiers,69156_0026,G,CHEMIN DU DEO,
316110113,00016,31611011300016,O,1979-01-01,NN,,,2021-05-19T15:10:53,true,4,,,,LD,LE MOULIN A VENT,69480,POMMIERS,,,69156,,,,,,,,,,,,,,,,,,,2021-05-18,F,,,,,01.21Z,NAFRev2,N,4.691764,45.953775,0.32,street,Voie Communale Montee des Sarments 69480 Pommiers,69156_0131,G,VOIE COMMUNALE MONT DES SARMENTS,
316357839,00026,31635783900026,O,1985-05-24,NN,,,,false,4,,,,LD,BUISANTE,69480,POMMIERS,,,69156,,,,,,,,,,,,,,,,,,,2002-06-28,F,,,,,70.2A,NAF1993,N,4.700232,45.963036,0.93,street,Montee de Buisante 69480 Pommiers,69156_ob4906,G,MONTEE DE BUISANTE,
316806199,00014,31680619900014,O,1979-01-01,NN,,,2008-04-05T00:17:03,true,3,MR BOUVERON HUBERT,,,LD,AU CHAMP DU BOIS,69480,POMMIERS,,,69156,,,,,,,,,,,,,,,,,,,2008-01-01,A,,,,,01.41Z,NAFRev2,N,4.693811,45.957595,0.78,street,Chemin du Champ de Bois 69480 Pommiers,69156_0015,G,CHEMIN DU CHAMP DE BOIS,
317041002,00013,31704100200013,O,,,,,,true,1,,,,LD,BEL AIR,69480,POMMIERS,,,69156,,,,,,,,,,,,,,,,,,,1993-12-25,F,,,,,01.1G,NAF1993,N,4.713935,45.963459,0.94,street,Bel Air 69480 Pommiers,69156_B001,G,BEL AIR,
317787794,00039,31778779400039,O,2012-01-01,,,,2014-08-12T13:36:59,true,1,,,,,CHAPENAY,69480,POMMIERS,,,69156,,,,,,,,,,,,,,,,,,,2012-01-01,A,,,,,01.21Z,NAFRev2,N,4.692331,45.96936,0.73,street,Chemin de Charpenay 69480 Pommiers,69156_0024,G,CHEMIN DE CHARPENAY,
317861425,00013,31786142500013,O,,,,,,true,1,,,,,LE BOURG,69480,POMMIERS,,,69156,,,,,,,,,,,,,,,,,,,1984-12-25,F,,,,,84.10,NAP,N,4.694159,45.954482,0.94,street,Le Bourg 69480 Pommiers,69156_0lns35,G,LE BOURG,
317955375,00025,31795537500025,O,1991-09-17,NN,,,2009-06-27T04:12:12,true,4,LE BOURG,,,CHE,DE TREZETTE,69480,POMMIERS,,,69156,,,,,,,,,,,,,,,,,,,2007-04-30,F,,,,,52.2C,NAFRev1,O,4.694315,45.955351,0.84,street,Chemin de Trezette 69480 Pommiers,69156_0140,G,CHEMIN DE TREZETTE,
318492865,00023,31849286500023,O,2022-01-01,,,,2022-01-01T15:11:57,true,1,,110,,IMP,AUDENIS,69480,POMMIERS,,,69156,,,,,,,,,,,,,,,,,,,2022-01-01,A,,,,,86.21Z,NAFRev2,N,4.698571,45.959831,0.83,housenumber,110 Impasse Audenis 69480 Pommiers,69156_0003_00110,G,110 IMPASSE AUDENIS,
318493061,00010,31849306100010,O,,NN,,,,true,1,,,,,LES POTHIERES,69480,POMMIERS,,,69156,,,,,,,,,,,,,,,,,,,1989-05-10,F,,,,,77.05,NAP,N,4.695648,45.952272,0.8,street,Chemin des Pothières 69480 Pommiers,69156_0112,G,CHEMIN DES POTHIERES,
318811775,00028,31881177500028,O,2021-09-01,,,,2021-11-06T14:46:53,true,1,,287,,RTE,DE LACHASSAGNE,69480,POMMIERS,,,69156,,,,,,,,,,,,,,,,,,,2021-09-01,A,,,,,01.21Z,NAFRev2,N,4.691434,45.948765,0.87,housenumber,287 Route de Lachassagne 69480 Pommiers,69156_0080_00287,G,287 ROUTE DE LACHASSAGNE,
319020111,00013,31902011100013,O,1980-06-01,NN,,,2008-01-04T17:58:23,true,3,,,,,BELAIR LE GIRE,69480,POMMIERS,,,69156,,,,,,,,,,,,,,,,,,,2008-01-01,A,,,,,68.20B,NAFRev2,N,,,0,,,,,,
319671442,00014,31967144200014,O,,NN,,,,true,1,,,,,BEL AIR,69480,POMMIERS,,,69156,,,,,,,,,,,,,,,,,,,,F,,,,,34.06,NAP,N,4.713935,45.963459,0.94,street,Bel Air 69480 Pommiers,69156_B001,G,BEL AIR,
320237381,00043,32023738100043,O,1997-06-01,,,,2008-11-07T00:36:15,false,4,,,,RUE,DE L EGLISE,69480,POMMIERS,,,69156,,,,,,,,,,,,,,,,,,,1999-08-01,F,,,,,36.1K,NAF1993,N,4.692447,45.955881,0.95,street,Rue de l’’Eglise 69480 Pommiers,69156_0032,G,RUE DE L EGLISE,
320377690,00047,32037769000047,O,2018-08-06,12,2020,,2022-08-29T09:16:41,true,1,ZAC BEL AIR,559,,RUE,DES VERGERS,69480,POMMIERS,,,69156,,,,,,,,,,,,,,,,,,,2018-08-06,A,,,,,28.14Z,NAFRev2,O,4.713679,45.963545,0.95,housenumber,559 Rue des Vergers 69480 Pommiers,69156_0149_00559,G,559 RUE DES VERGERS,
320507809,00012,32050780900012,O,,NN,,,,true,1,,,,,BEL AIR,69480,POMMIERS,,,69156,,,,,,,,,,,,,,,,,,,1987-12-25,F,,,,,81.21,NAP,N,4.713935,45.963459,0.94,street,Bel Air 69480 Pommiers,69156_B001,G,BEL AIR,
320917032,00023,32091703200023,O,1980-02-25,NN,,,2008-01-04T18:19:49,false,3,,,,,BETLEEME,69480,POMMIERS,,,69156,,,,,,,,,,,,,,,,,,,2008-01-01,A,,,,,68.20A,NAFRev2,N,4.691987,45.956352,0.53,street,Chemin de Bethléem 69480 Pommiers,69156_0008,G,CHEMIN DE BETHLEEM,
320918212,00012,32091821200012,O,,NN,,,,true,1,,,,LD,EN CHALIER,69480,POMMIERS,,,69156,,,,,,,,,,,,,,,,,,,1988-03-26,F,,,,,58.05,NAP,N,4.677525,45.95518,0.69,street,Montee de Chalier 69480 Pommiers,69156_0m7w9i,G,MONTEE DE CHALIER,
320969462,00029,32096946200029,O,2006-08-16,,,,2014-07-08T00:24:56,true,3,,387,,RUE,DE LA MAIRIE,69480,POMMIERS,,,69156,,,,,,,,,,,,,,,,,,,2012-09-18,F,,,,,43.32A,NAFRev2,N,4.696443,45.95766,0.95,housenumber,387 Rue de la Mairie 69480 Pommiers,69156_0086_00387,G,387 RUE DE LA MAIRIE,
321050809,00029,32105080900029,O,1994-01-01,NN,,,2022-10-24T14:31:52,true,4,,215,,CHE,GRANDE GONTHIERE,69480,POMMIERS,,,69156,,,,,,,,,,,,,,,,,,,2022-11-02,A,,,,,49.41A,NAFRev2,N,4.692877,45.949379,0.9,housenumber,215 Chemin de la Grande Gonthière 69480 Pommiers,69156_0066_00215,G,215 CHEMIN DE LA GDE GONTHIERE,
321919870,00022,32191987000022,O,2020-10-05,,,,2021-02-23T10:45:36,true,1,,4,,PL,DES MIGNONNES,69480,POMMIERS,,,69156,,,,,,,,,,,,,,,,,,,2020-10-05,A,,,,,68.20B,NAFRev2,N,4.703967,45.959987,0.85,housenumber,4 Place des Mignonnes 69480 Pommiers,69156_0092_00004,G,4 PLACE DES MIGNONNES,
322084518,00016,32208451800016,O,1981-05-20,NN,,,,true,1,,,,,EN CHAMPAGNE,69480,POMMIERS,,,69156,,,,,,,,,,,,,,,,,,,2001-12-31,F,,,,,45.4J,NAF1993,O,4.69352,45.961116,0.73,street,Chemin de Champagne 69480 Pommiers,69156_0023,G,CHEMIN DE CHAMPAGNE,
322109612,00026,32210961200026,O,1982-02-20,NN,,,2019-12-06T13:02:25,true,4,,,,CHE,DE TREZETTE,69480,POMMIERS,,,69156,,,,,,,,,,,,,,,,,,,2019-12-31,F,,,,,86.21Z,NAFRev2,N,4.694315,45.955351,0.84,street,Chemin de Trezette 69480 Pommiers,69156_0140,G,CHEMIN DE TREZETTE,
322190331,00015,32219033100015,O,1981-05-14,NN,,,2008-04-05T00:22:05,true,3,,,,,LES BRUYERES,69480,POMMIERS,,,69156,,,,,,,,,,,,,,,,,,,2008-01-01,A,,,,,68.20B,NAFRev2,N,4.683438,45.943412,0.78,street,Chemin des Bruyères 69480 Pommiers,69156_0011,G,CHEMIN DES BRUYERES,
322190349,00017,32219034900017,O,1981-05-14,NN,,,,false,4,,,,,LES BRUYERES,69480,POMMIERS,,,69156,,,,,,,,,,,,,,,,,,,1999-09-12,F,,,,,01.1A,NAF1993,N,4.683438,45.943412,0.78,street,Chemin des Bruyères 69480 Pommiers,69156_0011,G,CHEMIN DES BRUYERES,
322190349,00033,32219034900033,O,2011-09-22,NN,,,2019-06-24T13:21:33,true,1,,573,,CHE,SAINT-JEAN,69480,POMMIERS,,,69156,,,,,,,,,,,,,,,,,,,2011-09-22,A,,,,,01.21Z,NAFRev2,N,4.674093,45.952745,0.86,housenumber,573 Chemin Saint Jean 69480 Pommiers,69156_0120_00573,G,573 CHEMIN SAINT JEAN,
322357484,00011,32235748400011,O,1981-06-20,NN,,,2019-12-05T09:31:10,true,3,,,,LD,ST PRE,69480,POMMIERS,,,69156,,,,,,,,,,,,,,,,,,,2008-01-01,A,,,,,01.41Z,NAFRev2,N,4.688285,45.953289,0.66,street,Chemin de Saint Pre 69480 Pommiers,69156_0124,G,CHEMIN DE SAINT PRE,
323311704,00023,32331170400023,O,,NN,,,,true,1,,,,LD,LE GYRE,69480,POMMIERS,,,69156,,,,,,,,,,,,,,,,,,,1992-07-02,F,,,,,52.6E,NAF1993,N,4.710123,45.958335,0.58,street,Chemin du Gyre 69480 Pommiers,69156_0070,G,CHEMIN DU GYRE,
324038637,00025,32403863700025,O,1998-12-04,,,,,true,1,,,,CHE,DU DEO,69480,POMMIERS,,,69156,,,,,,,,,,,,,,,,,,,1999-03-31,F,,,,,74.8D,NAF1993,N,4.68824,45.954796,0.78,street,Chemin du Déo 69480 Pommiers,69156_0026,G,CHEMIN DU DEO,
324137694,00026,32413769400026,O,1991-09-16,,,,2008-11-07T00:41:00,true,4,,,,,LES GONDOINS,69480,POMMIERS,,,69156,,,,,,,,,,,,,,,,,,,2004-09-17,F,,,,,45.4C,NAFRev1,N,4.684629,45.951035,0.79,street,Chemin des Gondoins 69480 Pommiers,69156_0064,G,CHEMIN DES GONDOINS,
324174010,00011,32417401000011,O,,,,,,true,1,,,,CHE,DE BEL AIR,69480,POMMIERS,,,69156,,,,,,,,,,,,,,,,,,,1984-12-25,F,,,,,84.12,NAP,N,4.710312,45.960485,0.76,street,Montee de Bel Air 69480 Pommiers,69156_p15ixv,G,MONTEE DE BEL AIR,
324187061,00035,32418706100035,O,1993-07-12,NN,,,2011-10-27T09:00:17,false,4,,,,RUE,DE L'EGLISE,69480,POMMIERS,,,69156,,,,,,,,,,,,,,,,,,,2002-07-18,F,,,,,45.2V,NAF1993,N,4.692447,45.955881,0.95,street,Rue de l’’Eglise 69480 Pommiers,69156_0032,G,RUE DE L EGLISE,
324187061,00043,32418706100043,O,2011-11-01,,,,2017-05-10T03:48:10,true,2,,,,CHE,DE POMMERIEUX,69480,POMMIERS,,,69156,,,,,,,,,,,,,,,,,,,2016-01-01,F,,,,,43.99C,NAFRev2,N,4.69206,45.955672,0.85,street,Chemin de Pommérieux 69480 Pommiers,69156_0110,G,CHEMIN DE POMMERIEUX,
324410463,00016,32441046300016,O,,,,,,true,1,,,,LD,LES BONNETIERES,69480,POMMIERS,,,69156,,,,,,,,,,,,,,,,,,,1984-12-25,F,,,,,55.71,NAP,N,4.686088,45.948876,0.82,street,Chemin des Bonnetières 69480 Pommiers,69156_0009,G,CHEMIN DES BONNETIERES,
325792091,00036,32579209100036,O,1991-05-01,,,,,true,1,,,,LD,LE NEYRA,69480,POMMIERS,,,69156,,,,,,,,,,,,,,,,,,,1992-10-15,F,,,,,45.1A,NAF1993,N,4.690316,45.952595,0.63,street,Chemin du Neyra 69480 Pommiers,69156_0095,G,CHEMIN DU NEYRA,
325793636,00011,32579363600011,O,1982-10-11,NN,,,,true,1,,,,,BEL AIR,69480,POMMIERS,,,69156,,,,,,,,,,,,,,,,,,,2001-12-01,F,,,,,70.2A,NAF1993,N,4.713935,45.963459,0.94,street,Bel Air 69480 Pommiers,69156_B001,G,BEL AIR,
326390283,00033,32639028300033,O,1989-07-22,NN,,,,true,1,,,,,LES BRUYERES,69480,POMMIERS,,,69156,,,,,,,,,,,,,,,,,,,2000-12-31,F,,,,,45.1A,NAF1993,N,4.683438,45.943412,0.78,street,Chemin des Bruyères 69480 Pommiers,69156_0011,G,CHEMIN DES BRUYERES,
326987005,00039,32698700500039,O,2001-11-12,NN,,,2008-11-07T00:44:27,true,3,LES BRUYERES,,,CHE,SAINT JEAN,69480,POMMIERS,,,69156,,,,,,,,,,,,,,,,,,,2007-06-30,F,,,,,22.2C,NAFRev1,N,4.672518,45.949283,0.83,street,Chemin Saint Jean 69480 Pommiers,69156_0120,G,CHEMIN SAINT JEAN,
327498127,00056,32749812700056,O,2015-11-01,,,,2021-02-23T10:49:04,true,1,,1071,,ALL,CLOS DE SAINT TRYS,69480,POMMIERS,,,69156,,,,,,,,,,,,,,,,,,,2015-11-01,A,,,,,86.90E,NAFRev2,N,4.707063,45.957523,0.88,housenumber,1071 Allée du Clos de Saint-Trys 69480 Pommiers,69156_0130_01071,G,1071 ALLEE DU CLOS DE SAINT TRYS,
328145065,00020,32814506500020,O,2007-05-01,00,2020,4722ZB,2022-08-29T09:20:12,true,3,LIEU DIT LE BOURG,,,CHE,DE TREZETTE,69480,POMMIERS,,,69156,,,,,,,,,,,,,,,,,,,2020-10-21,F,,,,,47.22Z,NAFRev2,N,4.694315,45.955351,0.84,street,Chemin de Trezette 69480 Pommiers,69156_0140,G,CHEMIN DE TREZETTE,
328185202,00012,32818520200012,O,1900-01-01,,,,2011-04-28T00:23:54,false,2,,,,,BEL AIR R.N6,69480,POMMIERS,,,69156,,,,,,,,,,,,,,,,,,,1985-12-25,F,,,,,62.43,NAP,N,4.713935,45.963459,0.62,street,Bel Air 69480 Pommiers,69156_B001,G,BEL AIR,
328240528,00047,32824052800047,O,2015-07-01,,,,2021-02-23T10:49:30,true,1,,110,,CHE,DE SAINT MARTIN,69480,POMMIERS,,,69156,,,,,,,,,,,,,,,,,,,2015-07-01,A,,,,,71.12B,NAFRev2,N,4.687625,45.955859,0.88,housenumber,110 Chemin de Saint-Martin 69480 Pommiers,69156_0122_00110,G,110 CHEMIN DE SAINT MARTIN,
328729074,00026,32872907400026,O,2001-01-02,NN,,3250AA,2022-07-29T08:36:37,true,4,,,,CHE,DU NEYRA,69480,POMMIERS,,,69156,,,,,,,,,,,,,,,,,,,2022-04-01,F,,,,,32.50A,NAFRev2,N,4.690316,45.952595,0.81,street,Chemin du Neyra 69480 Pommiers,69156_0095,G,CHEMIN DU NEYRA,
328775648,00046,32877564800046,O,,,,,,true,1,,39,,RUE,LABORDE,69480,POMMIERS,,,69156,,,,,,,,,,,,,,,,,,,1989-10-31,F,,,,,55.73,NAP,N,4.692656,45.956855,0.61,street,Rue Laborbe 69480 Pommiers,69156_0079,G,RUE LABORBE,
328876339,00016,32887633900016,O,1983-10-15,NN,,,2006-11-25T10:09:08,true,1,,,,,MAISON BETHLEEM,69480,POMMIERS,,,69156,,,,,,,,,,,,,,,,,,,1996-02-13,F,,,,,85.3D,NAF1993,O,4.691987,45.956352,0.54,street,Chemin de Bethléem 69480 Pommiers,69156_0008,G,CHEMIN DE BETHLEEM,
328949615,00020,32894961500020,O,1988-02-18,NN,,,2007-10-04T08:55:31,false,3,,,,LD,LES TOURS,69480,POMMIERS,,,69156,,,,,,,,,,,,,,,,,,,2007-08-16,F,,,,,70.3E,NAFRev1,N,4.707951,45.956869,0.39,street,Allee des Celestins 69480 Pommiers,69156_0052,G,ALLEE DES CELESTINS,
329015382,00016,32901538200016,O,1984-01-01,NN,,,2008-11-07T00:47:01,false,4,,,,RTE,DE MONCLAIR,69480,POMMIERS,,,69156,,,,,,,,,,,,,,,,,,,2001-11-23,F,,,,,45.2V,NAF1993,N,4.695312,45.954438,0.73,street,Route de Montclair 69480 Pommiers,69156_0090,G,ROUTE DE MONTCLAIR,
329015382,00024,32901538200024,O,2001-11-23,NN,,,2008-11-07T00:47:01,false,3,,,,CHE,DE POMMERIEUX,69480,POMMIERS,,,69156,,,,,,,,,,,,,,,,,,,2007-12-28,F,,,,,45.2V,NAFRev1,N,4.69206,45.955672,0.85,street,Chemin de Pommérieux 69480 Pommiers,69156_0110,G,CHEMIN DE POMMERIEUX,
329646665,00029,32964666500029,O,2018-06-26,,,,2021-11-23T20:01:15,true,1,,472,,CHE,DE SAINT PRE,69480,POMMIERS,,,69156,,,,,,,,,,,,,,,,,,,2018-06-26,A,,,,,70.22Z,NAFRev2,N,4.684481,45.953599,0.86,housenumber,472 Chemin de Saint Pre 69480 Pommiers,69156_0124_00472,G,472 CHEMIN DE SAINT PRE,