siren,nic,siret,statutDiffusionEtablissement,dateCreationEtablissement,trancheEffectifsEtablissement,anneeEffectifsEtablissement,activitePrincipaleRegistreMetiersEtablissement,dateDernierTraitementEtablissement,etablissementSiege,nombrePeriodesEtablissement,complementAdresseEtablissement,numeroVoieEtablissement,indiceRepetitionEtablissement,typeVoieEtablissement,libelleVoieEtablissement,codePostalEtablissement,libelleCommuneEtablissement,libelleCommuneEtrangerEtablissement,distributionSpecialeEtablissement,codeCommuneEtablissement,codeCedexEtablissement,libelleCedexEtablissement,codePaysEtrangerEtablissement,libellePaysEtrangerEtablissement,complementAdresse2Etablissement,numeroVoie2Etablissement,indiceRepetition2Etablissement,typeVoie2Etablissement,libelleVoie2Etablissement,codePostal2Etablissement,libelleCommune2Etablissement,libelleCommuneEtranger2Etablissement,distributionSpeciale2Etablissement,codeCommune2Etablissement,codeCedex2Etablissement,libelleCedex2Etablissement,codePaysEtranger2Etablissement,libellePaysEtranger2Etablissement,dateDebut,etatAdministratifEtablissement,enseigne1Etablissement,enseigne2Etablissement,enseigne3Etablissement,denominationUsuelleEtablissement,activitePrincipaleEtablissement,nomenclatureActivitePrincipaleEtablissement,caractereEmployeurEtablissement,longitude,latitude,geo_score,geo_type,geo_adresse,geo_id,geo_ligne,geo_l4,geo_l5
217104405,00014,21710440500014,O,1983-03-01,02,2019,,2021-10-27T08:10:13,true,4,,,,,,71990,SAINT-LEGER-SOUS-BEUVRAY,,,71440,,,,,,,,,,,,,,,,,,,2008-01-01,A,MAIRIE,,,,84.11Z,NAFRev2,O,,,0,,,,,,
217104405,00022,21710440500022,O,1983-12-21,01,2020,,2022-08-29T09:08:40,false,4,LE BOURG,,,,,71990,SAINT-LEGER-SOUS-BEUVRAY,,,71440,,,,,,,,,,,,,,,,,,,2022-05-13,A,ECOLE ELEMENTAIRE,,,,85.20Z,NAFRev2,N,4.116226,46.921493,0.5,locality,Charconnet sous le Bois 71990 Saint-Léger-sous-Beuvray,71440_B130,D,CHARCONNET SOUS LE BOIS,
217104405,00030,21710440500030,O,1996-12-25,NN,,,2019-11-14T14:00:55,false,2,MAIRIE,,,,,71990,SAINT-LEGER-SOUS-BEUVRAY,,,71440,,,,,,,,,,,,,,,,,,,2008-01-01,A,SERVICE ASSAINISSEMENT,,,,37.00Z,NAFRev2,N,4.105386,46.914383,0.51,locality,Manoeuvrerie Perrette 71990 Saint-Léger-sous-Beuvray,71440_B267,D,MANOEUVRERIE PERRETTE,
217104405,00048,21710440500048,O,1996-12-25,NN,,,2019-11-14T14:00:55,false,2,MAIRIE,,,,,71990,SAINT-LEGER-SOUS-BEUVRAY,,,71440,,,,,,,,,,,,,,,,,,,2008-01-01,A,SERVICE DES EAUX,,,,36.00Z,NAFRev2,N,4.105386,46.914383,0.51,locality,Manoeuvrerie Perrette 71990 Saint-Léger-sous-Beuvray,71440_B267,D,MANOEUVRERIE PERRETTE,
267106722,00015,26710672200015,O,1986-01-01,NN,,,2019-11-14T14:00:55,true,4,,,,,MAIRIE,71990,SAINT-LEGER-SOUS-BEUVRAY,,,71440,,,,,,,,,,,,,,,,,,,2016-12-31,F,CCAS,,,,88.99B,NAFRev2,N,3.0709671,50.6304695,0.92,poi.townhall,Hôtel de Ville Lille,https://osm.org/way/40917078,G,,
277100491,00012,27710049100012,O,,,,,2019-11-14T14:00:55,true,1,,,,,MAIRIE,71990,SAINT-LEGER-SOUS-BEUVRAY,,,71440,,,,,,,,,,,,,,,,,,,1995-12-25,F,,,,,41.0Z,NAF1993,N,3.0709671,50.6304695,0.92,poi.townhall,Hôtel de Ville Lille,https://osm.org/way/40917078,G,,
277102018,00011,27710201800011,O,,,,,2019-11-14T14:00:55,true,1,,,,,,71990,SAINT-LEGER-SOUS-BEUVRAY,,,71440,,,,,,,,,,,,,,,,,,,1995-12-25,F,,,,,90.0A,NAF1993,N,,,0,,,,,,
300860582,00018,30086058200018,O,,NN,,,2019-11-14T14:00:55,true,1,,,,,BOURG,71990,SAINT-LEGER-SOUS-BEUVRAY,,,71440,,,,,,,,,,,,,,,,,,,2002-01-12,F,,,,,62.11,NAP,N,4.098176,46.930323,0.43,street,Lieu Dit la Boutiere 71990 Saint-Léger-sous-Beuvray,71440_z7zq20,G,LIEU DIT LA BOUTIERE,
301451928,00016,30145192800016,O,,NN,,,2019-11-14T14:00:55,true,1,,,,,BOURG,71990,SAINT-LEGER-SOUS-BEUVRAY,,,71440,,,,,,,,,,,,,,,,,,,1988-12-31,F,,,,,55.73,NAP,N,4.098176,46.930323,0.43,street,Lieu Dit la Boutiere 71990 Saint-Léger-sous-Beuvray,71440_z7zq20,G,LIEU DIT LA BOUTIERE,
303475073,00035,30347507300035,O,2021-01-01,,,,2021-06-24T12:03:15,true,1,,,,,LE MOIRON,71990,SAINT-LEGER-SOUS-BEUVRAY,,,71440,,,,,,,,,,,,,,,,,,,2021-01-01,A,,,,,02.10Z,NAFRev2,N,6.2509689,46.1421689,0.89,poi.culvert,Le Moiron (Buse) Reignier-Ésery,https://osm.org/way/465947668,G,,
306347956,00030,30634795600030,O,1986-06-07,NN,,,2019-11-14T14:00:55,true,4,,,,RTE,DE LA BOUTHIERE,71990,SAINT-LEGER-SOUS-BEUVRAY,,,71440,,,,,,,,,,,,,,,,,,,2007-11-28,F,,,,,28.5D,NAFRev1,O,4.100136,46.928782,0.66,locality,Taille de la Boutiere 71990 Saint-Léger-sous-Beuvray,71440_B490,G,TAILLE DE LA BOUTIERE,
311836845,00033,31183684500033,O,2014-01-29,,,,2021-02-23T10:39:20,true,1,FERME DU BOUT,,,,MOLNET,71990,SAINT-LEGER-SOUS-BEUVRAY,,,71440,,,,,,,,,,,,,,,,,,,2014-01-29,A,,,,,74.90A,NAFRev2,N,4.0899964,46.909645,0.88,poi.track,Chemin de Lavaux à Molnet Saint-Léger-sous-Beuvray,https://osm.org/way/99720901,G,,
312120116,00016,31212011600016,O,,,,,2019-11-14T14:00:55,true,1,,,,,LE BOURG,71990,SAINT-LEGER-SOUS-BEUVRAY,,,71440,,,,,,,,,,,,,,,,,,,1984-12-25,F,,,,,84.12,NAP,N,4.116226,46.921493,0.5,locality,Charconnet sous le Bois 71990 Saint-Léger-sous-Beuvray,71440_B130,G,CHARCONNET SOUS LE BOIS,
313204810,00029,31320481000029,O,2000-06-06,NN,,,2022-06-03T04:10:47,false,4,,,,,LE BOURG,71990,SAINT-LEGER-SOUS-BEUVRAY,,,71440,,,,,,,,,,,,,,,,,,,2011-12-31,F,,,,,96.02A,NAFRev2,N,4.116226,46.921493,0.5,locality,Charconnet sous le Bois 71990 Saint-Léger-sous-Beuvray,71440_B130,G,CHARCONNET SOUS LE BOIS,
313204810,00037,31320481000037,O,2013-06-01,,,,2022-06-04T12:52:04,true,1,,2,,RTE,D ETANG,71990,SAINT-LEGER-SOUS-BEUVRAY,,,71440,,,,,,,,,,,,,,,,,,,2013-06-01,A,,,,,55.20Z,NAFRev2,N,4.111946,46.901515,0.41,locality,Moulin de l’Etang de Poiss 71990 Saint-Léger-sous-Beuvray,71440_B309,G,MOULIN DE L ETANG DE POISS,
318260171,00018,31826017100018,O,1980-01-01,NN,,,2019-11-14T14:00:55,true,1,,,,,AU BOURG,71990,SAINT-LEGER-SOUS-BEUVRAY,,,71440,,,,,,,,,,,,,,,,,,,1999-12-31,F,,,,,29.3C,NAF1993,N,4.058785,46.923072,0.31,locality,Poirier au Chien 71990 Saint-Léger-sous-Beuvray,71440_B368,G,POIRIER AU CHIEN,
318265840,00013,31826584000013,O,1980-01-01,NN,,,2019-11-14T14:00:55,true,3,,,,,CORLON,71990,SAINT-LEGER-SOUS-BEUVRAY,,,71440,,,,,,,,,,,,,,,,,,,2008-01-01,A,,,,,02.40Z,NAFRev2,N,4.0824409,46.9168624,0.89,poi.track,Chemin de Corlon Saint-Léger-sous-Beuvray,https://osm.org/way/99723650,G,,
318908811,00017,31890881100017,O,1980-04-18,NN,,,2019-11-14T14:00:55,true,3,,,,,,71990,SAINT-LEGER-SOUS-BEUVRAY,,,71440,,,,,,,,,,,,,,,,,,,2008-01-01,A,,,,,41.10A,NAFRev2,N,,,0,,,,,,
320014491,00015,32001449100015,O,,NN,,,2019-11-14T14:00:55,true,1,,,,,LE BOURG,71990,SAINT-LEGER-SOUS-BEUVRAY,,,71440,,,,,,,,,,,,,,,,,,,1989-07-31,F,,,,,55.73,NAP,N,4.116226,46.921493,0.5,locality,Charconnet sous le Bois 71990 Saint-Léger-sous-Beuvray,71440_B130,G,CHARCONNET SOUS LE BOIS,
321220618,00011,32122061800011,O,,NN,,,2019-11-14T14:00:55,true,1,,,,,CHARCONNET,71990,SAINT-LEGER-SOUS-BEUVRAY,,,71440,,,,,,,,,,,,,,,,,,,1990-03-31,F,,,,,55.60,NAP,N,4.116226,46.921493,0.91,locality,Charconnet sous le Bois 71990 Saint-Léger-sous-Beuvray,71440_B130,G,CHARCONNET SOUS LE BOIS,
321238198,00014,32123819800014,O,1981-01-01,NN,,,2022-05-11T13:53:30,true,5,,,,,AU REBOUT,71990,SAINT-LEGER-SOUS-BEUVRAY,,,71440,,,,,,,,,,,,,,,,,,,2012-12-31,A,,,,,01.45Z,NAFRev2,O,6.7223694,46.3943633,0.71,poi.track,Chemin du Maravent au Reboux Meillerie,https://osm.org/way/394998735,G,,
322097650,00012,32209765000012,O,,NN,,,2019-11-14T14:00:55,true,1,,,,,,71990,SAINT-LEGER-SOUS-BEUVRAY,,,71440,,,,,,,,,,,,,,,,,,,1987-12-31,F,,,,,57.02,NAP,N,,,0,,,,,,
322346370,00024,32234637000024,O,2007-04-06,,,,2021-02-23T10:45:56,true,2,,,,,LA BOUTIERES,71990,SAINT-LEGER-SOUS-BEUVRAY,,,71440,,,,,,,,,,,,,,,,,,,2008-01-01,A,,,,,02.40Z,NAFRev2,N,4.098176,46.930323,0.77,street,Lieu Dit la Boutiere 71990 Saint-Léger-sous-Beuvray,71440_z7zq20,G,LIEU DIT LA BOUTIERE,
322451741,00050,32245174100050,O,1993-10-08,NN,,,2019-11-14T14:00:55,false,5,,,,,,71990,SAINT-LEGER-SOUS-BEUVRAY,,,71440,,,,,,,,,,,,,,,,,,,2010-08-31,F,,,,,47.22Z,NAFRev2,O,,,0,,,,,,
322514027,00018,32251402700018,O,1981-07-01,NN,,,2019-11-14T14:00:55,true,1,,,,,COLLONGE,71990,SAINT-LEGER-SOUS-BEUVRAY,,,71440,,,,,,,,,,,,,,,,,,,1998-12-31,F,,,,,51.2E,NAF1993,N,5.5215834,45.6571243,0.89,poi,Pont de Collonge Les Avenières-Veyrins-Thuellin,https://osm.org/way/362979343,G,,
323444489,00013,32344448900013,O,,NN,,,2019-11-14T14:00:55,true,1,,,,,LE BOURG,71990,SAINT-LEGER-SOUS-BEUVRAY,,,71440,,,,,,,,,,,,,,,,,,,1996-12-27,F,,,,,55.1A,NAF1993,N,4.116226,46.921493,0.5,locality,Charconnet sous le Bois 71990 Saint-Léger-sous-Beuvray,71440_B130,G,CHARCONNET SOUS LE BOIS,
325661312,00034,32566131200034,O,2007-01-01,,,,2019-11-14T14:00:55,true,2,,,,,,71990,SAINT-LEGER-SOUS-BEUVRAY,,,71440,,,,,,,,,,,,,,,,,,,2008-01-01,A,,,,,02.10Z,NAFRev2,N,,,0,,,,,,
325722270,00015,32572227000015,O,1982-10-22,NN,,,2021-05-22T03:43:59,false,4,,,,,LE BOURG,71990,SAINT-LEGER-SOUS-BEUVRAY,,,71440,,,,,,,,,,,,,,,,,,,2020-06-26,F,,,,,02.40Z,NAFRev2,N,4.116226,46.921493,0.5,locality,Charconnet sous le Bois 71990 Saint-Léger-sous-Beuvray,71440_B130,G,CHARCONNET SOUS LE BOIS,
326071578,00016,32607157800016,O,1982-12-01,NN,,,2019-11-14T14:00:55,true,3,,,,,LA PEULT,71990,SAINT-LEGER-SOUS-BEUVRAY,,,71440,,,,,,,,,,,,,,,,,,,2008-01-01,A,,,,,02.40Z,NAFRev2,N,4.084689,46.915871,0.4,locality,Croix de Lavault 71990 Saint-Léger-sous-Beuvray,71440_B544,G,CROIX DE LAVAULT,
326206620,00022,32620662000022,O,1985-08-01,NN,,,2019-11-14T14:00:55,false,4,,,,,,71990,SAINT-LEGER-SOUS-BEUVRAY,,,71440,,,,,,,,,,,,,,,,,,,2005-10-01,F,,,,,55.3A,NAFRev1,O,,,0,,,,,,
326206620,00030,32620662000030,O,2005-10-01,NN,,4932ZA,2019-11-14T14:00:55,true,3,,,,,POISSON,71990,SAINT-LEGER-SOUS-BEUVRAY,,,71440,,,,,,,,,,,,,,,,,,,2017-08-01,F,,,,,49.32Z,NAFRev2,O,4.112182,46.901478,0.91,street,Lieu Dit Poisson 71990 Saint-Léger-sous-Beuvray,71440_rqcdok,G,LIEU DIT POISSON,
326962917,00018,32696291700018,O,1983-04-02,NN,,,2019-11-14T14:00:55,true,3,,,,,,71990,SAINT-LEGER-SOUS-BEUVRAY,,,71440,,,,,,,,,,,,,,,,,,,1995-12-25,F,,,,,55.3A,NAF1993,N,,,0,,,,,,
327805677,00017,32780567700017,O,1983-03-15,03,2020,,2022-08-29T09:20:01,true,4,,,,,,71990,SAINT-LEGER-SOUS-BEUVRAY,,,71440,,,,,,,,,,,,,,,,,,,2008-01-01,A,,,,,94.99Z,NAFRev2,O,,,0,,,,,,
327957205,00013,32795720500013,O,1983-07-01,NN,,,2019-11-14T14:00:55,false,4,,,,,LA COLLONGE,71990,SAINT-LEGER-SOUS-BEUVRAY,,,71440,,,,,,,,,,,,,,,,,,,2002-12-31,F,,,,,91.3E,NAF1993,O,4.8255223,45.8706368,0.89,poi.track,Chemin de la Collonge Curis-au-Mont-d'Or,https://osm.org/way/182565244,G,,
327957205,00021,32795720500021,O,2002-08-26,02,2020,,2022-09-15T13:30:10,true,3,,2,,CHE,DU CROUX,71990,SAINT-LEGER-SOUS-BEUVRAY,,,71440,,,,,,,,,,,,,,,,,,,2008-01-01,A,,,,,93.29Z,NAFRev2,O,4.1395522,46.9315449,0.82,poi.track,Chemin du Croux à la Croix Blanche Saint-Léger-sous-Beuvray,https://osm.org/way/105180180,G,,
328313903,00051,32831390300051,O,2015-01-01,,,,2021-02-23T10:49:33,true,1,,,,,A.M.C. LE CROUX,71990,SAINT-LEGER-SOUS-BEUVRAY,,,71440,,,,,,,,,,,,,,,,,,,2015-01-01,A,,,,,90.03B,NAFRev2,N,,,0,,,,,,
328891916,00012,32889191600012,O,,,,,2019-11-14T14:00:55,true,1,,,,,LE BOURG,71990,SAINT-LEGER-SOUS-BEUVRAY,,,71440,,,,,,,,,,,,,,,,,,,1987-03-31,F,,,,,62.43,NAP,N,4.116226,46.921493,0.5,locality,Charconnet sous le Bois 71990 Saint-Léger-sous-Beuvray,71440_B130,G,CHARCONNET SOUS LE BOIS,
328962485,00012,32896248500012,O,1983-12-22,NN,,,2019-11-14T14:00:55,true,3,,,,,,71990,SAINT-LEGER-SOUS-BEUVRAY,,,71440,,,,,,,,,,,,,,,,,,,2008-01-01,A,,,,,68.20B,NAFRev2,N,,,0,,,,,,
330324831,00016,33032483100016,O,1900-01-01,,,,2019-11-14T14:00:55,false,2,,,,RTE,DE MOLNAY SUR L ETANG,71990,SAINT-LEGER-SOUS-BEUVRAY,,,71440,,,,,,,,,,,,,,,,,,,1985-12-25,F,,,,,02.20,NAP,N,4.111946,46.901515,0.44,locality,Moulin de l’Etang de Poiss 71990 Saint-Léger-sous-Beuvray,71440_B309,G,MOULIN DE L ETANG DE POISS,
331345264,00021,33134526400021,O,,NN,,,2019-11-14T14:00:55,true,1,,,,,LE BOURG,71990,SAINT-LEGER-SOUS-BEUVRAY,,,71440,,,,,,,,,,,,,,,,,,,1989-09-21,F,,,,,02.20,NAP,N,4.116226,46.921493,0.5,locality,Charconnet sous le Bois 71990 Saint-Léger-sous-Beuvray,71440_B130,G,CHARCONNET SOUS LE BOIS,
331573394,00011,33157339400011,O,,NN,,,2019-11-14T14:00:55,true,1,,,,LD,LA VELLE,71990,SAINT-LEGER-SOUS-BEUVRAY,,,71440,,,,,,,,,,,,,,,,,,,1994-07-02,F,,,,,01.3Z,NAF1993,N,4.100136,46.928782,0.5,locality,Taille de la Boutiere 71990 Saint-Léger-sous-Beuvray,71440_B490,G,TAILLE DE LA BOUTIERE,
332568930,00017,33256893000017,O,1985-05-09,NN,,,2019-11-14T14:00:55,true,3,,,,,MAIRIE,71990,SAINT-LEGER-SOUS-BEUVRAY,,,71440,,,,,,,,,,,,,,,,,,,2008-01-01,A,,,,,01.61Z,NAFRev2,N,3.0709671,50.6304695,0.92,poi.townhall,Hôtel de Ville Lille,https://osm.org/way/40917078,G,,
332637453,00017,33263745300017,O,1985-02-12,NN,,,2019-11-14T14:00:55,true,4,,,,,LE BOURG,71990,SAINT-LEGER-SOUS-BEUVRAY,,,71440,,,,,,,,,,,,,,,,,,,2004-11-02,F,,,,,93.0D,NAFRev1,N,4.116226,46.921493,0.5,locality,Charconnet sous le Bois 71990 Saint-Léger-sous-Beuvray,71440_B130,G,CHARCONNET SOUS LE BOIS,
334150489,00022,33415048900022,O,1987-01-01,02,2020,3312ZA,2022-08-29T09:23:36,false,3,,,,,AU BOURG,71990,SAINT-LEGER-SOUS-BEUVRAY,,,71440,,,,,,,,,,,,,,,,,,,2008-01-01,A,,,,,33.12Z,NAFRev2,O,4.058785,46.923072,0.31,locality,Poirier au Chien 71990 Saint-Léger-sous-Beuvray,71440_B368,G,POIRIER AU CHIEN,
337918346,00012,33791834600012,O,1986-06-04,NN,,,2019-11-14T14:00:55,true,3,,,,RTE,DE LA BOUTHIERE,71990,SAINT-LEGER-SOUS-BEUVRAY,,,71440,,,,,,,,,,,,,,,,,,,2008-01-01,A,,,,,68.20B,NAFRev2,N,4.100136,46.928782,0.66,locality,Taille de la Boutiere 71990 Saint-Léger-sous-Beuvray,71440_B490,G,TAILLE DE LA BOUTIERE,
338819915,00012,33881991500012,O,1986-08-04,NN,,,2019-11-14T14:00:55,false,4,,,,,,71990,SAINT-LEGER-SOUS-BEUVRAY,,,71440,,,,,,,,,,,,,,,,,,,1998-12-31,F,,,,,85.1C,NAF1993,O,,,0,,,,,,
340450840,00012,34045084000012,O,,,,,2019-11-14T14:00:55,true,1,,,,,,71990,SAINT-LEGER-SOUS-BEUVRAY,,,71440,,,,,,,,,,,,,,,,,,,1988-05-19,F,,,,,02.20,NAP,N,,,0,,,,,,
342311040,00014,34231104000014,O,1987-04-01,NN,,,2019-11-14T14:00:55,true,4,,,,,LE BOURG,71990,SAINT-LEGER-SOUS-BEUVRAY,,,71440,,,,,,,,,,,,,,,,,,,1996-12-25,F,,,,,55.1A,NAF1993,N,4.116226,46.921493,0.5,locality,Charconnet sous le Bois 71990 Saint-Léger-sous-Beuvray,71440_B130,G,CHARCONNET SOUS LE BOIS,
342432150,00015,34243215000015,O,1987-06-28,NN,,,2020-11-17T14:41:53,false,4,,,,,LE BOURG,71990,SAINT-LEGER-SOUS-BEUVRAY,,,71440,,,,,,,,,,,,,,,,,,,2020-11-15,F,,,,,86.90D,NAFRev2,N,4.116226,46.921493,0.5,locality,Charconnet sous le Bois 71990 Saint-Léger-sous-Beuvray,71440_B130,G,CHARCONNET SOUS LE BOIS,
342854429,00012,34285442900012,O,,NN,,,2019-11-14T14:00:55,true,1,,,,,LE BOURG,71990,SAINT-LEGER-SOUS-BEUVRAY,,,71440,,,,,,,,,,,,,,,,,,,1988-12-15,F,,,,,67.01,NAP,N,4.116226,46.921493,0.5,locality,Charconnet sous le Bois 71990 Saint-Léger-sous-Beuvray,71440_B130,G,CHARCONNET SOUS LE BOIS,
343758025,00013,34375802500013,O,1988-01-16,NN,,,2020-01-25T03:59:44,true,3,,,,,LE BOURG,71990,SAINT-LEGER-SOUS-BEUVRAY,,,71440,,,,,,,,,,,,,,,,,,,2008-01-01,A,,,,,68.20A,NAFRev2,N,4.116226,46.921493,0.5,locality,Charconnet sous le Bois 71990 Saint-Léger-sous-Beuvray,71440_B130,G,CHARCONNET SOUS LE BOIS,
344955828,00035,34495582800035,O,2018-05-04,01,2020,9602AA,2022-08-29T09:29:26,false,1,,,,,LE BOURG,71990,SAINT-LEGER-SOUS-BEUVRAY,,,71440,,,,,,,,,,,,,,,,,,,2018-05-04,A,,,,,96.02A,NAFRev2,O,4.116226,46.921493,0.5,locality,Charconnet sous le Bois 71990 Saint-Léger-sous-Beuvray,71440_B130,G,CHARCONNET SOUS LE BOIS,
345392807,00037,34539280700037,O,2016-01-23,,,,2019-11-14T14:00:55,true,1,,,,,,71990,SAINT-LEGER-SOUS-BEUVRAY,,,71440,,,,,,,,,,,,,,,,,,,2016-01-23,A,,,,,02.10Z,NAFRev2,N,,,0,,,,,,
347492134,00015,34749213400015,O,,NN,,,2019-11-14T14:00:55,true,1,,,,,AU BOURG,71990,SAINT-LEGER-SOUS-BEUVRAY,,,71440,,,,,,,,,,,,,,,,,,,1993-09-07,F,,,,,52.1B,NAF1993,N,4.058785,46.923072,0.31,locality,Poirier au Chien 71990 Saint-Léger-sous-Beuvray,71440_B368,G,POIRIER AU CHIEN,
347626350,00016,34762635000016,O,1988-07-18,NN,,,2019-11-14T14:00:55,true,4,,,,,,71990,SAINT-LEGER-SOUS-BEUVRAY,,,71440,,,,,,,,,,,,,,,,,,,2003-06-30,F,,,,,45.2J,NAFRev1,O,,,0,,,,,,
349009845,00018,34900984500018,O,1989-01-01,NN,,,2019-11-14T14:00:55,true,1,,,,,LE GUE,71990,SAINT-LEGER-SOUS-BEUVRAY,,,71440,,,,,,,,,,,,,,,,,,,2002-12-01,F,,,,,01.3Z,NAF1993,N,3.5521786,50.0998377,0.73,poi.ford,(Gué) Le Cateau-Cambrésis,https://osm.org/node/1494300648,G,,
350036893,00013,35003689300013,O,1989-03-17,NN,,,2022-02-05T13:33:36,true,3,,,,,LA VELLE,71990,SAINT-LEGER-SOUS-BEUVRAY,,,71440,,,,,,,,,,,,,,,,,,,2008-01-01,A,,,,,01.42Z,NAFRev2,N,4.100136,46.928782,0.5,locality,Taille de la Boutiere 71990 Saint-Léger-sous-Beuvray,71440_B490,G,TAILLE DE LA BOUTIERE,
352483341,01916,35248334101916,O,1991-10-11,,,,2019-11-14T14:00:55,false,4,,,,,MAIRIE,71990,SAINT-LEGER-SOUS-BEUVRAY,,,71440,,,,,,,,,,,,,,,,,,,2008-01-01,A,,,,,64.19Z,NAFRev2,N,3.0709671,50.6304695,0.92,poi.townhall,Hôtel de Ville Lille,https://osm.org/way/40917078,G,,
353081284,00013,35308128400013,O,,NN,,,2019-11-14T14:00:55,true,1,,,,,LE BOURG,71990,SAINT-LEGER-SOUS-BEUVRAY,,,71440,,,,,,,,,,,,,,,,,,,1996-12-27,F,,,,,55.1A,NAF1993,N,4.116226,46.921493,0.5,locality,Charconnet sous le Bois 71990 Saint-Léger-sous-Beuvray,71440_B130,G,CHARCONNET SOUS LE BOIS,
353081599,00014,35308159900014,O,1986-06-01,NN,,,2019-11-14T14:00:55,true,3,,,,,LE BOURG,71990,SAINT-LEGER-SOUS-BEUVRAY,,,71440,,,,,,,,,,,,,,,,,,,1996-12-27,F,,,,,55.1A,NAF1993,N,4.116226,46.921493,0.5,locality,Charconnet sous le Bois 71990 Saint-Léger-sous-Beuvray,71440_B130,G,CHARCONNET SOUS LE BOIS,
356000000,32718,35600000032718,O,2012-01-01,,,,2022-11-11T03:40:05,false,3,,5242,,,LE BOURG,71990,SAINT-LEGER-SOUS-BEUVRAY,,,71440,,,,,,,,,,,,,,,,,,,2021-12-31,F,LA POSTE,,,,53.10Z,NAFRev2,N,4.116226,46.921493,0.35,locality,Charconnet sous le Bois 71990 Saint-Léger-sous-Beuvray,71440_B130,G,CHARCONNET SOUS LE BOIS,
356000265,02837,35600026502837,O,1991-01-01,NN,,,2019-11-14T14:00:55,false,4,,,,,BOURG,71990,SAINT-LEGER-SOUS-BEUVRAY,,,71440,,,,,,,,,,,,,,,,,,,2009-03-18,F,BUREAU DE POSTE,,,,53.10Z,NAFRev2,O,4.098176,46.930323,0.43,street,Lieu Dit la Boutiere 71990 Saint-Léger-sous-Beuvray,71440_z7zq20,G,LIEU DIT LA BOUTIERE,
378181648,00031,37818164800031,O,1999-01-23,NN,,,2019-11-14T14:00:55,true,5,ANCIENNE CURE,,,,LE BOURG,71990,SAINT-LEGER-SOUS-BEUVRAY,,,71440,,,,,,,,,,,,,,,,,,,2015-10-27,F,,,,,86.21Z,NAFRev2,O,4.116226,46.921493,0.5,locality,Charconnet sous le Bois 71990 Saint-Léger-sous-Beuvray,71440_B130,G,CHARCONNET SOUS LE BOIS,
378417398,00013,37841739800013,O,1990-06-01,01,2020,,2022-08-29T09:05:34,true,4,,,,,LE BOURG,71990,SAINT-LEGER-SOUS-BEUVRAY,,,71440,,,,,,,,,,,,,,,,,,,2016-01-31,A,,,,,47.73Z,NAFRev2,O,4.116226,46.921493,0.5,locality,Charconnet sous le Bois 71990 Saint-Léger-sous-Beuvray,71440_B130,G,CHARCONNET SOUS LE BOIS,
379536469,00024,37953646900024,O,2022-05-30,,,,2022-07-26T03:50:23,true,1,CHEZ M LE VERT GERARD,,,LD,LA PEUX,71990,SAINT-LEGER-SOUS-BEUVRAY,,,71440,,,,,,,,,,,,,,,,,,,2022-05-30,A,,,,,68.20B,NAFRev2,N,4.098176,46.930323,0.34,street,Lieu Dit la Boutiere 71990 Saint-Léger-sous-Beuvray,71440_z7zq20,G,LIEU DIT LA BOUTIERE,
380686329,00026,38068632900026,O,1996-05-04,NN,,,2019-11-14T14:00:55,false,4,BASE ARCHEOLOGIQUE,,,,LE BOURG,71990,SAINT-LEGER-SOUS-BEUVRAY,,,71440,,,,,,,,,,,,,,,,,,,2008-01-26,F,,,,,91.03Z,NAFRev2,N,4.116226,46.921493,0.5,locality,Charconnet sous le Bois 71990 Saint-Léger-sous-Beuvray,71440_B130,G,CHARCONNET SOUS LE BOIS,
380771543,00010,38077154300010,O,1990-12-24,NN,,,2019-11-14T14:00:55,true,3,,,,,,71990,SAINT-LEGER-SOUS-BEUVRAY,,,71440,,,,,,,,,,,,,,,,,,,2008-01-01,A,,,,,02.40Z,NAFRev2,N,,,0,,,,,,
380771618,00010,38077161800010,O,1991-01-01,NN,,,2021-02-23T11:09:14,true,4,,,,,LA CHAZOTTE,71990,SAINT-LEGER-SOUS-BEUVRAY,,,71440,,,,,,,,,,,,,,,,,,,2016-03-01,A,,,,,68.20B,NAFRev2,N,2.7558581,45.9068822,0.89,poi.beach,Plage de la Chazotte Saint-Jacques-d'Ambur,https://osm.org/node/1423032973,G,,
383136850,00013,38313685000013,O,1991-10-01,NN,,,2019-11-14T14:00:55,true,4,,,,,LA COLLONGE,71990,SAINT-LEGER-SOUS-BEUVRAY,,,71440,,,,,,,,,,,,,,,,,,,2013-12-31,F,,,,,01.42Z,NAFRev2,N,4.8255223,45.8706368,0.89,poi.track,Chemin de la Collonge Curis-au-Mont-d'Or,https://osm.org/way/182565244,G,,
384428215,00014,38442821500014,O,1992-02-13,NN,,,2019-11-14T14:00:55,true,3,,,,,AU BOURG,71990,SAINT-LEGER-SOUS-BEUVRAY,,,71440,,,,,,,,,,,,,,,,,,,1995-12-25,F,,,,,02.0B,NAF1993,N,4.058785,46.923072,0.31,locality,Poirier au Chien 71990 Saint-Léger-sous-Beuvray,71440_B368,G,POIRIER AU CHIEN,
384506317,00013,38450631700013,O,1992-01-01,NN,,,2019-11-14T14:00:55,true,3,,,,,MONTANDE,71990,SAINT-LEGER-SOUS-BEUVRAY,,,71440,,,,,,,,,,,,,,,,,,,2008-01-01,A,,,,,01.42Z,NAFRev2,N,-0.5511852,48.8487563,0.88,poi.bar,Le Montana (Bar) Condé-en-Normandie,https://osm.org/node/2440541550,G,,
387503386,00030,38750338600030,O,1995-01-01,NN,,,2019-11-14T14:00:55,true,2,,,,,LE BOURG,71990,SAINT-LEGER-SOUS-BEUVRAY,,,71440,,,,,,,,,,,,,,,,,,,1998-06-01,F,,,,,,,,4.116226,46.921493,0.5,locality,Charconnet sous le Bois 71990 Saint-Léger-sous-Beuvray,71440_B130,G,CHARCONNET SOUS LE BOIS,
388068611,00010,38806861100010,O,1992-06-19,NN,,,2019-11-14T14:00:55,true,4,,,,,LE FOING,71990,SAINT-LEGER-SOUS-BEUVRAY,,,71440,,,,,,,,,,,,,,,,,,,2006-03-16,F,,,,,70.2A,NAFRev1,O,4.119327,46.908656,0.41,locality,Le Point du Jour 71990 Saint-Léger-sous-Beuvray,71440_B367,G,LE POINT DU JOUR,
391119989,00013,39111998900013,O,1984-01-01,NN,,,2019-11-14T14:00:55,true,4,,,,,LA CHAZOTTE,71990,SAINT-LEGER-SOUS-BEUVRAY,,,71440,,,,,,,,,,,,,,,,,,,2015-12-31,F,,,,,01.42Z,NAFRev2,N,2.7558581,45.9068822,0.89,poi.beach,Plage de la Chazotte Saint-Jacques-d'Ambur,https://osm.org/node/1423032973,G,,
391125804,00016,39112580400016,O,1993-05-20,NN,,4520AB,2019-11-14T14:00:55,true,10,,,,,LA CHAZOTTE,71990,SAINT-LEGER-SOUS-BEUVRAY,,,71440,,,,,,,,,,,,,,,,,,,2017-07-31,F,,,,,45.20A,NAFRev2,N,2.7558581,45.9068822,0.89,poi.beach,Plage de la Chazotte Saint-Jacques-d'Ambur,https://osm.org/node/1423032973,G,,
392169553,00014,39216955300014,O,1993-07-19,NN,,,2019-11-14T14:00:55,true,3,,,,,MAIRIE,71990,SAINT-LEGER-SOUS-BEUVRAY,,,71440,,,,,,,,,,,,,,,,,,,2008-01-01,A,,,,,94.99Z,NAFRev2,N,3.0709671,50.6304695,0.92,poi.townhall,Hôtel de Ville Lille,https://osm.org/way/40917078,G,,
393029301,00016,39302930100016,O,1993-09-08,01,2020,,2022-08-29T09:17:00,true,6,,,,,AU BOURG,71990,SAINT-LEGER-SOUS-BEUVRAY,,,71440,,,,,,,,,,,,,,,,,,,2021-06-09,F,VIVAL,,,,47.11B,NAFRev2,O,4.058785,46.923072,0.31,locality,Poirier au Chien 71990 Saint-Léger-sous-Beuvray,71440_B368,G,POIRIER AU CHIEN,
393703202,00019,39370320200019,O,1994-01-01,NN,,,2019-11-14T14:00:55,false,3,VAUCOURIEUX,,,,,71990,SAINT-LEGER-SOUS-BEUVRAY,,,71440,,,,,,,,,,,,,,,,,,,1994-12-25,F,MAUGE SECRETARIAT CONCEPT,,,,74.8F,NAF1993,N,,,0,,,,,,
393703202,00027,39370320200027,O,1994-07-01,NN,,,2019-11-14T14:00:55,true,7,,,,LD,MONTPERROUX,71990,SAINT-LEGER-SOUS-BEUVRAY,,,71440,,,,,,,,,,,,,,,,,,,2015-01-15,A,,,,,01.42Z,NAFRev2,N,3.715937,46.3953897,0.89,poi.castle,Château de Montperroux Saint-Léon,https://osm.org/node/3852148056,G,,
393711437,00011,39371143700011,O,1993-11-29,NN,,,2019-11-14T14:00:55,true,5,,,,,MAISON DU BEUVRAY,71990,SAINT-LEGER-SOUS-BEUVRAY,,,71440,,,,,,,,,,,,,,,,,,,2008-12-31,A,,,,,85.59B,NAFRev2,N,4.100309,46.928679,0.59,street,Hameau du Beuvray 71990 Saint-Léger-sous-Beuvray,71440_B548,G,HAMEAU DU BEUVRAY,
394661284,00015,39466128400015,O,1994-04-05,NN,,,2019-11-14T14:00:55,true,3,,,,LD,ETANG DE POISSON,71990,SAINT-LEGER-SOUS-BEUVRAY,,,71440,,,,,,,,,,,,,,,,,,,2004-01-01,F,,,,,92.7C,NAFRev1,N,4.111946,46.901515,0.76,locality,Moulin de l’Etang de Poiss 71990 Saint-Léger-sous-Beuvray,71440_B309,G,MOULIN DE L ETANG DE POISS,
397599861,00010,39759986100010,O,1994-07-04,NN,,,2019-11-14T14:00:55,false,3,,,,,MOLNET,71990,SAINT-LEGER-SOUS-BEUVRAY,,,71440,,,,,,,,,,,,,,,,,,,1999-09-21,F,,,,,45.4D,NAF1993,,4.0899964,46.909645,0.88,poi.track,Chemin de Lavaux à Molnet Saint-Léger-sous-Beuvray,https://osm.org/way/99720901,G,,