siren,nic,siret,statutDiffusionEtablissement,dateCreationEtablissement,trancheEffectifsEtablissement,anneeEffectifsEtablissement,activitePrincipaleRegistreMetiersEtablissement,dateDernierTraitementEtablissement,etablissementSiege,nombrePeriodesEtablissement,complementAdresseEtablissement,numeroVoieEtablissement,indiceRepetitionEtablissement,typeVoieEtablissement,libelleVoieEtablissement,codePostalEtablissement,libelleCommuneEtablissement,libelleCommuneEtrangerEtablissement,distributionSpecialeEtablissement,codeCommuneEtablissement,codeCedexEtablissement,libelleCedexEtablissement,codePaysEtrangerEtablissement,libellePaysEtrangerEtablissement,complementAdresse2Etablissement,numeroVoie2Etablissement,indiceRepetition2Etablissement,typeVoie2Etablissement,libelleVoie2Etablissement,codePostal2Etablissement,libelleCommune2Etablissement,libelleCommuneEtranger2Etablissement,distributionSpeciale2Etablissement,codeCommune2Etablissement,codeCedex2Etablissement,libelleCedex2Etablissement,codePaysEtranger2Etablissement,libellePaysEtranger2Etablissement,dateDebut,etatAdministratifEtablissement,enseigne1Etablissement,enseigne2Etablissement,enseigne3Etablissement,denominationUsuelleEtablissement,activitePrincipaleEtablissement,nomenclatureActivitePrincipaleEtablissement,caractereEmployeurEtablissement,longitude,latitude,geo_score,geo_type,geo_adresse,geo_id,geo_ligne,geo_l4,geo_l5
178502118,00155,17850211800155,O,1983-03-15,,,,2019-11-14T14:01:02,false,4,,,,PL,DU CHAMP DE FOIRE,85240,SAINT-HILAIRE-DES-LOGES,,,85227,,,,,,,,,,,,,,,,,,,2010-01-27,F,TRESORERIE DE SAINT-HILAIRE-DES-LOGES,,,,84.11Z,NAFRev2,N,-0.665635,46.470252,0.86,street,Place du Champ de Foire 85240 Saint-Hilaire-des-Loges,85227_0022,G,PLACE DU CHAMP DE FOIRE,
198511958,00011,19851195800011,O,1983-03-01,12,2020,,2022-08-29T09:04:46,true,3,,47,,RUE,ANTOINE CARDIN,85240,SAINT-HILAIRE-DES-LOGES,,,85227,,,,,,,,,,,,,,,,,,,2008-01-01,A,,,,,85.31Z,NAFRev2,N,-0.667851,46.468323,0.95,housenumber,47 Rue Antoine Cardin 85240 Saint-Hilaire-des-Loges,85227_0027_00047,G,47 RUE ANTOINE CARDIN,
200018125,00019,20001812500019,O,2009-01-01,,,,2022-09-26T14:00:19,true,2,,15,,RUE,DU PEU,85240,SAINT-HILAIRE-DES-LOGES,,,85227,,,,,,,,,,,,,,,,,,,2021-12-31,F,,,,,88.99B,NAFRev2,N,-0.660949,46.469086,0.94,housenumber,15 Rue du Peu 85240 Saint-Hilaire-des-Loges,85227_0136_00015,G,15 RUE DU PEU,
200018125,00027,20001812500027,O,2009-01-01,21,2020,,2022-09-26T14:00:19,false,3,,15,,RUE,DU PEU,85240,SAINT-HILAIRE-DES-LOGES,,,85227,,,,,,,,,,,,,,,,,,,2021-12-31,F,EHPAD LA MOULINOTTE,,,,87.10A,NAFRev2,O,-0.660949,46.469086,0.94,housenumber,15 Rue du Peu 85240 Saint-Hilaire-des-Loges,85227_0136_00015,G,15 RUE DU PEU,
200018125,00043,20001812500043,O,2011-06-01,NN,,,2022-09-26T14:00:19,false,2,,15,,RUE,DU PEU,85240,SAINT-HILAIRE-DES-LOGES,,,85227,,,,,,,,,,,,,,,,,,,2021-12-31,F,ACTIVITES ANNEXES REPAS,,,,88.10A,NAFRev2,N,-0.660949,46.469086,0.94,housenumber,15 Rue du Peu 85240 Saint-Hilaire-des-Loges,85227_0136_00015,G,15 RUE DU PEU,
200018125,00050,20001812500050,O,2015-09-01,,,,2022-09-26T14:00:19,false,2,,15,,RUE,DU PEU,85240,SAINT-HILAIRE-DES-LOGES,,,85227,,,,,,,,,,,,,,,,,,,2021-12-31,F,EHPA LA MOULINOTTE,,,,87.30A,NAFRev2,N,-0.660949,46.469086,0.94,housenumber,15 Rue du Peu 85240 Saint-Hilaire-des-Loges,85227_0136_00015,G,15 RUE DU PEU,
200096774,00027,20009677400027,O,2022-01-01,,,,2022-03-16T08:47:45,false,1,,15,,RUE,DU PEU,85240,SAINT-HILAIRE-DES-LOGES,,,85227,,,,,,,,,,,,,,,,,,,2022-01-01,A,EHPAD LA MOULINOTTE,,,,87.10A,NAFRev2,O,-0.660949,46.469086,0.94,housenumber,15 Rue du Peu 85240 Saint-Hilaire-des-Loges,85227_0136_00015,G,15 RUE DU PEU,
200096774,00076,20009677400076,O,2022-01-01,,,,2021-12-28T11:05:49,false,1,,15,,RUE,DE PEU,85240,SAINT-HILAIRE-DES-LOGES,,,85227,,,,,,,,,,,,,,,,,,,2022-01-01,A,EHPA RESIDENCE AUTONOMIE LA MOULINOTTE,,,,87.30A,NAFRev2,N,-0.660949,46.469086,0.79,housenumber,15 Rue du Peu 85240 Saint-Hilaire-des-Loges,85227_0136_00015,G,15 RUE DU PEU,
218502276,00015,21850227600015,O,1983-03-01,12,2020,,2022-08-29T09:09:17,true,4,,1,,RUE,CHARLES FRADIN,85240,SAINT-HILAIRE-DES-LOGES,,BP 5,85227,,,,,,,,,,,,,,,,,,,2008-01-01,A,MAIRIE,,,,84.11Z,NAFRev2,O,-0.665016,46.4715,0.95,housenumber,1 Rue Charles Fradin 85240 Saint-Hilaire-des-Loges,85227_0028_00001,G,1 RUE CHARLES FRADIN,
218502276,00049,21850227600049,O,1983-12-21,NN,,,2019-11-14T14:01:02,false,4,,,,PL,DU CHAMP DE FOIRE,85240,SAINT-HILAIRE-DES-LOGES,,,85227,,,,,,,,,,,,,,,,,,,2000-09-01,F,ECOLE PRIMAIRE PUBLIQUE,,,,80.1Z,NAF1993,N,-0.665635,46.470252,0.86,street,Place du Champ de Foire 85240 Saint-Hilaire-des-Loges,85227_0022,G,PLACE DU CHAMP DE FOIRE,
218502276,00056,21850227600056,O,1983-12-21,NN,,,2019-11-14T14:01:02,false,4,,,,RUE,LEON BIENVENU,85240,SAINT-HILAIRE-DES-LOGES,,,85227,,,,,,,,,,,,,,,,,,,1997-12-31,F,ECOLE PRIMAIRE PUBLIQUE,,,,80.1Z,NAF1993,N,-0.662873,46.472981,0.96,street,Rue Léon Bienvenu 85240 Saint-Hilaire-des-Loges,85227_0139,G,RUE LEON BIENVENU,
218502276,00080,21850227600080,O,1996-04-09,02,2020,,2022-08-29T09:09:17,false,4,,25,,RUE,SAINT NARCISSE,85240,SAINT-HILAIRE-DES-LOGES,,,85227,,,,,,,,,,,,,,,,,,,2020-12-25,A,ECOLE PRIMAIRE PUBLIQUE JACQUES CHARPENTREAU,,,,85.20Z,NAFRev2,N,-0.663902,46.468636,0.94,housenumber,25 Rue de Saint-Narcisse 85240 Saint-Hilaire-des-Loges,85227_0151_00025,G,25 RUE DE SAINT NARCISSE,
218502276,00098,21850227600098,O,1996-08-15,NN,,,2019-11-14T14:01:02,false,3,,,,,LE FIEF DU ROY,85240,SAINT-HILAIRE-DES-LOGES,,,85227,,,,,,,,,,,,,,,,,,,2001-12-25,F,LOTISSEMENT COMMUNAL,,,,70.1C,NAF1993,N,-0.660819,46.475175,0.77,street,Rue du Fief du Roy 85240 Saint-Hilaire-des-Loges,85227_0143,G,RUE DU FIEF DU ROY,
218502276,00106,21850227600106,O,1996-12-25,NN,,,2020-09-15T14:46:45,false,3,MAIRIE,1,,RUE,CHARLES FRADIN,85240,SAINT-HILAIRE-DES-LOGES,,,85227,,,,,,,,,,,,,,,,,,,2019-12-31,F,SERVICE D'ASSAINISSEMENT,,,,84.12Z,NAFRev2,N,-0.665016,46.4715,0.95,housenumber,1 Rue Charles Fradin 85240 Saint-Hilaire-des-Loges,85227_0028_00001,G,1 RUE CHARLES FRADIN,
218502276,00114,21850227600114,O,2000-01-01,NN,,,2019-11-14T14:01:02,false,3,MAIRIE,1,,RUE,CHARLES FRADIN,85240,SAINT-HILAIRE-DES-LOGES,,,85227,,,,,,,,,,,,,,,,,,,2008-01-01,A,SERVICE ACTIONS ECONOMIQUES,,,,42.99Z,NAFRev2,N,-0.665016,46.4715,0.95,housenumber,1 Rue Charles Fradin 85240 Saint-Hilaire-des-Loges,85227_0028_00001,G,1 RUE CHARLES FRADIN,
218502276,00122,21850227600122,O,2003-01-01,NN,,,2019-11-14T14:01:02,false,4,MAIRIE,1,,RUE,CHARLES FRADIN,85240,SAINT-HILAIRE-DES-LOGES,,BP 5,85227,,,,,,,,,,,,,,,,,,,2008-12-25,F,LOTISSEMENT NÂ¿1,,,,42.99Z,NAFRev2,N,-0.665016,46.4715,0.95,housenumber,1 Rue Charles Fradin 85240 Saint-Hilaire-des-Loges,85227_0028_00001,G,1 RUE CHARLES FRADIN,
218502276,00130,21850227600130,O,2005-02-17,,,,2019-11-14T14:01:02,false,3,MAIRIE,1,,RUE,CHARLES FRADIN,85240,SAINT-HILAIRE-DES-LOGES,,,85227,,,,,,,,,,,,,,,,,,,2011-04-14,F,LOTISSEMENT LES SAULNIERS,,,,42.99Z,NAFRev2,N,-0.665016,46.4715,0.95,housenumber,1 Rue Charles Fradin 85240 Saint-Hilaire-des-Loges,85227_0028_00001,G,1 RUE CHARLES FRADIN,
218502276,00148,21850227600148,O,2005-02-17,,,,2019-11-14T14:01:02,false,3,MAIRIE,1,,RUE,CHARLES FRADIN,85240,SAINT-HILAIRE-DES-LOGES,,,85227,,,,,,,,,,,,,,,,,,,2011-04-14,F,LOTISSEMENT DU PARC,,,,42.99Z,NAFRev2,N,-0.665016,46.4715,0.95,housenumber,1 Rue Charles Fradin 85240 Saint-Hilaire-des-Loges,85227_0028_00001,G,1 RUE CHARLES FRADIN,
248500159,00012,24850015900012,O,,,,,2019-11-14T14:01:02,true,1,,,,,HOTEL DE VILLE,85240,SAINT-HILAIRE-DES-LOGES,,,85227,,,,,,,,,,,,,,,,,,,1993-01-01,F,,,,,75.1A,NAF1993,N,-0.662389,46.484086,0.46,street,La Vieille Vergne 85240 Saint-Hilaire-des-Loges,85227_B285,G,LA VIEILLE VERGNE,
248500563,00023,24850056300023,O,1999-01-01,NN,,,2019-11-14T14:01:02,false,4,,,,,,85240,SAINT-HILAIRE-DES-LOGES,,,85227,,,,,,,,,,,,,,,,,,,2008-01-01,F,SERVICE ENVIRONNEMENT DECHETS,,,,38.11Z,NAFRev2,N,,,0,,,,,,
258500792,00019,25850079200019,O,1983-03-01,NN,,,2019-11-14T14:01:02,true,4,,,,,HOTEL DE VILLE,85240,SAINT-HILAIRE-DES-LOGES,,,85227,,,,,,,,,,,,,,,,,,,2010-12-23,F,,,,,84.13Z,NAFRev2,N,-0.662389,46.484086,0.46,street,La Vieille Vergne 85240 Saint-Hilaire-des-Loges,85227_B285,G,LA VIEILLE VERGNE,
258502566,00015,25850256600015,O,,NN,,,2019-11-14T14:01:02,true,1,,,,,MAIRIE,85240,SAINT-HILAIRE-DES-LOGES,,,85227,,,,,,,,,,,,,,,,,,,1996-10-11,F,,,,,70.1C,NAF1993,N,3.0709671,50.6304695,0.92,poi.townhall,Hôtel de Ville Lille,https://osm.org/way/40917078,G,,
258502665,00015,25850266500015,O,1992-06-04,NN,,,2019-11-14T14:01:02,true,5,MAIRIE,1,,RUE,CHARLES FRADIN,85240,SAINT-HILAIRE-DES-LOGES,,BP 5,85227,,,,,,,,,,,,,,,,,,,2014-03-10,F,,,,,42.99Z,NAFRev2,O,-0.665016,46.4715,0.95,housenumber,1 Rue Charles Fradin 85240 Saint-Hilaire-des-Loges,85227_0028_00001,G,1 RUE CHARLES FRADIN,
258502749,00017,25850274900017,O,1993-01-01,NN,,,2022-01-07T04:20:07,true,5,MAIRIE,1,,RUE,CHARLES FRADIN,85240,SAINT-HILAIRE-DES-LOGES,,,85227,,,,,,,,,,,,,,,,,,,2022-01-01,F,,,,,84.12Z,NAFRev2,O,-0.665016,46.4715,0.95,housenumber,1 Rue Charles Fradin 85240 Saint-Hilaire-des-Loges,85227_0028_00001,G,1 RUE CHARLES FRADIN,
258502749,00025,25850274900025,O,1993-01-01,NN,,,2019-11-14T14:01:02,false,5,,15,,RUE,DU PEU,85240,SAINT-HILAIRE-DES-LOGES,,,85227,,,,,,,,,,,,,,,,,,,2009-01-01,F,EHPAD LA MOULINOTTE,,,,87.10A,NAFRev2,N,-0.660949,46.469086,0.94,housenumber,15 Rue du Peu 85240 Saint-Hilaire-des-Loges,85227_0136_00015,G,15 RUE DU PEU,
268500378,00016,26850037800016,O,1983-03-01,02,2020,,2022-08-29T09:10:47,true,5,MAIRIE,1,,RUE,CHARLES FRADET,85240,SAINT-HILAIRE-DES-LOGES,,,85227,,,,,,,,,,,,,,,,,,,2008-01-01,A,,,,,88.99B,NAFRev2,O,-0.665016,46.4715,0.82,housenumber,1 Rue Charles Fradin 85240 Saint-Hilaire-des-Loges,85227_0028_00001,G,1 RUE CHARLES FRADIN,
268500378,00024,26850037800024,O,1985-01-01,NN,,,2021-11-10T08:54:50,false,4,MAIRIE,1,,RUE,CHARLES FRADET,85240,SAINT-HILAIRE-DES-LOGES,,,85227,,,,,,,,,,,,,,,,,,,2022-01-01,A,SCE D'AIDE MENAGERE,,,,88.10A,NAFRev2,O,-0.665016,46.4715,0.82,housenumber,1 Rue Charles Fradin 85240 Saint-Hilaire-des-Loges,85227_0028_00001,G,1 RUE CHARLES FRADIN,
268503588,00017,26850358800017,O,1993-01-01,NN,,,2019-11-14T14:01:02,true,4,MAIRIE,1,,RUE,CHARLES FRADET,85240,SAINT-HILAIRE-DES-LOGES,,,85227,,,,,,,,,,,,,,,,,,,2015-12-31,F,CDE,,,,88.99B,NAFRev2,N,-0.665016,46.4715,0.82,housenumber,1 Rue Charles Fradin 85240 Saint-Hilaire-des-Loges,85227_0028_00001,G,1 RUE CHARLES FRADIN,
278500319,00019,27850031900019,O,,,,,2019-11-14T14:01:02,true,1,,,,,MAIRIE,85240,SAINT-HILAIRE-DES-LOGES,,,85227,,,,,,,,,,,,,,,,,,,1995-12-25,F,,,,,41.0Z,NAF1993,N,3.0709671,50.6304695,0.92,poi.townhall,Hôtel de Ville Lille,https://osm.org/way/40917078,G,,
298500844,00014,29850084400014,O,1983-08-10,NN,,,2019-11-14T14:01:02,true,4,MAIRIE,1,,RUE,CHARLES FRADIN,85240,SAINT-HILAIRE-DES-LOGES,,,85227,,,,,,,,,,,,,,,,,,,2008-01-01,A,,,,,42.99Z,NAFRev2,N,-0.665016,46.4715,0.95,housenumber,1 Rue Charles Fradin 85240 Saint-Hilaire-des-Loges,85227_0028_00001,G,1 RUE CHARLES FRADIN,
298501107,00015,29850110700015,O,,,,,2019-11-14T14:01:02,true,1,,,,,HOTEL DE VILLE,85240,SAINT-HILAIRE-DES-LOGES,,,85227,,,,,,,,,,,,,,,,,,,,F,,,,,90.12,NAP,N,-0.662389,46.484086,0.46,street,La Vieille Vergne 85240 Saint-Hilaire-des-Loges,85227_B285,G,LA VIEILLE VERGNE,
298502584,00014,29850258400014,O,1988-10-14,NN,,,2019-11-14T14:01:02,true,3,MAIRIE,1,,RUE,CHARLES FRADET,85240,SAINT-HILAIRE-DES-LOGES,,,85227,,,,,,,,,,,,,,,,,,,2008-01-01,A,,,,,42.99Z,NAFRev2,N,-0.665016,46.4715,0.82,housenumber,1 Rue Charles Fradin 85240 Saint-Hilaire-des-Loges,85227_0028_00001,G,1 RUE CHARLES FRADIN,
300588175,00012,30058817500012,O,,,,,2019-11-14T14:01:02,true,1,,,,,,85240,SAINT-HILAIRE-DES-LOGES,,,85227,,,,,,,,,,,,,,,,,,,1985-12-25,F,,,,,64.45,NAP,N,,,0,,,,,,
300980182,00012,30098018200012,O,,NN,,,2019-11-14T14:01:02,true,1,,,,,BOURG,85240,SAINT-HILAIRE-DES-LOGES,,,85227,,,,,,,,,,,,,,,,,,,,F,,,,,64.22,NAP,N,-0.673487,46.478022,0.92,street,Rue de l’Ancien Bourg 85240 Saint-Hilaire-des-Loges,85227_0020,G,RUE DE L ANCIEN BOURG,
301454914,00039,30145491400039,O,,,,,2019-11-14T14:01:02,true,1,,,,RUE,LEON BIENVENU,85240,SAINT-HILAIRE-DES-LOGES,,,85227,,,,,,,,,,,,,,,,,,,1990-09-29,F,,,,,85.1E,NAF1993,N,-0.662873,46.472981,0.96,street,Rue Léon Bienvenu 85240 Saint-Hilaire-des-Loges,85227_0139,G,RUE LEON BIENVENU,
301760211,00054,30176021100054,O,2003-01-01,,,,2019-11-14T14:01:02,true,3,,,,,SAINT PARDOUX,85240,SAINT-HILAIRE-DES-LOGES,,,85227,,,,,,,,,,,,,,,,,,,2003-12-31,F,,,,,45.4J,NAFRev1,N,-0.671071,46.471394,0.94,locality,Saint Pardoux 85240 Saint-Hilaire-des-Loges,85227_B264,G,SAINT PARDOUX,
301916318,00019,30191631800019,O,,,,,2019-11-14T14:01:02,true,1,,,,RUE,DE LA VIERGE,85240,SAINT-HILAIRE-DES-LOGES,,,85227,,,,,,,,,,,,,,,,,,,1984-12-25,F,,,,,78.02,NAP,N,-0.667333,46.471627,0.77,street,Chemin de la Vierge 85240 Saint-Hilaire-des-Loges,85227_0127,G,CHEMIN DE LA VIERGE,
303539779,00031,30353977900031,O,1995-01-01,NN,,,2019-11-14T14:01:02,true,1,,,B,,LA JAUBRETIERE,85240,SAINT-HILAIRE-DES-LOGES,,,85227,,,,,,,,,,,,,,,,,,,2002-03-31,F,,,,,45.3C,NAF1993,N,-0.640724,46.503348,0.85,street,La Jaubretière 85240 Saint-Hilaire-des-Loges,85227_nhkx30,G,LA JAUBRETIERE,
304180870,00020,30418087000020,O,1992-09-17,NN,,,2019-11-14T14:01:02,true,4,,46,,RUE,LEON BIENVENUE,85240,SAINT-HILAIRE-DES-LOGES,,,85227,,,,,,,,,,,,,,,,,,,2010-12-24,F,,,,,01.42Z,NAFRev2,N,-0.663485,46.472266,0.92,housenumber,46 Rue Léon Bienvenu 85240 Saint-Hilaire-des-Loges,85227_0139_00046,G,46 RUE LEON BIENVENU,
304938632,00029,30493863200029,O,1999-05-01,11,2020,4399CZ,2022-08-29T09:12:06,true,3,,,,,Z A DE LA BONNETTE,85240,SAINT-HILAIRE-DES-LOGES,,,85227,,,,,,,,,,,,,,,,,,,2008-01-01,A,,,,,43.99C,NAFRev2,O,-0.660849,46.478482,0.75,street,Rue de la Bonnette 85240 Saint-Hilaire-des-Loges,85227_0018,G,RUE DE LA BONNETTE,
304986615,00017,30498661500017,O,,,,,2019-11-14T14:01:02,true,1,,,,,BELLE ILE DENANT,85240,SAINT-HILAIRE-DES-LOGES,,,85227,,,,,,,,,,,,,,,,,,,1984-12-25,F,,,,,60.09,NAP,N,-0.645055,46.449246,0.44,street,Rue de la Chapelle 85240 Saint-Hilaire-des-Loges,85227_0469,G,RUE DE LA CHAPELLE,
306124215,00014,30612421500014,O,,,,,2019-11-14T14:01:02,true,1,,,,LD,LA MOULINOTTE,85240,SAINT-HILAIRE-DES-LOGES,,,85227,,,,,,,,,,,,,,,,,,,1984-12-25,F,,,,,21.01,NAP,N,-0.661777,46.461751,0.43,street,Rue du Moulin de Bonneuil 85240 Saint-Hilaire-des-Loges,85227_0081,G,RUE DU MOULIN DE BONNEUIL,
307049015,01461,30704901501461,O,1993-01-01,02,2020,,2022-08-29T09:12:38,false,4,,,,RTE,DE COULONGES,85240,SAINT-HILAIRE-DES-LOGES,,,85227,,,,,,,,,,,,,,,,,,,2008-01-01,A,,,,,64.19Z,NAFRev2,O,-0.63833,46.477083,0.84,street,Route de Coulonges 85240 Saint-Hilaire-des-Loges,85227_0037,G,ROUTE DE COULONGES,
307737387,00018,30773738700018,O,,NN,,,2019-11-14T14:01:02,true,1,,,,LD,LE FIEF DU ROY,85240,SAINT-HILAIRE-DES-LOGES,,,85227,,,,,,,,,,,,,,,,,,,,F,,,,,81.21,NAP,N,-0.660819,46.475175,0.77,street,Rue du Fief du Roy 85240 Saint-Hilaire-des-Loges,85227_0143,G,RUE DU FIEF DU ROY,
307748129,00037,30774812900037,O,,NN,,,2019-11-14T14:01:02,true,1,,,,,LES LOGES,85240,SAINT-HILAIRE-DES-LOGES,,,85227,,,,,,,,,,,,,,,,,,,1989-03-24,F,,,,,55.60,NAP,N,-0.648965,46.463899,0.91,street,Les Maisonnettes 85240 Saint-Hilaire-des-Loges,85227_eo3e35,G,LES MAISONNETTES,
308810969,00037,30881096900037,O,1992-07-01,NN,,,2019-11-14T14:01:02,true,1,,12,,IMP,DE L'OCTROI,85240,SAINT-HILAIRE-DES-LOGES,,,85227,,,,,,,,,,,,,,,,,,,2001-03-06,F,,,,,74.1J,NAF1993,N,-0.661075,46.469585,0.85,housenumber,12 Impasse de l’Octroi 85240 Saint-Hilaire-des-Loges,85227_0140_00012,G,12 IMPASSE DE L OCTROI,
308858190,00017,30885819000017,O,1900-01-01,NN,,,2019-11-14T14:01:02,true,3,,,,,,85240,SAINT-HILAIRE-DES-LOGES,,,85227,,,,,,,,,,,,,,,,,,,2008-01-01,A,,,,,94.99Z,NAFRev2,N,,,0,,,,,,
308936210,00027,30893621000027,O,1986-03-01,NN,,,2019-11-14T14:01:02,true,5,,1,,RUE,DE LA BELLE ETOILE,85240,SAINT-HILAIRE-DES-LOGES,,,85227,,,,,,,,,,,,,,,,,,,2012-09-23,F,,,,,96.02A,NAFRev2,O,-0.664136,46.471496,0.95,housenumber,1 Rue de la Belle Étoile 85240 Saint-Hilaire-des-Loges,85227_0145_00001,G,1 RUE DE LA BELLE ETOILE,
309378701,00010,30937870100010,O,,NN,,,2019-11-14T14:01:02,true,1,,,,RTE,DE CHAVAGNE,85240,SAINT-HILAIRE-DES-LOGES,,,85227,,,,,,,,,,,,,,,,,,,1993-02-02,F,,,,,29.3A,NAF1993,N,-0.610899,46.456391,0.82,street,Route du Haut de Chavagne 85240 Saint-Hilaire-des-Loges,85227_0463,G,ROUTE DU HAUT DE CHAVAGNE,
309384543,00018,30938454300018,O,,,,,2019-11-14T14:01:02,true,1,,,,,,85240,SAINT-HILAIRE-DES-LOGES,,,85227,,,,,,,,,,,,,,,,,,,,F,,,,,55.72,NAP,N,,,0,,,,,,
310450556,00025,31045055600025,O,1990-08-01,NN,,,2019-11-14T14:01:02,true,4,,,,PL,DES HALLES,85240,SAINT-HILAIRE-DES-LOGES,,,85227,,,,,,,,,,,,,,,,,,,2008-01-01,A,,,,,68.20B,NAFRev2,N,-0.664555,46.471524,0.8,street,Place des Halles 85240 Saint-Hilaire-des-Loges,85227_amc837,G,PLACE DES HALLES,
310450754,00018,31045075400018,O,,,,,2019-11-14T14:01:02,true,1,,,,RTE,DE COULONGES LA MOULINOTTE,85240,SAINT-HILAIRE-DES-LOGES,,,85227,,,,,,,,,,,,,,,,,,,,F,,,,,77.08,NAP,N,-0.63833,46.477083,0.54,street,Route de Coulonges 85240 Saint-Hilaire-des-Loges,85227_0037,G,ROUTE DE COULONGES,
311635494,00017,31163549400017,O,,,,,2019-11-14T14:01:02,true,1,,,,,L ESSERT,85240,SAINT-HILAIRE-DES-LOGES,,,85227,,,,,,,,,,,,,,,,,,,1997-12-31,F,,,,,52.7H,NAF1993,N,-0.638092,46.465348,0.64,street,Lessert 85240 Saint-Hilaire-des-Loges,85227_j7hq4m,G,LESSERT,
311713580,00059,31171358000059,O,2008-03-01,,,3109BA,2019-11-14T14:01:02,false,2,,98,,RUE,LEON BIENVENU,85240,SAINT-HILAIRE-DES-LOGES,,,85227,,,,,,,,,,,,,,,,,,,2017-04-15,F,L'ATELIER DU NOEUD DE CHAT,,,,31.09B,NAFRev2,N,-0.662163,46.474653,0.96,housenumber,98 Rue Léon Bienvenu 85240 Saint-Hilaire-des-Loges,85227_0139_00098,G,98 RUE LEON BIENVENU,
311862718,00039,31186271800039,O,1998-04-01,NN,,4776ZP,2019-11-14T14:01:02,false,4,,16,,RUE,DE L'OCTROI,85240,SAINT-HILAIRE-DES-LOGES,,,85227,,,,,,,,,,,,,,,,,,,2003-09-30,F,,,,,93.0H,NAFRev1,O,-0.664,46.47037,0.96,housenumber,16 Rue de l’Octroi 85240 Saint-Hilaire-des-Loges,85227_0129_00016,G,16 RUE DE L OCTROI,
311889034,00014,31188903400014,O,,NN,,,2019-11-14T14:01:02,true,1,,,,,BOURG,85240,SAINT-HILAIRE-DES-LOGES,,,85227,,,,,,,,,,,,,,,,,,,1987-12-25,F,,,,,96.25,NAP,N,-0.673487,46.478022,0.92,street,Rue de l’Ancien Bourg 85240 Saint-Hilaire-des-Loges,85227_0020,G,RUE DE L ANCIEN BOURG,
311915888,00029,31191588800029,O,1991-06-01,NN,,,2019-11-14T14:01:02,true,3,,3,,RUE,DE LA BELLE ETOILE,85240,SAINT-HILAIRE-DES-LOGES,,,85227,,,,,,,,,,,,,,,,,,,2008-01-01,A,,,,,82.19Z,NAFRev2,N,-0.663994,46.471432,0.95,housenumber,3 Rue de la Belle Étoile 85240 Saint-Hilaire-des-Loges,85227_0145_00003,G,3 RUE DE LA BELLE ETOILE,
313882433,00029,31388243300029,O,,NN,,4399CZ,2019-11-14T14:01:02,true,1,,20,,CITE,DE LA BUTTE AUX CAILLES,85240,SAINT-HILAIRE-DES-LOGES,,,85227,,,,,,,,,,,,,,,,,,,1989-12-25,F,,,,,45.2V,NAF1993,N,-0.658501,46.469264,0.84,housenumber,20 Rue de la Butte aux Cailles 85240 Saint-Hilaire-des-Loges,85227_0148_00020,G,20 RUE DE LA BUTTE AUX CAILLES,
314089673,00011,31408967300011,O,,NN,,,2019-11-14T14:01:02,true,1,,,,,L'AUBRETIERE,85240,SAINT-HILAIRE-DES-LOGES,,,85227,,,,,,,,,,,,,,,,,,,1988-11-15,F,,,,,55.31,NAP,N,-0.669615,46.478323,0.93,street,Rue de l’Aubretière 85240 Saint-Hilaire-des-Loges,85227_0019,G,RUE DE L AUBRETIERE,
314584533,00017,31458453300017,O,,,,,2019-11-14T14:01:02,true,1,,,,,,85240,SAINT-HILAIRE-DES-LOGES,,,85227,,,,,,,,,,,,,,,,,,,,F,,,,,92.12,NAP,N,,,0,,,,,,
314584541,00010,31458454100010,O,,,,,2019-11-14T14:01:02,true,1,,,,,,85240,SAINT-HILAIRE-DES-LOGES,,,85227,,,,,,,,,,,,,,,,,,,,F,,,,,92.12,NAP,N,,,0,,,,,,
314648908,00015,31464890800015,O,1900-01-01,,,,2019-11-14T14:01:02,false,4,,,,,LA MOULINOTTE,85240,SAINT-HILAIRE-DES-LOGES,,,85227,,,,,,,,,,,,,,,,,,,1993-04-27,F,,,,,85.1C,NAF1993,N,-0.661777,46.461751,0.43,street,Rue du Moulin de Bonneuil 85240 Saint-Hilaire-des-Loges,85227_0081,G,RUE DU MOULIN DE BONNEUIL,
314648908,00023,31464890800023,O,1993-04-27,03,2020,,2022-08-29T09:14:38,true,4,,16,,RUE,LEON BIENVENU,85240,SAINT-HILAIRE-DES-LOGES,,,85227,,,,,,,,,,,,,,,,,,,2008-01-01,A,,,,,86.90D,NAFRev2,O,-0.664342,46.471233,0.96,housenumber,16 Rue Léon Bienvenu 85240 Saint-Hilaire-des-Loges,85227_0139_00016,G,16 RUE LEON BIENVENU,
314648908,00031,31464890800031,O,1983-01-01,NN,,,2019-11-14T14:01:02,false,5,LA MOULINOTTE,16,,RUE,LEON BIENVENU,85240,SAINT-HILAIRE-DES-LOGES,,,85227,,,,,,,,,,,,,,,,,,,2015-12-31,A,SCE SOINS DOMICILE PERSONNES AGEES,,,,86.90D,NAFRev2,N,-0.664342,46.471233,0.96,housenumber,16 Rue Léon Bienvenu 85240 Saint-Hilaire-des-Loges,85227_0139_00016,G,16 RUE LEON BIENVENU,
314973793,00032,31497379300032,O,2020-03-05,,,,2020-03-18T09:17:27,false,1,INZAIS,,,,,85240,SAINT-HILAIRE-DES-LOGES,,,85227,,,,,,,,,,,,,,,,,,,2020-03-05,A,,,,,01.24Z,NAFRev2,N,-0.628796,46.450373,0.95,street,Inzais 85240 Saint-Hilaire-des-Loges,85227_vzyt9s,D,INZAIS,
316536549,00017,31653654900017,O,,NN,,,2020-08-20T03:58:25,true,1,,,,,SERZAIS,85240,SAINT-HILAIRE-DES-LOGES,,,85227,,,,,,,,,,,,,,,,,,,,F,,,,,01.56,NAP,N,-0.629847,46.467425,0.58,locality,Serzay 85240 Saint-Hilaire-des-Loges,85227_e2qgk3,G,SERZAY,
316536556,00012,31653655600012,O,,NN,,,2019-11-14T14:01:02,true,1,,,,,CHANTEGROS,85240,SAINT-HILAIRE-DES-LOGES,,,85227,,,,,,,,,,,,,,,,,,,1992-04-30,F,,,,,01.2A,NAF1993,N,-0.628641,46.47213,0.93,street,Rue de Chantegros 85240 Saint-Hilaire-des-Loges,85227_0455,G,RUE DE CHANTEGROS,
316537307,00019,31653730700019,O,,NN,,,2019-11-14T14:01:02,true,1,,,,,CHAIRE,85240,SAINT-HILAIRE-DES-LOGES,,,85227,,,,,,,,,,,,,,,,,,,1989-01-01,F,,,,,01.56,NAP,N,-0.654296,46.463466,0.94,street,Chaire 85240 Saint-Hilaire-des-Loges,85227_1q7tuh,G,CHAIRE,
316550045,00017,31655004500017,O,1979-01-01,01,2020,,2022-08-29T09:15:16,true,4,,,,,BRETET,85240,SAINT-HILAIRE-DES-LOGES,,,85227,,,,,,,,,,,,,,,,,,,2012-12-31,A,,,,,01.11Z,NAFRev2,O,-0.644678,46.44762,0.94,locality,Bretet 85240 Saint-Hilaire-des-Loges,85227_mq8ypw,G,BRETET,
317050979,00010,31705097900010,O,1979-01-01,NN,,,2019-11-14T14:01:02,true,4,,,,,LE MOULIN DE BONNEUIL,85240,SAINT-HILAIRE-DES-LOGES,,,85227,,,,,,,,,,,,,,,,,,,2009-06-30,F,,,,,01.41Z,NAFRev2,N,-0.665844,46.461463,0.94,street,Le Moulin de Bonneuil 85240 Saint-Hilaire-des-Loges,85227_78746w,G,LE MOULIN DE BONNEUIL,
317051001,00012,31705100100012,O,,NN,,,2019-11-14T14:01:02,true,1,,,,,BONNEUIL,85240,SAINT-HILAIRE-DES-LOGES,,,85227,,,,,,,,,,,,,,,,,,,1990-06-15,F,,,,,01.56,NAP,N,-0.659161,46.459836,0.92,street,Rue des Hauts de Bonneuil 85240 Saint-Hilaire-des-Loges,85227_0050,G,RUE DES HAUTS DE BONNEUIL,
317987113,00022,31798711300022,O,1991-06-01,01,2020,,2022-08-29T09:15:45,true,4,,3,,RUE,DE LA BELLE ETOILE,85240,SAINT-HILAIRE-DES-LOGES,,,85227,,,,,,,,,,,,,,,,,,,2008-01-01,A,,,,,86.21Z,NAFRev2,O,-0.663994,46.471432,0.95,housenumber,3 Rue de la Belle Étoile 85240 Saint-Hilaire-des-Loges,85227_0145_00003,G,3 RUE DE LA BELLE ETOILE,
318571643,00010,31857164300010,O,1980-01-01,NN,,,2019-11-14T14:01:02,true,4,,,,,ST PARDOUX,85240,SAINT-HILAIRE-DES-LOGES,,,85227,,,,,,,,,,,,,,,,,,,2012-12-31,F,,,,,77.31Z,NAFRev2,N,-0.671071,46.471394,0.77,locality,Saint Pardoux 85240 Saint-Hilaire-des-Loges,85227_B264,G,SAINT PARDOUX,
319075875,00017,31907587500017,O,1901-07-07,11,2020,,2022-08-29T09:16:12,false,4,,,,PL,DE L EGLISE,85240,SAINT-HILAIRE-DES-LOGES,,,85227,,,,,,,,,,,,,,,,,,,2008-01-01,A,CLCA,,,,64.19Z,NAFRev2,O,-0.66512,46.470983,0.82,street,Place de l’Église 85240 Saint-Hilaire-des-Loges,85227_0026,G,PLACE DE L EGLISE,
320129554,00012,32012955400012,O,1980-06-17,NN,,,2019-11-14T14:01:02,false,4,,,,,ARTY,85240,SAINT-HILAIRE-DES-LOGES,,,85227,,,,,,,,,,,,,,,,,,,2008-01-01,F,,,,,01.42Z,NAFRev2,N,-0.638149,46.476924,0.94,locality,Arty 85240 Saint-Hilaire-des-Loges,85227_h4f6eg,G,ARTY,