siren,nic,siret,statutDiffusionEtablissement,dateCreationEtablissement,trancheEffectifsEtablissement,anneeEffectifsEtablissement,activitePrincipaleRegistreMetiersEtablissement,dateDernierTraitementEtablissement,etablissementSiege,nombrePeriodesEtablissement,complementAdresseEtablissement,numeroVoieEtablissement,indiceRepetitionEtablissement,typeVoieEtablissement,libelleVoieEtablissement,codePostalEtablissement,libelleCommuneEtablissement,libelleCommuneEtrangerEtablissement,distributionSpecialeEtablissement,codeCommuneEtablissement,codeCedexEtablissement,libelleCedexEtablissement,codePaysEtrangerEtablissement,libellePaysEtrangerEtablissement,complementAdresse2Etablissement,numeroVoie2Etablissement,indiceRepetition2Etablissement,typeVoie2Etablissement,libelleVoie2Etablissement,codePostal2Etablissement,libelleCommune2Etablissement,libelleCommuneEtranger2Etablissement,distributionSpeciale2Etablissement,codeCommune2Etablissement,codeCedex2Etablissement,libelleCedex2Etablissement,codePaysEtranger2Etablissement,libellePaysEtranger2Etablissement,dateDebut,etatAdministratifEtablissement,enseigne1Etablissement,enseigne2Etablissement,enseigne3Etablissement,denominationUsuelleEtablissement,activitePrincipaleEtablissement,nomenclatureActivitePrincipaleEtablissement,caractereEmployeurEtablissement,longitude,latitude,geo_score,geo_type,geo_adresse,geo_id,geo_ligne,geo_l4,geo_l5
200097822,00015,20009782200015,O,2020-10-01,,,,2022-03-22T11:20:31,true,1,SCIC TERROIRS DE LA CITE,3,,AV,MARCELIN ALBERT,11170,VILLESEQUELANDE,,,11437,,,,,,,,,,,,,,,,,,,2020-10-01,A,,,,,42.99Z,NAFRev2,N,2.229938,43.237712,0.85,housenumber,3 Avenue Marcelin Albert 11170 Villesèquelande,11437_0056_00003,G,3 AVENUE MARCELIN ALBERT,
211104377,00018,21110437700018,O,1983-03-01,11,2020,,2022-08-29T09:05:56,true,4,HOTEL DE VILLE,,,,,11170,VILLESEQUELANDE,,,11437,,,,,,,,,,,,,,,,,,,2008-01-01,A,MAIRIE,,,,84.11Z,NAFRev2,O,2.232602,43.238891,0.63,street,Avenue du General de Gaulle 11170 Villesèquelande,11437_0023,D,AVENUE DU GENERAL DE GAULLE,
211104377,00026,21110437700026,O,1983-12-21,02,2020,,2022-08-29T09:05:56,false,4,,5,,RUE,DES ETUDES,11170,VILLESEQUELANDE,,,11437,,,,,,,,,,,,,,,,,,,2020-03-06,A,ECOLE PRIMAIRE PUBLIQUE CANAL DES DEUX MERS,,,,85.20Z,NAFRev2,N,2.233907,43.237391,0.95,housenumber,5 Rue des Etudes 11170 Villesèquelande,11437_0012_00005,G,5 RUE DES ETUDES,
211104377,00034,21110437700034,O,1996-01-01,NN,,,2015-09-28T16:34:55,false,4,MAIRIE,,,,HOTEL DE VILLE,11170,VILLESEQUELANDE,,,11437,,,,,,,,,,,,,,,,,,,2013-04-09,F,SERVICE EAU ET ASSAINISSEMENT,,,,36.00Z,NAFRev2,N,2.232602,43.238891,0.63,street,Avenue du General de Gaulle 11170 Villesèquelande,11437_0023,G,AVENUE DU GENERAL DE GAULLE,
211104377,00042,21110437700042,O,1996-10-01,NN,,,2008-01-04T18:25:52,false,3,MAIRIE,,,PL,DE LA RESISTANCE,11170,VILLESEQUELANDE,,,11437,,,,,,,,,,,,,,,,,,,2008-01-01,A,LOTISSEMENT COMMUNAL,,,,42.99Z,NAFRev2,N,2.232452,43.237713,0.85,street,Place de la Résistance 11170 Villesèquelande,11437_0077,G,PLACE DE LA RESISTANCE,
211104377,00059,21110437700059,O,1997-04-11,NN,,,,false,4,MAIRIE,,,,,11170,VILLESEQUELANDE,,,11437,,,,,,,,,,,,,,,,,,,2002-07-01,F,LOTISSEMENT VILLESEQUELANDE I,,,,70.1C,NAF1993,N,2.232619,43.240112,0.39,street,Voie Romaine 11170 Villesèquelande,11437_gtgw33,D,VOIE ROMAINE,
211104377,00067,21110437700067,O,2000-04-01,NN,,,,false,4,,,,,MAIRIE,11170,VILLESEQUELANDE,,,11437,,,,,,,,,,,,,,,,,,,2002-04-30,F,LOTISSEMENT GRANELLE VILLESEQUELANDE II,,,,70.1C,NAF1993,N,3.0709671,50.6304695,0.92,poi.townhall,Hôtel de Ville Lille,https://osm.org/way/40917078,G,,
211104377,00075,21110437700075,O,2002-03-27,NN,,,2013-10-05T12:16:09,false,4,MAIRIE,,,,,11170,VILLESEQUELANDE,,,11437,,,,,,,,,,,,,,,,,,,2012-12-25,F,LOTISSEMENT LA MOULINASSE 2,,,,42.99Z,NAFRev2,N,2.232619,43.240112,0.39,street,Voie Romaine 11170 Villesèquelande,11437_gtgw33,D,VOIE ROMAINE,
211104377,00083,21110437700083,O,2005-05-16,,,,2008-01-04T18:25:52,false,2,,8,,PL,DE LA RESISTANCE,11170,VILLESEQUELANDE,,,11437,,,,,,,,,,,,,,,,,,,2008-01-01,A,LOTISSEMENT CHEMIN DU CHATEAU D'EAU,,,,42.99Z,NAFRev2,N,2.232572,43.237737,0.86,housenumber,8 Place de la Résistance 11170 Villesèquelande,11437_0077_00008,G,8 PLACE DE LA RESISTANCE,
241100452,00028,24110045200028,O,2004-04-13,NN,,,2013-04-25T11:29:14,false,4,,,,RUE,SAINT ROCH,11170,VILLESEQUELANDE,,,11437,,,,,,,,,,,,,,,,,,,2013-01-01,F,ATELIER RELAIS DE VLLESEQUELANDE,,,,68.20B,NAFRev2,N,2.230351,43.238576,0.94,street,Rue de Saint Roch 11170 Villesèquelande,11437_0083,G,RUE DE SAINT ROCH,
261100481,00017,26110048100017,O,1983-08-10,NN,,,2010-06-26T03:04:24,true,3,MAIRIE,,,,HOTEL DE VILLE,11170,VILLESEQUELANDE,,,11437,,,,,,,,,,,,,,,,,,,2008-01-01,A,CCAS,,,,88.99B,NAFRev2,N,2.232602,43.238891,0.63,street,Avenue du General de Gaulle 11170 Villesèquelande,11437_0023,G,AVENUE DU GENERAL DE GAULLE,
291102390,00015,29110239000015,O,2000-07-30,,,,2008-01-04T19:05:57,true,3,,,,,,11170,VILLESEQUELANDE,,,11437,,,,,,,,,,,,,,,,,,,2008-01-01,A,,,,,42.99Z,NAFRev2,N,,,0,,,,,,
300270436,00011,30027043600011,O,,,,,,true,1,,,,,,11170,VILLESEQUELANDE,,,11437,,,,,,,,,,,,,,,,,,,1984-12-25,F,,,,,65.02,NAP,N,,,0,,,,,,
306662917,00013,30666291700013,O,1900-01-01,,,,2008-11-07T00:22:24,false,2,,23,,RTE,DE BRAM,11170,VILLESEQUELANDE,,,11437,,,,,,,,,,,,,,,,,,,1993-10-01,F,,,,,,,,2.230664,43.239003,0.5,street,Chemin de Bram 11170 Villesèquelande,11437_B009,G,CHEMIN DE BRAM,
310350806,00017,31035080600017,O,,NN,,,,true,1,,,,RTE,DEPART 33,11170,VILLESEQUELANDE,,,11437,,,,,,,,,,,,,,,,,,,1989-03-31,F,,,,,81.21,NAP,N,,,0,,,,,,
316173491,00028,31617349100028,O,1900-01-01,NN,,,2008-01-04T20:44:15,false,3,,,,,,11170,VILLESEQUELANDE,,,11437,,,,,,,,,,,,,,,,,,,2008-01-01,A,,,,,41.10D,NAFRev2,N,,,0,,,,,,
317836294,00056,31783629400056,O,2002-11-01,,,,2008-11-07T00:33:29,false,3,,,,,ZONE ARTISANALE,11170,VILLESEQUELANDE,,,11437,,,,,,,,,,,,,,,,,,,2004-11-01,F,,,,,45.4D,NAFRev1,O,2.7640352,42.6301915,0.9,poi.retail,Zone Artisanale (Zone commerciale) Thuir,https://osm.org/way/191039530,G,,
320819527,00013,32081952700013,O,1900-01-01,NN,,,2011-05-04T00:11:12,true,4,,2,,,RUE DU 8 MAI,11170,VILLESEQUELANDE,,,11437,,,,,,,,,,,,,,,,,,,2008-01-01,A,,,,,01.21Z,NAFRev2,N,2.232451,43.237382,0.94,housenumber,2 Rue du 8 Mai 11170 Villesèquelande,11437_0059_00002,G,2 RUE DU 8 MAI,
321080905,00011,32108090500011,O,,,,,,true,1,,30,,,LOT RTE DE BRAM,11170,VILLESEQUELANDE,,,11437,,,,,,,,,,,,,,,,,,,1984-12-25,F,,,,,16.01,NAP,N,2.230664,43.239003,0.47,street,Chemin de Bram 11170 Villesèquelande,11437_B009,G,CHEMIN DE BRAM,
322906017,00023,32290601700023,O,1981-01-01,NN,,,,false,3,,,,,,11170,VILLESEQUELANDE,,,11437,,,,,,,,,,,,,,,,,,,2002-12-31,F,,,,,01.3Z,NAF1993,N,,,0,,,,,,
326423100,00014,32642310000014,O,,NN,,,,true,1,,,,,,11170,VILLESEQUELANDE,,,11437,,,,,,,,,,,,,,,,,,,1987-10-30,F,,,,,65.02,NAP,N,,,0,,,,,,
326878428,00035,32687842800035,O,2022-07-21,,,,2022-09-15T16:45:05,true,1,,7,,AV,DES BASQUES CIBOURE,11170,VILLESEQUELANDE,,,11437,,,,,,,,,,,,,,,,,,,2022-07-21,A,,,,,02.40Z,NAFRev2,N,,,0,,,,,,
330091430,00059,33009143000059,O,2004-05-15,,,,2006-12-05T14:34:08,true,3,,20,,,VOIE ROMAINE,11170,VILLESEQUELANDE,,,11437,,,,,,,,,,,,,,,,,,,2006-09-30,F,,,,,55.3A,NAFRev1,N,2.231357,43.240218,0.95,housenumber,20 Voie Romaine 11170 Villesèquelande,11437_gtgw33_00020,G,20 VOIE ROMAINE,
330624347,00010,33062434700010,O,1984-01-23,NN,,,2011-04-28T00:25:52,false,4,,18,,RUE,GEORGES BRASSENS,11170,VILLESEQUELANDE,,,11437,,,,,,,,,,,,,,,,,,,2001-10-31,F,,,,,85.1G,NAF1993,N,2.235224,43.239039,0.95,housenumber,18 Rue Georges Brassens 11170 Villesèquelande,11437_0029_00018,G,18 RUE GEORGES BRASSENS,
330864729,00018,33086472900018,O,1900-01-01,,,,2011-04-28T00:26:05,false,2,,13,,RTE,DE BRAM,11170,VILLESEQUELANDE,,,11437,,,,,,,,,,,,,,,,,,,1985-12-25,F,,,,,60.09,NAP,N,2.230664,43.239003,0.5,street,Chemin de Bram 11170 Villesèquelande,11437_B009,G,CHEMIN DE BRAM,
331804765,00047,33180476500047,O,2012-12-20,NN,,4399CZ,2016-04-20T08:44:36,false,3,,3,,RUE,DRESSIERE,11170,VILLESEQUELANDE,,,11437,,,,,,,,,,,,,,,,,,,2016-03-31,F,,,,,43.99C,NAFRev2,O,2.238724,43.238456,0.93,housenumber,3 Rue de la Dressière 11170 Villesèquelande,11437_0008_00003,G,3 RUE DE LA DRESSIERE,
332727098,00029,33272709800029,O,1996-10-14,NN,,,,true,1,,1,,RUE,JEAN MOULIN,11170,VILLESEQUELANDE,,,11437,,,,,,,,,,,,,,,,,,,2001-06-30,F,,,,,45.3A,NAF1993,N,2.231932,43.237795,0.95,housenumber,1 Rue Jean Moulin 11170 Villesèquelande,11437_0039_00001,G,1 RUE JEAN MOULIN,
332944677,00027,33294467700027,O,,,,,,true,1,,,,,ZONE ARTISANALE,11170,VILLESEQUELANDE,,,11437,,,,,,,,,,,,,,,,,,,1990-02-19,F,,,,,53.05,NAP,N,2.7640352,42.6301915,0.9,poi.retail,Zone Artisanale (Zone commerciale) Thuir,https://osm.org/way/191039530,G,,
333967875,00019,33396787500019,O,1985-11-04,NN,,,2008-11-07T00:54:00,true,3,,,,,,11170,VILLESEQUELANDE,,,11437,,,,,,,,,,,,,,,,,,,2005-12-31,F,,,,,52.7D,NAFRev1,N,,,0,,,,,,
335280061,00029,33528006100029,O,1998-02-01,NN,,,2006-12-10T05:45:42,true,3,,,,,LES MOULINS,11170,VILLESEQUELANDE,,,11437,,,,,,,,,,,,,,,,,,,2005-08-31,F,,,,,01.1G,NAFRev1,N,2.231697,43.237881,0.55,street,Rue Jean Moulin 11170 Villesèquelande,11437_0039,G,RUE JEAN MOULIN,
343221859,00014,34322185900014,O,1900-01-01,NN,,,2011-04-28T00:36:03,false,2,,,,AV,DU 11 NOVEMBRE,11170,VILLESEQUELANDE,,,11437,,,,,,,,,,,,,,,,,,,1994-05-25,F,,,,,,,,2.233148,43.238425,0.84,street,Avenue du 11 Novembre 11170 Villesèquelande,11437_0063,G,AVENUE DU 11 NOVEMBRE,
343507141,00020,34350714100020,O,1994-04-01,NN,,,2022-10-26T03:51:06,true,6,ZONE ARTISANALE,8,,RUE,DE LA ZONE,11170,VILLESEQUELANDE,,,11437,,,,,,,,,,,,,,,,,,,2021-12-31,F,,,,,22.19Z,NAFRev2,N,2.23335,43.234417,0.68,housenumber,8 Rue de la Fon du Vicaire 11170 Villesèquelande,11437_0017_00008,G,8 RUE DE LA FON DU VICAIRE,
343723896,00019,34372389600019,O,1988-01-01,NN,,,2008-11-08T00:18:14,true,3,,,,,,11170,VILLESEQUELANDE,,,11437,,,,,,,,,,,,,,,,,,,1994-12-25,F,,,,,45.4D,NAF1993,N,,,0,,,,,,
343873410,00025,34387341000025,O,2006-09-21,,,,2021-02-23T10:59:00,true,2,,20,,,VOIE ROMAINE,11170,VILLESEQUELANDE,,,11437,,,,,,,,,,,,,,,,,,,2008-01-01,A,,,,,68.20B,NAFRev2,N,2.231357,43.240218,0.95,housenumber,20 Voie Romaine 11170 Villesèquelande,11437_gtgw33_00020,G,20 VOIE ROMAINE,
344901855,00025,34490185500025,O,1968-01-01,NN,,,2016-01-12T00:12:58,true,3,,,,,,11170,VILLESEQUELANDE,,,11437,,,,,,,,,,,,,,,,,,,2008-01-01,A,,,,,01.21Z,NAFRev2,N,,,0,,,,,,
344909007,00017,34490900700017,O,,NN,,,,true,1,,25,,IMP,DES LAURIERS,11170,VILLESEQUELANDE,,,11437,,,,,,,,,,,,,,,,,,,1989-04-27,F,,,,,87.07,NAP,N,2.230554,43.239822,0.85,housenumber,25 Impasse des Lauriers 11170 Villesèquelande,11437_0051_00025,G,25 IMPASSE DES LAURIERS,
345180426,00032,34518042600032,O,1995-12-01,NN,,,2011-04-28T00:37:46,false,4,,,,,,11170,VILLESEQUELANDE,,,11437,,,,,,,,,,,,,,,,,,,1999-09-30,F,,,,,50.2Z,NAF1993,N,,,0,,,,,,
348167917,00015,34816791700015,O,1988-06-23,NN,,,2008-04-26T10:57:12,true,4,,,,,,11170,VILLESEQUELANDE,,,11437,,,,,,,,,,,,,,,,,,,2008-01-01,A,,,,,88.91A,NAFRev2,O,,,0,,,,,,
349445817,00068,34944581700068,O,2010-05-01,,,,2019-04-23T08:34:27,true,5,,1,,RUE,MARCELIN HORUS,11170,VILLESEQUELANDE,,,11437,,,,,,,,,,,,,,,,,,,2019-04-15,A,,,,MUSEE DE LA CHEVALERIE,91.02Z,NAFRev2,N,2.23186,43.237365,0.9,housenumber,1 Rue Marcellin Horus 11170 Villesèquelande,11437_0057_00001,G,1 RUE MARCELLIN HORUS,
349445817,00076,34944581700076,O,2014-07-15,,,,2015-05-27T10:40:46,false,1,,1,,RLE,DE LA MAIRIE,11170,VILLESEQUELANDE,,,11437,,,,,,,,,,,,,,,,,,,2014-07-15,F,MUSEE DE LA CHEVALERIE,,,MUSEE DE LA CHEVALERIE,91.02Z,NAFRev2,N,2.225153,43.238474,0.56,housenumber,1 Rue de la Malepère 11170 Villesèquelande,11437_0055_00001,G,1 RUE DE LA MALEPERE,
350463758,00028,35046375800028,O,1999-10-01,NN,,,2020-11-26T11:49:27,false,5,ZONE ARTISANALE,,,LOT,LA MOULINASSE,11170,VILLESEQUELANDE,,,11437,,,,,,,,,,,,,,,,,,,2012-12-17,F,,,,,45.20A,NAFRev2,N,2.231697,43.237881,0.35,street,Rue Jean Moulin 11170 Villesèquelande,11437_0039,G,RUE JEAN MOULIN,
351181094,00019,35118109400019,O,,NN,,,,true,1,,,,RTE,DE BRAM,11170,VILLESEQUELANDE,,,11437,,,,,,,,,,,,,,,,,,,1989-09-15,F,,,,,62.46,NAP,N,2.230664,43.239003,0.62,street,Chemin de Bram 11170 Villesèquelande,11437_B009,G,CHEMIN DE BRAM,
351776497,00023,35177649700023,O,1991-01-01,NN,,,2008-11-08T00:28:20,true,3,CD 33 ANCIENNE STATION SHE,,,,VOIE ROMAINE,11170,VILLESEQUELANDE,,,11437,,,,,,,,,,,,,,,,,,,1993-11-10,F,,,,,55.3A,NAF1993,N,2.232619,43.240112,0.95,street,Voie Romaine 11170 Villesèquelande,11437_gtgw33,G,VOIE ROMAINE,
353281702,00020,35328170200020,O,1991-07-01,NN,,,,true,1,,,,,,11170,VILLESEQUELANDE,,,11437,,,,,,,,,,,,,,,,,,,2000-09-30,F,,,,,25.2H,NAF1993,N,,,0,,,,,,
377766092,00060,37776609200060,O,1997-08-12,NN,,,,true,1,,,,,VOIE ROMAINE,11170,VILLESEQUELANDE,,,11437,,,,,,,,,,,,,,,,,,,2000-12-31,F,,,,,55.3B,NAF1993,O,2.232619,43.240112,0.95,street,Voie Romaine 11170 Villesèquelande,11437_gtgw33,G,VOIE ROMAINE,
377890546,00015,37789054600015,O,,NN,,,,true,1,,,,,VOIE ROMAINE,11170,VILLESEQUELANDE,,,11437,,,,,,,,,,,,,,,,,,,1990-06-01,F,,,,,67.01,NAP,N,2.232619,43.240112,0.95,street,Voie Romaine 11170 Villesèquelande,11437_gtgw33,G,VOIE ROMAINE,
380015768,00019,38001576800019,O,1990-10-01,NN,,,2013-10-25T03:17:24,true,4,,23,,RTE,DE BRAM,11170,VILLESEQUELANDE,,,11437,,,,,,,,,,,,,,,,,,,1994-12-25,F,,,,,45.2V,NAF1993,O,2.230664,43.239003,0.5,street,Chemin de Bram 11170 Villesèquelande,11437_B009,G,CHEMIN DE BRAM,
380431353,00016,38043135300016,O,1991-01-01,NN,,,2011-04-15T11:58:25,false,4,,11,,,VOIE ROMAINE,11170,VILLESEQUELANDE,,,11437,,,,,,,,,,,,,,,,,,,2010-11-30,F,,,,,68.20A,NAFRev2,N,2.232712,43.240033,0.95,housenumber,11 Voie Romaine 11170 Villesèquelande,11437_gtgw33_00011,G,11 VOIE ROMAINE,
380431353,00024,38043135300024,O,2010-11-30,,,,2021-02-23T11:08:55,true,1,,15,,,VOIE ROMAINE,11170,VILLESEQUELANDE,,,11437,,,,,,,,,,,,,,,,,,,2010-11-30,A,,,,,68.20A,NAFRev2,N,2.232567,43.24003,0.95,housenumber,15 Voie Romaine 11170 Villesèquelande,11437_gtgw33_00015,G,15 VOIE ROMAINE,
383454725,00029,38345472500029,O,1992-05-18,,,,,false,3,,,,,ZONE ARTISANALE,11170,VILLESEQUELANDE,,,11437,,,,,,,,,,,,,,,,,,,1993-03-19,F,,,,,36.1G,NAF1993,N,2.7640352,42.6301915,0.9,poi.retail,Zone Artisanale (Zone commerciale) Thuir,https://osm.org/way/191039530,G,,
383757788,00013,38375778800013,O,,NN,,,,true,1,,,,,,11170,VILLESEQUELANDE,,,11437,,,,,,,,,,,,,,,,,,,1996-06-26,F,,,,,45.2V,NAF1993,O,,,0,,,,,,
384488508,00019,38448850800019,O,1992-01-01,NN,,,,true,1,,,,RUE,SAINT ROCH,11170,VILLESEQUELANDE,,,11437,,,,,,,,,,,,,,,,,,,2001-12-28,F,,,,,51.3J,NAF1993,N,2.230351,43.238576,0.94,street,Rue de Saint Roch 11170 Villesèquelande,11437_0083,G,RUE DE SAINT ROCH,
384776449,00033,38477644900033,O,2005-09-01,,,,2017-05-04T02:53:26,false,4,CELLIER LA VOIE ROMAINE,19,,RUE,SAINT ROCH,11170,VILLESEQUELANDE,,,11437,,,,,,,,,,,,,,,,,,,2015-07-15,F,,,,,46.34Z,NAFRev2,O,2.228526,43.239696,0.94,housenumber,19 Rue de Saint Roch 11170 Villesèquelande,11437_0083_00019,G,19 RUE DE SAINT ROCH,
390148179,00018,39014817900018,O,1993-01-01,NN,,,2008-01-04T23:35:49,true,3,,,,,MAIRIE,11170,VILLESEQUELANDE,,,11437,,,,,,,,,,,,,,,,,,,2008-01-01,A,,,,,94.99Z,NAFRev2,N,3.0709671,50.6304695,0.92,poi.townhall,Hôtel de Ville Lille,https://osm.org/way/40917078,G,,
390322519,00013,39032251900013,O,1993-01-01,NN,,,2008-01-04T23:38:32,true,3,,,,,MAIRIE,11170,VILLESEQUELANDE,,,11437,,,,,,,,,,,,,,,,,,,2008-01-01,A,,,,,94.99Z,NAFRev2,N,3.0709671,50.6304695,0.92,poi.townhall,Hôtel de Ville Lille,https://osm.org/way/40917078,G,,
391190816,00119,39119081600119,O,2000-04-01,NN,,,,false,3,,11,,AV,PAUL RIQUET,11170,VILLESEQUELANDE,,,11437,,,,,,,,,,,,,,,,,,,2000-12-31,F,MICHEL BOFFELI,,,,51.5F,NAF1993,O,2.232606,43.237382,0.85,housenumber,11 Avenue Paul Riquet 11170 Villesèquelande,11437_0068_00011,G,11 AVENUE PAUL RIQUET,
391383395,00020,39138339500020,O,2001-01-12,NN,,,2008-01-04T23:52:07,true,3,,11,,RUE,DU 11-NOVEMBRE,11170,VILLESEQUELANDE,,,11437,,,,,,,,,,,,,,,,,,,2008-01-01,A,,,,,64.20Z,NAFRev2,N,2.233347,43.239091,0.81,housenumber,11 Avenue du 11 Novembre 11170 Villesèquelande,11437_0063_00011,G,11 AVENUE DU 11 NOVEMBRE,
391456795,00015,39145679500015,O,1992-01-01,NN,,,2011-06-20T02:41:07,true,4,,,,,,11170,VILLESEQUELANDE,,,11437,,,,,,,,,,,,,,,,,,,2011-05-31,F,,,,,01.21Z,NAFRev2,N,,,0,,,,,,
392796165,00018,39279616500018,O,1993-10-19,NN,,,2018-12-20T04:07:41,true,3,ZONE ARTISANALE,8,,RUE,DE LA ZONE,11170,VILLESEQUELANDE,,,11437,,,,,,,,,,,,,,,,,,,2008-01-01,A,,,,,68.20B,NAFRev2,N,2.23335,43.234417,0.68,housenumber,8 Rue de la Fon du Vicaire 11170 Villesèquelande,11437_0017_00008,G,8 RUE DE LA FON DU VICAIRE,
394754618,00012,39475461800012,O,1981-01-01,NN,,,,true,1,,,,,,11170,VILLESEQUELANDE,,,11437,,,,,,,,,,,,,,,,,,,2000-09-30,F,,,,,01.1G,NAF1993,N,,,0,,,,,,
395063167,00013,39506316700013,O,1994-02-01,,,,,true,3,,,,,,11170,VILLESEQUELANDE,,,11437,,,,,,,,,,,,,,,,,,,2002-03-31,F,,,,,01.1G,NAF1993,N,,,0,,,,,,
395251499,00012,39525149900012,O,1981-01-01,NN,,,2008-01-04T18:23:42,true,3,L ETANG,,,RTE,D ARZENS,11170,VILLESEQUELANDE,,,11437,,,,,,,,,,,,,,,,,,,2008-01-01,A,,,,,01.11Z,NAFRev2,N,,,0,,,,,,
395253396,00018,39525339600018,O,,NN,,,,true,1,,,,CHE,DU RESERVOIR,11170,VILLESEQUELANDE,,,11437,,,,,,,,,,,,,,,,,,,1994-05-01,F,,,,,01.1G,NAF1993,N,2.226277,43.237699,0.37,street,Chemin du Château d’Eau 11170 Villesèquelande,11437_0006,G,CHEMIN DU CHATEAU D EAU,
398376780,00019,39837678000019,O,1994-05-01,NN,,,2011-04-28T01:01:28,false,4,,,,CHE,DU RESERVOIR,11170,VILLESEQUELANDE,,,11437,,,,,,,,,,,,,,,,,,,2001-06-30,F,,,,,01.1G,NAF1993,N,2.226277,43.237699,0.37,street,Chemin du Château d’Eau 11170 Villesèquelande,11437_0006,G,CHEMIN DU CHATEAU D EAU,
398376780,00027,39837678000027,O,2009-01-01,,,,2011-05-17T05:48:20,true,2,,8,,,CHEMIN DU CHATEAU,11170,VILLESEQUELANDE,,,11437,,,,,,,,,,,,,,,,,,,2011-05-06,F,,,,,01.21Z,NAFRev2,N,2.22742,43.237507,0.94,housenumber,8 Chemin du Château d’Eau 11170 Villesèquelande,11437_0006_00008,G,8 CHEMIN DU CHATEAU D EAU,
399569912,00013,39956991200013,O,1994-12-30,01,2020,,2022-08-29T09:20:45,true,3,,8,,,V ROMAINE,11170,VILLESEQUELANDE,,,11437,,,,,,,,,,,,,,,,,,,2008-01-01,A,,,,,01.21Z,NAFRev2,N,2.23386,43.239956,0.79,housenumber,8 Voie Romaine 11170 Villesèquelande,11437_gtgw33_00008,G,8 VOIE ROMAINE,
400610440,00010,40061044000010,O,1992-01-01,NN,,,2008-01-04T19:31:51,true,3,,6,,RUE,GEORGES BRASSENS,11170,VILLESEQUELANDE,,,11437,,,,,,,,,,,,,,,,,,,2008-01-01,A,,,,,01.21Z,NAFRev2,N,2.233881,43.23913,0.95,housenumber,6 Rue Georges Brassens 11170 Villesèquelande,11437_0029_00006,G,6 RUE GEORGES BRASSENS,
400892204,00019,40089220400019,O,1995-05-02,NN,,,2013-12-19T15:57:39,true,4,,,,RUE,DU 11 NOVEMBRE,11170,VILLESEQUELANDE,,,11437,,,,,,,,,,,,,,,,,,,2002-10-04,F,,,,,52.1B,NAF1993,O,2.233148,43.238425,0.85,street,Avenue du 11 Novembre 11170 Villesèquelande,11437_0063,G,AVENUE DU 11 NOVEMBRE,
401099791,00014,40109979100014,O,1995-05-02,NN,,,2020-01-24T13:22:39,false,4,,,,AV,11 NOVEMBRE,11170,VILLESEQUELANDE,,,11437,,,,,,,,,,,,,,,,,,,2002-10-04,F,,,,,74.1J,NAF1993,N,2.233347,43.239091,0.82,housenumber,11 Avenue du 11 Novembre 11170 Villesèquelande,11437_0063_00011,G,11 AVENUE DU 11 NOVEMBRE,
401879408,00011,40187940800011,O,1972-07-15,NN,,,2008-01-04T19:54:34,true,4,,,,LD,FABARY,11170,VILLESEQUELANDE,,,11437,,,,,,,,,,,,,,,,,,,2008-01-01,A,,,,,68.20B,NAFRev2,N,2.238694,43.219863,0.91,street,Au Domaine de Fabary 11170 Villesèquelande,11437_B013,G,AU DOMAINE DE FABARY,
403188048,00074,40318804800074,O,2017-04-28,,,7420ZQ,2022-11-23T15:20:41,false,2,DOMAINE LES CORNEILLES,8,,RUE,JEAN MOULIN,11170,VILLESEQUELANDE,,,11437,,,,,,,,,,,,,,,,,,,2022-03-31,F,LE DONJON DE MERLIN,,,LE DONJON DE MERLIN,74.20Z,NAFRev2,N,2.231552,43.238009,0.95,housenumber,8 Rue Jean Moulin 11170 Villesèquelande,11437_0039_00008,G,8 RUE JEAN MOULIN,
405014655,00022,40501465500022,O,1999-01-31,NN,,,2008-01-04T20:49:16,true,3,,,,,,11170,VILLESEQUELANDE,,,11437,,,,,,,,,,,,,,,,,,,2008-01-01,A,,,,,01.21Z,NAFRev2,N,,,0,,,,,,
405032582,00018,40503258200018,O,1975-01-01,NN,,,2011-05-03T00:25:51,false,6,,,,,LE MOULIN,11170,VILLESEQUELANDE,,,11437,,,,,,,,,,,,,,,,,,,2006-07-31,F,LE MOULIN,,,,01.1G,NAFRev1,N,2.231697,43.237881,0.65,street,Rue Jean Moulin 11170 Villesèquelande,11437_0039,G,RUE JEAN MOULIN,
405032582,00026,40503258200026,O,2009-11-01,,,,2021-02-23T11:29:19,true,1,,,,,LE MOULIN LE PONT DU CANAL,11170,VILLESEQUELANDE,,,11437,,,,,,,,,,,,,,,,,,,2009-11-01,A,,,,,01.21Z,NAFRev2,N,2.231697,43.237881,0.31,street,Rue Jean Moulin 11170 Villesèquelande,11437_0039,G,RUE JEAN MOULIN,
405032590,00011,40503259000011,O,1969-01-01,NN,,,2008-02-15T08:06:45,true,3,,,,,,11170,VILLESEQUELANDE,,,11437,,,,,,,,,,,,,,,,,,,2004-05-31,F,,,,,01.1G,NAFRev1,N,,,0,,,,,,
405032616,00014,40503261600014,O,1995-03-01,NN,,,2020-08-25T10:36:34,true,3,,11,,RUE,ST ROCH,11170,VILLESEQUELANDE,,,11437,,,,,,,,,,,,,,,,,,,2008-01-01,A,,,,,01.21Z,NAFRev2,N,2.230471,43.238478,0.82,housenumber,11 Rue de Saint Roch 11170 Villesèquelande,11437_0083_00011,G,11 RUE DE SAINT ROCH,
408294007,00013,40829400700013,O,1973-01-01,NN,,,2015-01-14T08:15:04,false,4,,,,,,11170,VILLESEQUELANDE,,,11437,,,,,,,,,,,,,,,,,,,2008-01-01,F,,,,,01.24Z,NAFRev2,N,,,0,,,,,,
408294007,00021,40829400700021,O,2005-01-01,,,,2021-02-23T11:30:27,true,1,,5,,,VOIE ROMAINE,11170,VILLESEQUELANDE,,,11437,,,,,,,,,,,,,,,,,,,2005-01-01,A,,,,,01.21Z,NAFRev2,N,2.233287,43.239993,0.95,housenumber,5 Voie Romaine 11170 Villesèquelande,11437_gtgw33_00005,G,5 VOIE ROMAINE,
408294015,00016,40829401500016,O,1993-03-01,NN,,,2008-01-04T21:08:06,true,3,,11,,,,11170,VILLESEQUELANDE,,,11437,,,,,,,,,,,,,,,,,,,2008-01-01,A,,,,,01.21Z,NAFRev2,N,,,0,,,,,,
410393003,00018,41039300300018,O,1996-12-01,NN,,,2020-10-31T04:05:03,true,4,,,,,DOMAINE DE FABARY,11170,VILLESEQUELANDE,,,11437,,,,,,,,,,,,,,,,,,,2020-08-31,F,,,,,01.21Z,NAFRev2,N,2.238694,43.219863,0.93,street,Au Domaine de Fabary 11170 Villesèquelande,11437_B013,G,AU DOMAINE DE FABARY,
410541395,00019,41054139500019,O,1996-09-01,02,2020,4312BA,2022-08-29T09:27:37,true,4,,11,,AV,DU 11 NOVEMBRE,11170,VILLESEQUELANDE,,,11437,,,,,,,,,,,,,,,,,,,2008-01-01,A,,,,,01.21Z,NAFRev2,O,2.233347,43.239091,0.85,housenumber,11 Avenue du 11 Novembre 11170 Villesèquelande,11437_0063_00011,G,11 AVENUE DU 11 NOVEMBRE,
411589443,00026,41158944300026,O,2004-03-31,NN,,,2009-06-27T08:30:16,true,4,VOIE ROMAINE,,,,ZA LA MOULINASSE,11170,VILLESEQUELANDE,,,11437,,,,,,,,,,,,,,,,,,,2007-11-20,F,,,,,45.3E,NAFRev1,O,2.233091,43.240038,0.51,street,Rue Voie Romaine 11170 Villesèquelande,11437_0080,D,RUE VOIE ROMAINE,
413865155,00019,41386515500019,O,1997-09-01,NN,,,2014-02-20T10:46:00,true,3,L'ETANG,,,RTE,D'ARZENS,11170,VILLESEQUELANDE,,,11437,,,,,,,,,,,,,,,,,,,2004-12-31,F,,,,,01.1A,NAFRev1,N,,,0,,,,,,
418151247,00024,41815124700024,O,2022-07-21,,,,2022-10-01T05:03:21,true,1,,12,,RUE,HENRI IV,11170,VILLESEQUELANDE,,,11437,,,,,,,,,,,,,,,,,,,2022-07-21,A,,,,,68.20B,NAFRev2,N,2.232969,43.238795,0.95,housenumber,12 Rue Henri IV 11170 Villesèquelande,11437_0032_00012,G,12 RUE HENRI IV,
418579470,00018,41857947000018,O,1998-03-06,NN,,,2008-01-04T23:23:12,true,3,,,,,,11170,VILLESEQUELANDE,,,11437,,,,,,,,,,,,,,,,,,,2008-01-01,A,,,,,01.21Z,NAFRev2,N,,,0,,,,,,
420038432,00043,42003843200043,O,2022-08-15,,,,2022-09-03T13:56:22,true,1,,3,,RUE,CHARLES GAUGET,11170,VILLESEQUELANDE,,,11437,,,,,,,,,,,,,,,,,,,2022-08-15,A,,,,,70.22Z,NAFRev2,N,2.229742,43.236526,0.95,housenumber,3 Rue Charles Gauget 11170 Villesèquelande,11437_0025_00003,G,3 RUE CHARLES GAUGET,
420548729,00045,42054872900045,O,2009-02-09,,,,2014-09-15T11:28:00,false,2,,17,,RUE,GEORGES BRASSENS,11170,VILLESEQUELANDE,,,11437,,,,,,,,,,,,,,,,,,,2014-09-01,F,DOMICIL' REPAS,,,,56.10C,NAFRev2,N,2.236451,43.238767,0.95,housenumber,17 Rue Georges Brassens 11170 Villesèquelande,11437_0029_00017,G,17 RUE GEORGES BRASSENS,