siren,nic,siret,statutDiffusionEtablissement,dateCreationEtablissement,trancheEffectifsEtablissement,anneeEffectifsEtablissement,activitePrincipaleRegistreMetiersEtablissement,dateDernierTraitementEtablissement,etablissementSiege,nombrePeriodesEtablissement,complementAdresseEtablissement,numeroVoieEtablissement,indiceRepetitionEtablissement,typeVoieEtablissement,libelleVoieEtablissement,codePostalEtablissement,libelleCommuneEtablissement,libelleCommuneEtrangerEtablissement,distributionSpecialeEtablissement,codeCommuneEtablissement,codeCedexEtablissement,libelleCedexEtablissement,codePaysEtrangerEtablissement,libellePaysEtrangerEtablissement,complementAdresse2Etablissement,numeroVoie2Etablissement,indiceRepetition2Etablissement,typeVoie2Etablissement,libelleVoie2Etablissement,codePostal2Etablissement,libelleCommune2Etablissement,libelleCommuneEtranger2Etablissement,distributionSpeciale2Etablissement,codeCommune2Etablissement,codeCedex2Etablissement,libelleCedex2Etablissement,codePaysEtranger2Etablissement,libellePaysEtranger2Etablissement,dateDebut,etatAdministratifEtablissement,enseigne1Etablissement,enseigne2Etablissement,enseigne3Etablissement,denominationUsuelleEtablissement,activitePrincipaleEtablissement,nomenclatureActivitePrincipaleEtablissement,caractereEmployeurEtablissement,longitude,latitude,geo_score,geo_type,geo_adresse,geo_id,geo_ligne,geo_l4,geo_l5
211201819,00011,21120181900011,O,1983-03-01,01,2020,,2022-08-29T09:05:57,true,4,,,,,,12220,PEYRUSSE-LE-ROC,,,12181,,,,,,,,,,,,,,,,,,,2008-01-01,A,MAIRIE,,,,84.11Z,NAFRev2,N,,,0,,,,,,
211201819,00029,21120181900029,O,2003-03-17,,,,2021-08-19T10:09:29,false,4,,,,,MAIRIE,12220,PEYRUSSE-LE-ROC,,,12181,,,,,,,,,,,,,,,,,,,2020-12-31,F,ASSAINISSEMENT,,,,37.00Z,NAFRev2,N,3.0709671,50.6304695,0.92,poi.townhall,Hôtel de Ville Lille,https://osm.org/way/40917078,G,,
251200630,00019,25120063000019,O,1983-03-01,NN,,,2019-11-14T14:00:18,true,5,,,,,MAIRIE,12220,PEYRUSSE-LE-ROC,,,12181,,,,,,,,,,,,,,,,,,,2010-07-20,F,,,,,84.13Z,NAFRev2,N,3.0709671,50.6304695,0.92,poi.townhall,Hôtel de Ville Lille,https://osm.org/way/40917078,G,,
261202857,00015,26120285700015,O,1984-10-15,NN,,,2019-11-14T14:00:18,true,4,,,,,MAIRIE,12220,PEYRUSSE-LE-ROC,,,12181,,,,,,,,,,,,,,,,,,,2016-01-01,F,CCAS,,,,88.99B,NAFRev2,N,3.0709671,50.6304695,0.92,poi.townhall,Hôtel de Ville Lille,https://osm.org/way/40917078,G,,
303379515,00016,30337951500016,O,1975-01-01,NN,,,2019-11-14T14:00:18,true,1,,,,,LAUBAREDE,12220,PEYRUSSE-LE-ROC,,,12181,,,,,,,,,,,,,,,,,,,2000-09-01,F,,,,,55.2C,NAF1993,N,2.138696,44.496748,0.37,street,Rue de la Barbacane 12220 Peyrusse-le-Roc,12181_0004,G,RUE DE LA BARBACANE,
304749823,00031,30474982300031,O,2005-01-01,,,,2019-11-14T14:00:18,true,5,,,,,LA RIVIERE,12220,PEYRUSSE-LE-ROC,,,12181,,,,,,,,,,,,,,,,,,,2014-11-19,F,,,,,74.90B,NAFRev2,N,-1.3426023,47.5887548,0.89,poi.river,(Rivière) Moisdon-la-Rivière,https://osm.org/way/222281002,G,,
308496728,00012,30849672800012,O,1900-01-01,NN,,,2019-11-14T14:00:18,true,3,,,,,MAIRIE,12220,PEYRUSSE-LE-ROC,,,12181,,,,,,,,,,,,,,,,,,,2008-01-01,A,,,,,93.12Z,NAFRev2,N,3.0709671,50.6304695,0.92,poi.townhall,Hôtel de Ville Lille,https://osm.org/way/40917078,G,,
312057391,00012,31205739100012,O,1978-01-01,NN,,,2019-11-14T14:00:18,true,3,,,,LD,LESTANQUIE,12220,PEYRUSSE-LE-ROC,,,12181,,,,,,,,,,,,,,,,,,,2008-01-01,A,,,,,01.41Z,NAFRev2,N,2.13161,44.525274,0.73,poi.stream,Ruisseau de L'Estanquie Sonnac,https://osm.org/way/182693289,G,,
317057115,00014,31705711500014,O,,,,,2019-11-14T14:00:18,true,1,,,,,,12220,PEYRUSSE-LE-ROC,,,12181,,,,,,,,,,,,,,,,,,,1995-06-17,F,,,,,70.2C,NAF1993,N,,,0,,,,,,
317057123,00018,31705712300018,O,,,,,2019-11-14T14:00:18,true,1,,,,,,12220,PEYRUSSE-LE-ROC,,,12181,,,,,,,,,,,,,,,,,,,1995-06-17,F,,,,,55.4B,NAF1993,N,,,0,,,,,,
321271033,00037,32127103300037,O,2004-01-01,NN,,,2019-11-14T14:00:18,true,3,LA MOLIERE,,,,,12220,PEYRUSSE-LE-ROC,,,12181,,,,,,,,,,,,,,,,,,,2005-12-31,F,,,,,01.1A,NAFRev1,N,2.152583,44.50709,0.42,locality,Puech Molinier 12220 Peyrusse-le-Roc,12181_B298,D,PUECH MOLINIER,
322816141,00038,32281614100038,O,2018-11-19,,,,2019-11-14T14:00:18,true,1,,,,,LE MAS DE GALTIER,12220,PEYRUSSE-LE-ROC,,,12181,,,,,,,,,,,,,,,,,,,2018-11-19,A,,,,,45.20A,NAFRev2,N,2.138112,44.481077,0.85,locality,Mas de Galtier 12220 Peyrusse-le-Roc,12181_B221,G,MAS DE GALTIER,
328552625,00019,32855262500019,O,,NN,,,2019-11-14T14:00:18,true,1,,,,,TOUZOU,12220,PEYRUSSE-LE-ROC,,,12181,,,,,,,,,,,,,,,,,,,1993-06-30,F,,,,,45.2V,NAF1993,N,1.5236076,43.5132584,0.74,poi.restaurant,Le Bouzou (Restaurant) Castanet-Tolosan,https://osm.org/node/1098259410,G,,
329257554,00017,32925755400017,O,,NN,,,2019-11-14T14:00:18,true,1,,,,,,12220,PEYRUSSE-LE-ROC,,,12181,,,,,,,,,,,,,,,,,,,,F,,,,,48.07,NAP,N,,,0,,,,,,
329461636,00014,32946163600014,O,1984-03-06,NN,,,2019-11-14T14:00:18,true,3,,,,,,12220,PEYRUSSE-LE-ROC,,,12181,,,,,,,,,,,,,,,,,,,2008-01-01,A,,,,,01.61Z,NAFRev2,N,,,0,,,,,,
340284546,00017,34028454600017,O,,,,,2019-11-14T14:00:18,true,1,,,,,,12220,PEYRUSSE-LE-ROC,,,12181,,,,,,,,,,,,,,,,,,,1989-12-31,F,,,,,62.11,NAP,N,,,0,,,,,,
341042307,00031,34104230700031,O,1994-01-01,NN,,,2019-11-14T14:00:18,false,3,,,,,JONCASSE,12220,PEYRUSSE-LE-ROC,,,12181,,,,,,,,,,,,,,,,,,,2005-06-12,F,,,,,52.6E,NAFRev1,N,1.543778,43.4880888,0.88,poi.3,Aqueduc de la Joncasse (Patrimoine national) Deyme,https://osm.org/way/202265999,G,,
342153798,00018,34215379800018,O,1987-05-01,NN,,,2019-11-14T14:00:18,true,3,,,,,GAILHAGUET,12220,PEYRUSSE-LE-ROC,,,12181,,,,,,,,,,,,,,,,,,,2008-01-01,A,,,,,01.41Z,NAFRev2,N,,,0,,,,,,
342155587,00013,34215558700013,O,1987-05-01,NN,,,2019-11-14T14:00:18,true,3,,,,,LA CONQUIE,12220,PEYRUSSE-LE-ROC,,,12181,,,,,,,,,,,,,,,,,,,2008-01-01,A,,,,,01.41Z,NAFRev2,N,2.126275,44.487416,0.34,locality,La Capelle Sainte Croix 12220 Peyrusse-le-Roc,12181_B062,G,LA CAPELLE SAINTE CROIX,
344177498,00021,34417749800021,O,1992-01-01,NN,,,2019-11-14T14:00:18,true,6,,,,,,12220,PEYRUSSE-LE-ROC,,,12181,,,,,,,,,,,,,,,,,,,2008-01-01,A,,,,,01.42Z,NAFRev2,N,,,0,,,,,,
344177498,00039,34417749800039,O,2010-02-10,,,,2019-11-14T14:00:18,false,2,,,,,LES JUSTICES - LE BOURG,12220,PEYRUSSE-LE-ROC,,,12181,,,,,,,,,,,,,,,,,,,2012-06-30,F,,,,,68.31Z,NAFRev2,N,,,0,,,,,,
353447014,00013,35344701400013,O,1990-01-02,NN,,,2021-10-27T08:04:08,true,9,,,,,,12220,PEYRUSSE-LE-ROC,,,12181,,,,,,,,,,,,,,,,,,,2021-10-26,F,,,,,56.10A,NAFRev2,O,,,0,,,,,,
379214182,00022,37921418200022,O,1993-07-01,NN,,,2019-11-14T14:00:18,true,3,,,,,LA RIVIERE,12220,PEYRUSSE-LE-ROC,,,12181,,,,,,,,,,,,,,,,,,,2008-01-01,A,,,,,68.20A,NAFRev2,N,-1.3426023,47.5887548,0.89,poi.river,(Rivière) Moisdon-la-Rivière,https://osm.org/way/222281002,G,,
380063370,00015,38006337000015,O,1990-10-24,NN,,,2019-11-14T14:00:18,true,3,,,,,DOMAINE DE GAILLAGUET,12220,PEYRUSSE-LE-ROC,,,12181,,,,,,,,,,,,,,,,,,,2008-01-01,A,,,,,68.20B,NAFRev2,N,,,0,,,,,,
380414037,00107,38041403700107,O,2013-01-01,,,,2019-11-14T14:00:18,false,2,,2,,RUE,VALERIE,12220,PEYRUSSE-LE-ROC,,,12181,,,,,,,,,,,,,,,,,,,2013-09-01,F,,,,,85.59A,NAFRev2,N,2.140513,44.497001,0.93,housenumber,2 Rue de Valerie 12220 Peyrusse-le-Roc,12181_0055_00002,G,2 RUE DE VALERIE,
382413755,00010,38241375500010,O,1991-01-01,00,2020,,2022-08-29T09:09:31,true,3,,,,,LA LOUBATIE,12220,PEYRUSSE-LE-ROC,,,12181,,,,,,,,,,,,,,,,,,,2008-01-01,A,,,,,01.42Z,NAFRev2,N,,,0,,,,,,
382724748,00035,38272474800035,O,2013-10-17,,,,2021-09-09T11:31:50,true,2,,2,,PL,ST-GEORGES,12220,PEYRUSSE-LE-ROC,,,12181,,,,,,,,,,,,,,,,,,,2020-11-01,F,M.R.C.,,,M.R.C.,33.12Z,NAFRev2,N,2.140911,44.496302,0.33,housenumber,2 Place des 13 Vents 12220 Peyrusse-le-Roc,12181_0050_00002,G,2 PLACE DES 13 VENTS,
383424918,00027,38342491800027,O,1992-12-26,NN,,,2019-11-14T14:00:18,true,3,,,,LD,LA PELEILLIE,12220,PEYRUSSE-LE-ROC,,,12181,,,,,,,,,,,,,,,,,,,2008-01-01,A,,,,,68.20A,NAFRev2,N,2.126275,44.487416,0.37,locality,La Capelle Sainte Croix 12220 Peyrusse-le-Roc,12181_B062,G,LA CAPELLE SAINTE CROIX,
383907557,00011,38390755700011,O,1991-07-01,NN,,,2019-11-14T14:00:18,true,3,,,,,LA GARENNE,12220,PEYRUSSE-LE-ROC,,,12181,,,,,,,,,,,,,,,,,,,2003-08-31,F,,,,,01.2A,NAFRev1,N,2.8927434,43.2852275,0.9,poi.park,La Garenne (Parc) Mirepeisset,https://osm.org/way/236460923,G,,
390130482,00016,39013048200016,O,1993-01-01,NN,,,2019-11-14T14:00:18,true,4,,,,LD,LA PELLELIE,12220,PEYRUSSE-LE-ROC,,,12181,,,,,,,,,,,,,,,,,,,2017-03-20,A,,,,,68.20B,NAFRev2,N,2.126275,44.487416,0.54,locality,La Capelle Sainte Croix 12220 Peyrusse-le-Roc,12181_B062,G,LA CAPELLE SAINTE CROIX,
390385532,00010,39038553200010,O,1993-02-01,NN,,,2019-11-14T14:00:18,false,3,,,,,LA CARCINIE,12220,PEYRUSSE-LE-ROC,,,12181,,,,,,,,,,,,,,,,,,,2006-11-30,F,,,,,01.2A,NAFRev1,N,2.126275,44.487416,0.4,locality,La Capelle Sainte Croix 12220 Peyrusse-le-Roc,12181_B062,G,LA CAPELLE SAINTE CROIX,
391648615,00014,39164861500014,O,1993-06-01,NN,,,2019-11-14T14:00:18,true,3,,,,,,12220,PEYRUSSE-LE-ROC,,,12181,,,,,,,,,,,,,,,,,,,2008-01-01,A,,,,,56.30Z,NAFRev2,N,,,0,,,,,,
391648615,00022,39164861500022,O,1989-01-23,NN,,,2019-11-14T14:00:18,false,3,,,,,,12220,PEYRUSSE-LE-ROC,,,12181,,,,,,,,,,,,,,,,,,,2008-01-01,A,,,,,01.42Z,NAFRev2,N,,,0,,,,,,
393109343,00037,39310934300037,O,1996-03-01,NN,,,2019-11-14T14:00:18,false,4,,,,,BARSALES,12220,PEYRUSSE-LE-ROC,,,12181,,,,,,,,,,,,,,,,,,,1998-07-01,F,,,,,85.1G,NAF1993,N,2.138696,44.496748,0.31,street,Rue de la Barbacane 12220 Peyrusse-le-Roc,12181_0004,G,RUE DE LA BARBACANE,
393355540,00013,39335554000013,O,1993-12-01,NN,,,2019-11-14T14:00:18,true,3,,,,,ROUGEYROL,12220,PEYRUSSE-LE-ROC,,,12181,,,,,,,,,,,,,,,,,,,2004-09-30,F,,,,,01.2A,NAFRev1,N,3.0860215,45.8495018,0.7,poi.bus_stop,Rougeyron (Arrêt de bus) Châteaugay,https://osm.org/node/1786352078,G,,
394388953,00017,39438895300017,O,1993-01-01,NN,,,2019-11-14T14:00:18,true,4,,,,,LA BROUSSE,12220,PEYRUSSE-LE-ROC,,,12181,,,,,,,,,,,,,,,,,,,2012-12-31,F,,,,,01.42Z,NAFRev2,N,-0.3862875,45.8955633,0.9,poi,(Pont) La Brousse,https://osm.org/way/367979741,G,,
395023823,00010,39502382300010,O,1994-04-01,NN,,,2019-11-14T14:00:18,true,3,,,,,LE CROS,12220,PEYRUSSE-LE-ROC,,,12181,,,,,,,,,,,,,,,,,,,2008-01-01,A,,,,,68.20B,NAFRev2,N,3.3790291,43.9110997,0.89,poi,(Pont) Le Cros,https://osm.org/way/171953215,G,,
395367709,00015,39536770900015,O,1994-04-01,NN,,,2021-02-23T11:21:08,true,3,,,,,LE CROS,12220,PEYRUSSE-LE-ROC,,,12181,,,,,,,,,,,,,,,,,,,2008-01-01,A,,,,,01.41Z,NAFRev2,N,3.3790291,43.9110997,0.89,poi,(Pont) Le Cros,https://osm.org/way/171953215,G,,
398201707,00013,39820170700013,O,1994-06-30,NN,,,2019-11-14T14:00:18,true,3,,,,,LA CABANONIE,12220,PEYRUSSE-LE-ROC,,,12181,,,,,,,,,,,,,,,,,,,2008-01-01,A,,,,,68.20A,NAFRev2,N,2.126275,44.487416,0.37,locality,La Capelle Sainte Croix 12220 Peyrusse-le-Roc,12181_B062,G,LA CAPELLE SAINTE CROIX,
398202226,00013,39820222600013,O,1994-07-13,NN,,,2022-10-15T03:51:50,true,4,,,,,,12220,PEYRUSSE-LE-ROC,,,12181,,,,,,,,,,,,,,,,,,,2022-06-10,F,,,,,68.20A,NAFRev2,N,,,0,,,,,,
398628073,00015,39862807300015,O,1994-08-31,NN,,,2019-11-14T14:00:18,true,4,,,,,LES HORTES,12220,PEYRUSSE-LE-ROC,,,12181,,,,,,,,,,,,,,,,,,,2002-12-31,F,,,,,01.2A,NAF1993,N,2.140697,44.49305,0.94,street,Les Hortes 12220 Peyrusse-le-Roc,12181_41ihe1,G,LES HORTES,
399877851,00028,39987785100028,O,1994-03-21,NN,,,2019-11-14T14:00:18,false,4,,,,,ECOLE BASSE,12220,PEYRUSSE-LE-ROC,,,12181,,,,,,,,,,,,,,,,,,,2008-01-01,A,,,,,91.03Z,NAFRev2,N,6.2010798,49.4835091,0.89,poi.school,(École) Basse-Rentgen,https://osm.org/node/2481078293,G,,
401446950,00016,40144695000016,O,1995-05-01,NN,,,2019-11-14T14:00:18,true,3,,,,,GAILLAGUET,12220,PEYRUSSE-LE-ROC,,,12181,,,,,,,,,,,,,,,,,,,2008-01-01,A,,,,,68.20B,NAFRev2,N,1.6726966,43.654832,0.89,poi.track,Chemin de Gaillaguet Verfeil,https://osm.org/way/35304442,G,,
401447115,00015,40144711500015,O,1995-05-01,NN,,,2019-11-14T14:00:18,true,3,,,,,GAILLAGUET,12220,PEYRUSSE-LE-ROC,,,12181,,,,,,,,,,,,,,,,,,,2008-01-01,A,,,,,68.20B,NAFRev2,N,1.6726966,43.654832,0.89,poi.track,Chemin de Gaillaguet Verfeil,https://osm.org/way/35304442,G,,
401984513,00010,40198451300010,O,1995-08-02,NN,,,2019-11-14T14:00:18,true,3,,,,,LA MOLIERE,12220,PEYRUSSE-LE-ROC,,,12181,,,,,,,,,,,,,,,,,,,2008-01-01,A,,,,,01.62Z,NAFRev2,N,3.9983886,44.0191397,0.89,poi.track,Chemin de la Molière Tornac,https://osm.org/way/53579796,G,,
403976806,00014,40397680600014,O,1961-01-01,NN,,,2019-11-14T14:00:18,true,1,,,,,COMBE BARBE PEYRUS,12220,PEYRUSSE-LE-ROC,,,12181,,,,,,,,,,,,,,,,,,,1999-03-31,F,,,,,01.3Z,NAF1993,N,2.128055,44.493712,0.87,locality,Combe de Barbe 12220 Peyrusse-le-Roc,12181_B110,G,COMBE DE BARBE,
403976814,00018,40397681400018,O,1971-01-01,NN,,,2019-11-14T14:00:18,true,3,,,,,MAS D AMBLARD,12220,PEYRUSSE-LE-ROC,,,12181,,,,,,,,,,,,,,,,,,,2008-01-01,A,,,,,01.42Z,NAFRev2,N,2.136528,44.506685,0.93,locality,Mas d’Amblard 12220 Peyrusse-le-Roc,12181_B220,G,MAS D AMBLARD,
403976822,00011,40397682200011,O,1979-06-01,NN,,,2021-02-23T11:28:16,true,3,,,,,THERON DE PEYRUSSE,12220,PEYRUSSE-LE-ROC,,,12181,,,,,,,,,,,,,,,,,,,2008-01-01,A,,,,,01.42Z,NAFRev2,N,2.140164,44.496196,0.59,street,Rue de Petrucia 12220 Peyrusse-le-Roc,12181_0040,G,RUE DE PETRUCIA,
403976830,00014,40397683000014,O,1969-07-01,NN,,,2019-11-14T14:00:18,false,4,,,,,SALESSE DE PEYRUSSE,12220,PEYRUSSE-LE-ROC,,,12181,,,,,,,,,,,,,,,,,,,2002-06-30,F,,,,,01.3Z,NAF1993,N,2.140506,44.496911,0.71,street,Rue de Valerie 12220 Peyrusse-le-Roc,12181_0055,G,RUE DE VALERIE,
403976830,00022,40397683000022,O,2017-08-01,,,,2021-07-09T15:35:04,true,2,,,,,LA SALESSE,12220,PEYRUSSE-LE-ROC,,,12181,,,,,,,,,,,,,,,,,,,2020-04-07,F,,,,,35.11Z,NAFRev2,N,2.126275,44.487416,0.5,locality,La Capelle Sainte Croix 12220 Peyrusse-le-Roc,12181_B062,G,LA CAPELLE SAINTE CROIX,
403976848,00016,40397684800016,O,1973-01-01,NN,,,2019-11-14T14:00:18,true,4,,,,,CONQUIE DE PEYRUSSE,12220,PEYRUSSE-LE-ROC,,,12181,,,,,,,,,,,,,,,,,,,2011-04-30,F,,,,,01.46Z,NAFRev2,N,2.128055,44.493712,0.65,locality,Combe de Barbe 12220 Peyrusse-le-Roc,12181_B110,G,COMBE DE BARBE,
403976855,00011,40397685500011,O,1981-03-01,NN,,,2019-11-14T14:00:18,true,1,,,,,PUECH MOLINIE,12220,PEYRUSSE-LE-ROC,,,12181,,,,,,,,,,,,,,,,,,,1999-03-31,F,,,,,01.3Z,NAF1993,N,2.152583,44.50709,0.87,locality,Puech Molinier 12220 Peyrusse-le-Roc,12181_B298,G,PUECH MOLINIER,
403976863,00015,40397686300015,O,1981-12-01,NN,,,2021-02-23T11:28:16,true,4,,,,,LA RENGADE,12220,PEYRUSSE-LE-ROC,,,12181,,,,,,,,,,,,,,,,,,,2019-12-31,A,,,,,68.20B,NAFRev2,N,2.140554,44.496135,0.35,street,Rue de la Porte du Chateau 12220 Peyrusse-le-Roc,12181_0042,G,RUE DE LA PORTE DU CHATEAU,
403976871,00018,40397687100018,O,1978-06-01,NN,,,2019-11-14T14:00:18,true,4,,,,,CABANONIE PEYRUSSE,12220,PEYRUSSE-LE-ROC,,,12181,,,,,,,,,,,,,,,,,,,2017-12-31,F,,,,,01.42Z,NAFRev2,N,2.140506,44.496911,0.55,street,Rue de Valerie 12220 Peyrusse-le-Roc,12181_0055,G,RUE DE VALERIE,
403976889,00010,40397688900010,O,1982-08-01,NN,,,2021-02-23T11:28:16,true,4,,,,,MAS DE PUECH,12220,PEYRUSSE-LE-ROC,,,12181,,,,,,,,,,,,,,,,,,,2013-01-01,A,,,,,01.42Z,NAFRev2,N,2.142694,44.485211,0.93,locality,Mas de Puech 12220 Peyrusse-le-Roc,12181_B222,G,MAS DE PUECH,
403976897,00013,40397689700013,O,1985-01-01,NN,,,2019-11-14T14:00:18,true,4,,,,,ARTIGUES,12220,PEYRUSSE-LE-ROC,,,12181,,,,,,,,,,,,,,,,,,,2018-12-31,F,,,,,01.43Z,NAFRev2,N,2.074824,42.7161967,0.89,poi,(Pont) Artigues,https://osm.org/way/418960020,G,,
403976905,00014,40397690500014,O,1989-04-01,NN,,,2019-11-14T14:00:18,true,4,LA CABANONIE,,,,,12220,PEYRUSSE-LE-ROC,,,12181,,,,,,,,,,,,,,,,,,,2016-02-01,A,,,,,68.20B,NAFRev2,N,2.126275,44.487416,0.37,locality,La Capelle Sainte Croix 12220 Peyrusse-le-Roc,12181_B062,D,LA CAPELLE SAINTE CROIX,
403976913,00018,40397691300018,O,1992-03-01,NN,,,2019-11-14T14:00:18,true,1,,,,,LOUBATIE,12220,PEYRUSSE-LE-ROC,,,12181,,,,,,,,,,,,,,,,,,,2001-07-31,F,,,,,01.3Z,NAF1993,N,,,0,,,,,,
403976921,00011,40397692100011,O,1985-02-01,NN,,,2019-11-14T14:00:18,true,4,,,,,PELEILLIE,12220,PEYRUSSE-LE-ROC,,,12181,,,,,,,,,,,,,,,,,,,1998-12-31,F,,,,,01.3Z,NAF1993,N,,,0,,,,,,
404863391,00045,40486339100045,O,1999-05-15,NN,,,2019-11-14T14:00:18,true,4,,,,,LE VIGNE HAUT,12220,PEYRUSSE-LE-ROC,,,12181,,,,,,,,,,,,,,,,,,,2004-06-30,F,,,,,92.3A,NAFRev1,N,2.125178,44.486299,0.83,locality,Vigne Haut 12220 Peyrusse-le-Roc,12181_B342,G,VIGNE HAUT,
407972165,00010,40797216500010,O,1977-12-23,NN,,,2019-11-14T14:00:18,true,4,,,,,MAS GALTIER PEYRUS,12220,PEYRUSSE-LE-ROC,,,12181,,,,,,,,,,,,,,,,,,,2003-10-31,F,,,,,01.3Z,NAFRev1,N,2.138112,44.481077,0.83,locality,Mas de Galtier 12220 Peyrusse-le-Roc,12181_B221,G,MAS DE GALTIER,
407972173,00014,40797217300014,O,1990-01-01,NN,,,2021-02-23T11:30:09,true,3,,,,,BORIE MILHENQUE,12220,PEYRUSSE-LE-ROC,,,12181,,,,,,,,,,,,,,,,,,,2008-01-01,A,,,,,01.43Z,NAFRev2,N,2.143124,44.490394,0.93,locality,Borie Milhenque 12220 Peyrusse-le-Roc,12181_B033,G,BORIE MILHENQUE,
407972181,00017,40797218100017,O,1982-12-25,NN,,,2019-11-14T14:00:18,true,3,,,,,LE BOURG,12220,PEYRUSSE-LE-ROC,,,12181,,,,,,,,,,,,,,,,,,,2008-01-01,A,,,,,01.61Z,NAFRev2,N,2.141303,44.49578,0.41,street,Rue du Four a Pain 12220 Peyrusse-le-Roc,12181_0023,G,RUE DU FOUR A PAIN,
407972199,00019,40797219900019,O,1969-01-01,NN,,,2019-11-14T14:00:18,true,3,,,,,,12220,PEYRUSSE-LE-ROC,,,12181,,,,,,,,,,,,,,,,,,,2007-10-31,F,,,,,01.1A,NAFRev1,N,,,0,,,,,,
407972207,00010,40797220700010,O,1993-01-01,NN,,,2019-11-14T14:00:18,true,4,LA PELLELIE,,,,,12220,PEYRUSSE-LE-ROC,,,12181,,,,,,,,,,,,,,,,,,,2009-12-31,F,,,,,01.41Z,NAFRev2,N,2.126275,44.487416,0.54,locality,La Capelle Sainte Croix 12220 Peyrusse-le-Roc,12181_B062,D,LA CAPELLE SAINTE CROIX,
407972215,00013,40797221500013,O,1994-10-13,NN,,,2021-10-27T08:31:43,true,3,TOUZOU,,,,,12220,PEYRUSSE-LE-ROC,,,12181,,,,,,,,,,,,,,,,,,,2008-01-01,A,,,,,01.42Z,NAFRev2,N,,,0,,,,,,
407972215,00021,40797221500021,O,2013-07-15,01,2020,4399CZ,2022-08-29T09:25:41,false,2,,,,,TOUZOU,12220,PEYRUSSE-LE-ROC,,,12181,,,,,,,,,,,,,,,,,,,2014-09-01,A,,,,,43.99C,NAFRev2,O,1.5236076,43.5132584,0.74,poi.restaurant,Le Bouzou (Restaurant) Castanet-Tolosan,https://osm.org/node/1098259410,G,,
407972223,00017,40797222300017,O,1995-09-01,NN,,,2022-03-19T04:09:14,true,4,MAS DE GALTIER,,,,,12220,PEYRUSSE-LE-ROC,,,12181,,,,,,,,,,,,,,,,,,,2020-01-16,F,,,,,01.42Z,NAFRev2,N,2.138112,44.481077,0.93,locality,Mas de Galtier 12220 Peyrusse-le-Roc,12181_B221,D,MAS DE GALTIER,
419330022,00015,41933002200015,O,1998-07-06,01,2020,4332AA,2022-08-29T09:33:05,true,4,,,,,,12220,PEYRUSSE-LE-ROC,,,12181,,,,,,,,,,,,,,,,,,,2014-11-06,A,,,,,43.32A,NAFRev2,O,,,0,,,,,,
419405204,00019,41940520400019,O,1998-07-01,NN,,,2019-11-14T14:00:18,true,8,,,,LD,LA CABANONIE,12220,PEYRUSSE-LE-ROC,,,12181,,,,,,,,,,,,,,,,,,,2010-08-31,F,,,,,56.30Z,NAFRev2,N,2.126275,44.487416,0.37,locality,La Capelle Sainte Croix 12220 Peyrusse-le-Roc,12181_B062,G,LA CAPELLE SAINTE CROIX,
420402315,00014,42040231500014,O,1998-04-01,NN,,,2019-11-14T14:00:18,true,3,,,,,LA PELLELIE,12220,PEYRUSSE-LE-ROC,,,12181,,,,,,,,,,,,,,,,,,,2008-01-01,A,,,,,68.20B,NAFRev2,N,2.126275,44.487416,0.54,locality,La Capelle Sainte Croix 12220 Peyrusse-le-Roc,12181_B062,G,LA CAPELLE SAINTE CROIX,
422349746,00020,42234974600020,O,2015-08-01,,,,2019-11-14T14:00:18,true,2,,6,,RUE,VALERIE,12220,PEYRUSSE-LE-ROC,,,12181,,,,,,,,,,,,,,,,,,,2017-11-02,F,,,,,68.20B,NAFRev2,N,2.140142,44.497157,0.93,housenumber,6 Rue de Valerie 12220 Peyrusse-le-Roc,12181_0055_00006,G,6 RUE DE VALERIE,
423409671,00017,42340967100017,O,1999-06-17,NN,,,2019-11-14T14:00:18,true,5,,,,,PUECH MOLINIE,12220,PEYRUSSE-LE-ROC,,,12181,,,,,,,,,,,,,,,,,,,2017-07-31,F,,,,,01.42Z,NAFRev2,N,2.152583,44.50709,0.87,locality,Puech Molinier 12220 Peyrusse-le-Roc,12181_B298,G,PUECH MOLINIER,
425219375,00010,42521937500010,O,1991-01-01,NN,,,2019-11-14T14:00:18,true,3,,,,,,12220,PEYRUSSE-LE-ROC,,,12181,,,,,,,,,,,,,,,,,,,2008-01-01,A,,,,,68.20B,NAFRev2,N,,,0,,,,,,
426070975,00013,42607097500013,O,,,,,2019-11-14T14:00:18,true,1,,,,,MARCOULOU,12220,PEYRUSSE-LE-ROC,,,12181,,,,,,,,,,,,,,,,,,,1997-09-10,F,,,,,01.3Z,NAF1993,N,,,0,,,,,,
426071437,00013,42607143700013,O,,NN,,,2019-11-14T14:00:18,true,1,,,,,,12220,PEYRUSSE-LE-ROC,,,12181,,,,,,,,,,,,,,,,,,,1987-01-13,F,,,,,67.07,NAP,N,,,0,,,,,,
426671574,00017,42667157400017,O,,,,,2019-11-14T14:00:18,true,1,,,,,,12220,PEYRUSSE-LE-ROC,,,12181,,,,,,,,,,,,,,,,,,,1984-12-25,F,,,,,64.11,NAP,N,,,0,,,,,,
426970240,00013,42697024000013,O,,NN,,,2019-11-14T14:00:18,true,1,,,,,,12220,PEYRUSSE-LE-ROC,,,12181,,,,,,,,,,,,,,,,,,,1989-10-15,F,,,,,55.71,NAP,N,,,0,,,,,,
426971784,00019,42697178400019,O,,,,,2019-11-14T14:00:18,true,1,,,,,,12220,PEYRUSSE-LE-ROC,,,12181,,,,,,,,,,,,,,,,,,,1984-12-25,F,,,,,62.46,NAP,N,,,0,,,,,,
427070537,00019,42707053700019,O,,NN,,,2019-11-14T14:00:18,true,1,,,,,,12220,PEYRUSSE-LE-ROC,,,12181,,,,,,,,,,,,,,,,,,,1993-05-31,F,,,,,55.1A,NAF1993,N,,,0,,,,,,
427071899,00012,42707189900012,O,,NN,,,2019-11-14T14:00:18,true,1,,,,,,12220,PEYRUSSE-LE-ROC,,,12181,,,,,,,,,,,,,,,,,,,,F,,,,,01.80,NAP,N,,,0,,,,,,
429467178,00019,42946717800019,O,2000-01-01,NN,,,2019-11-14T14:00:18,true,4,,,,,MAIRIE,12220,PEYRUSSE-LE-ROC,,,12181,,,,,,,,,,,,,,,,,,,2008-01-01,A,,,,,94.99Z,NAFRev2,O,3.0709671,50.6304695,0.92,poi.townhall,Hôtel de Ville Lille,https://osm.org/way/40917078,G,,
430501049,00018,43050104900018,O,1989-07-01,NN,,,2019-11-14T14:00:18,true,4,,,,,LA GARENNE,12220,PEYRUSSE-LE-ROC,,,12181,,,,,,,,,,,,,,,,,,,2008-01-01,A,,,,,01.42Z,NAFRev2,N,2.8927434,43.2852275,0.9,poi.park,La Garenne (Parc) Mirepeisset,https://osm.org/way/236460923,G,,
430501197,00015,43050119700015,O,1971-01-01,NN,,,2019-11-14T14:00:18,true,3,,,,,LE MAS D AMBLARD,12220,PEYRUSSE-LE-ROC,,,12181,,,,,,,,,,,,,,,,,,,2008-01-01,A,,,,,01.11Z,NAFRev2,N,2.136528,44.506685,0.84,locality,Mas d’Amblard 12220 Peyrusse-le-Roc,12181_B220,G,MAS D AMBLARD,
439457441,00012,43945744100012,O,1995-07-16,NN,,,2019-11-14T14:00:18,true,3,,,,,COEUR DU VILLAGE,12220,PEYRUSSE-LE-ROC,,,12181,,,,,,,,,,,,,,,,,,,2008-01-01,A,,,,,94.99Z,NAFRev2,N,6.42266,45.9049245,0.9,poi.hotel,Au Coeur du Village (Hôtel) La Clusaz,https://osm.org/way/163821841,G,,
441852357,00017,44185235700017,O,2002-05-01,NN,,,2019-11-14T14:00:18,false,4,CHEZ DOMINIQUE DUCROCQ,,,,LE BOURG,12220,PEYRUSSE-LE-ROC,,,12181,,,,,,,,,,,,,,,,,,,2003-02-01,F,,,,,92.3A,NAFRev1,N,2.141303,44.49578,0.41,street,Rue du Four a Pain 12220 Peyrusse-le-Roc,12181_0023,G,RUE DU FOUR A PAIN,
443655790,00014,44365579000014,O,2002-07-01,NN,,,2021-09-28T09:35:51,true,6,,,,,LA SALESSE,12220,PEYRUSSE-LE-ROC,,,12181,,,,,,,,,,,,,,,,,,,2020-04-08,A,,,,,35.11Z,NAFRev2,N,2.126275,44.487416,0.5,locality,La Capelle Sainte Croix 12220 Peyrusse-le-Roc,12181_B062,G,LA CAPELLE SAINTE CROIX,
443907472,00015,44390747200015,O,1967-09-20,NN,,,2019-11-14T14:00:18,true,3,,,,,LACAZE,12220,PEYRUSSE-LE-ROC,,,12181,,,,,,,,,,,,,,,,,,,2008-01-01,A,,,,,02.10Z,NAFRev2,N,2.138696,44.496748,0.38,street,Rue de la Barbacane 12220 Peyrusse-le-Roc,12181_0004,G,RUE DE LA BARBACANE,
444926208,00018,44492620800018,O,2003-01-01,NN,,,2019-11-14T14:00:18,true,4,,,,,LES HORTES,12220,PEYRUSSE-LE-ROC,,,12181,,,,,,,,,,,,,,,,,,,2013-01-31,F,,,,,01.42Z,NAFRev2,N,2.140697,44.49305,0.94,street,Les Hortes 12220 Peyrusse-le-Roc,12181_41ihe1,G,LES HORTES,
447993320,00012,44799332000012,O,2002-10-26,NN,,,2019-11-14T14:00:18,true,3,LE VIGNE HAUT,,,,,12220,PEYRUSSE-LE-ROC,,,12181,,,,,,,,,,,,,,,,,,,2008-01-01,A,,,,,01.11Z,NAFRev2,N,2.125178,44.486299,0.83,locality,Vigne Haut 12220 Peyrusse-le-Roc,12181_B342,D,VIGNE HAUT,
448183996,00017,44818399600017,O,2003-03-29,NN,,,2019-11-14T14:00:18,true,3,,,,,LA CONQUIE,12220,PEYRUSSE-LE-ROC,,,12181,,,,,,,,,,,,,,,,,,,2008-01-01,A,,,,,68.20B,NAFRev2,N,2.126275,44.487416,0.34,locality,La Capelle Sainte Croix 12220 Peyrusse-le-Roc,12181_B062,G,LA CAPELLE SAINTE CROIX,
449282300,00010,44928230000010,O,2003-07-01,NN,,,2019-11-14T14:00:18,true,4,,,,,LE CLEDIE,12220,PEYRUSSE-LE-ROC,,,12181,,,,,,,,,,,,,,,,,,,2008-01-01,A,,,,,01.43Z,NAFRev2,N,2.140506,44.496911,0.38,street,Rue de Valerie 12220 Peyrusse-le-Roc,12181_0055,G,RUE DE VALERIE,