siren,nic,siret,statutDiffusionEtablissement,dateCreationEtablissement,trancheEffectifsEtablissement,anneeEffectifsEtablissement,activitePrincipaleRegistreMetiersEtablissement,dateDernierTraitementEtablissement,etablissementSiege,nombrePeriodesEtablissement,complementAdresseEtablissement,numeroVoieEtablissement,indiceRepetitionEtablissement,typeVoieEtablissement,libelleVoieEtablissement,codePostalEtablissement,libelleCommuneEtablissement,libelleCommuneEtrangerEtablissement,distributionSpecialeEtablissement,codeCommuneEtablissement,codeCedexEtablissement,libelleCedexEtablissement,codePaysEtrangerEtablissement,libellePaysEtrangerEtablissement,complementAdresse2Etablissement,numeroVoie2Etablissement,indiceRepetition2Etablissement,typeVoie2Etablissement,libelleVoie2Etablissement,codePostal2Etablissement,libelleCommune2Etablissement,libelleCommuneEtranger2Etablissement,distributionSpeciale2Etablissement,codeCommune2Etablissement,codeCedex2Etablissement,libelleCedex2Etablissement,codePaysEtranger2Etablissement,libellePaysEtranger2Etablissement,dateDebut,etatAdministratifEtablissement,enseigne1Etablissement,enseigne2Etablissement,enseigne3Etablissement,denominationUsuelleEtablissement,activitePrincipaleEtablissement,nomenclatureActivitePrincipaleEtablissement,caractereEmployeurEtablissement,longitude,latitude,geo_score,geo_type,geo_adresse,geo_id,geo_ligne,geo_l4,geo_l5
211600093,00010,21160009300010,O,1983-03-01,03,2020,,2022-08-29T09:06:04,true,4,,,,,,16490,AMBERNAC,,,16009,,,,,,,,,,,,,,,,,,,2008-01-01,A,MAIRIE,,,,84.11Z,NAFRev2,O,,,0,,,,,,
211600093,00028,21160009300028,O,1983-12-21,01,2020,,2022-08-29T09:06:04,false,4,,,,,LE BOURG,16490,AMBERNAC,,,16009,,,,,,,,,,,,,,,,,,,2008-01-01,A,ECOLE ELEMENTAIRE PUBLIQUE,,,,85.20Z,NAFRev2,N,0.543569,45.975714,0.31,street,Rue de la Fourgeaude 16490 Ambernac,16009_0450,G,RUE DE LA FOURGEAUDE,
211600093,00036,21160009300036,O,1995-01-01,NN,,,2008-01-04T18:26:41,false,3,MAIRIE,,,,,16490,AMBERNAC,,,16009,,,,,,,,,,,,,,,,,,,2008-01-01,A,SERVICE DES EAUX,,,,36.00Z,NAFRev2,N,,,0,,,,,,
261601975,00012,26160197500012,O,1995-01-01,NN,,,2010-06-26T03:05:26,true,3,MAIRIE,,,,,16490,AMBERNAC,,,16009,,,,,,,,,,,,,,,,,,,2008-01-01,A,CDE,,,,88.99B,NAFRev2,N,,,0,,,,,,
261602148,00015,26160214800015,O,1986-01-06,NN,,,2010-06-26T03:05:26,true,3,MAIRIE,,,,,16490,AMBERNAC,,,16009,,,,,,,,,,,,,,,,,,,2008-01-01,A,CCAS,,,,88.99B,NAFRev2,N,,,0,,,,,,
291601938,00017,29160193800017,O,1995-12-25,NN,,,2006-11-25T09:10:26,true,3,MAIRIE,,,,,16490,AMBERNAC,,,16009,,,,,,,,,,,,,,,,,,,1997-12-31,F,,,,,70.1C,NAF1993,N,,,0,,,,,,
301395893,00011,30139589300011,O,1972-01-01,NN,,,2009-06-27T03:36:03,false,4,,,,,,16490,AMBERNAC,,,16009,,,,,,,,,,,,,,,,,,,2007-12-31,F,,,,,50.2Z,NAFRev1,O,,,0,,,,,,
301395893,00029,30139589300029,O,1984-02-01,NN,,,2010-04-18T03:21:41,true,3,,,,,,16490,AMBERNAC,,,16009,,,,,,,,,,,,,,,,,,,2008-01-01,A,,,,,33.12Z,NAFRev2,N,,,0,,,,,,
309809986,00040,30980998600040,O,2009-11-16,,,,2017-07-26T03:42:22,true,2,,,,,SAINT MARTIN,16490,AMBERNAC,,,16009,,,,,,,,,,,,,,,,,,,2016-06-30,F,,,,,38.32Z,NAFRev2,N,0.567041,45.979275,0.93,street,Rue de Saint Martin 16490 Ambernac,16009_1010,G,RUE DE SAINT MARTIN,
310387162,00012,31038716200012,O,1977-01-01,NN,,,,true,1,,,,,ST MARTIN,16490,AMBERNAC,,,16009,,,,,,,,,,,,,,,,,,,1998-11-20,F,,,,,29.3D,NAF1993,N,0.567041,45.979275,0.74,street,Rue de Saint Martin 16490 Ambernac,16009_1010,G,RUE DE SAINT MARTIN,
310654181,00083,31065418100083,O,2019-10-31,03,2020,,2022-08-29T09:13:28,false,1,,,,,LE CHAILLOT,16490,AMBERNAC,,,16009,,,,,,,,,,,,,,,,,,,2019-10-31,A,,,,,46.61Z,NAFRev2,O,4.867013,47.0675661,0.81,poi.vineyard,Rouge - Village - Les Chaillots (Vignoble) Aloxe-Corton,https://osm.org/way/277520498,G,,
311488415,00010,31148841500010,O,,,,,,true,1,,,,,,16490,AMBERNAC,,,16009,,,,,,,,,,,,,,,,,,,,F,,,,,67.05,NAP,N,,,0,,,,,,
311876874,00018,31187687400018,O,1978-01-01,NN,,,2008-04-17T16:53:06,true,4,,,,,MAIRIE,16490,AMBERNAC,,,16009,,,,,,,,,,,,,,,,,,,2008-04-17,A,,,,,94.99Z,NAFRev2,N,3.0709671,50.6304695,0.92,poi.townhall,Hôtel de Ville Lille,https://osm.org/way/40917078,G,,
318783784,00024,31878378400024,O,,NN,,,,true,1,,,,,SANS DOMICILE FIXE,16490,AMBERNAC,,,16009,,,,,,,,,,,,,,,,,,,,F,,,,,64.49,NAP,N,,,0,,,,,,
320132921,00018,32013292100018,O,,NN,,,,true,1,,,,,MONTERMENOUX,16490,AMBERNAC,,,16009,,,,,,,,,,,,,,,,,,,,F,,,,,01.80,NAP,N,0.559169,45.985917,0.92,street,Rue de Montermenoux 16490 Ambernac,16009_0750,G,RUE DE MONTERMENOUX,
323200600,00019,32320060000019,O,1981-11-01,NN,,,2007-01-18T09:16:11,true,4,,,,,L'ALLEMANDIE,16490,AMBERNAC,,,16009,,,,,,,,,,,,,,,,,,,1994-12-25,F,,,,,01.1A,NAF1993,N,0.523656,45.980794,0.93,street,Rue de l’Allemandie 16490 Ambernac,16009_0030,G,RUE DE L ALLEMANDIE,
324074301,00015,32407430100015,O,,,,,,true,1,,,,,,16490,AMBERNAC,,,16009,,,,,,,,,,,,,,,,,,,1988-01-01,F,,,,,15.01,NAP,N,,,0,,,,,,
328333729,00023,32833372900023,O,1986-12-31,NN,,,2011-03-24T08:45:55,true,4,,,,,LE BREUIL,16490,AMBERNAC,,,16009,,,,,,,,,,,,,,,,,,,2009-12-31,F,,,,,01.43Z,NAFRev2,N,5.3976545,49.1381358,0.9,poi.water,Le Breuil (Eau) Belleray,https://osm.org/way/72904083,G,,
330288739,00015,33028873900015,O,,NN,,,,true,1,,,,,SAINT MARTIN,16490,AMBERNAC,,,16009,,,,,,,,,,,,,,,,,,,1988-12-31,F,,,,,01.80,NAP,N,0.567041,45.979275,0.93,street,Rue de Saint Martin 16490 Ambernac,16009_1010,G,RUE DE SAINT MARTIN,
338312077,00013,33831207700013,O,1986-08-01,NN,,,2018-02-09T09:59:13,true,4,,,,LD,CHEZ PENOT,16490,AMBERNAC,,,16009,,,,,,,,,,,,,,,,,,,2018-01-01,F,,,,,01.49Z,NAFRev2,N,0.567063,45.965706,0.92,street,Rue de Chez Penot 16490 Ambernac,16009_0320,G,RUE DE CHEZ PENOT,
339469447,00041,33946944700041,O,2016-01-01,,,,2020-12-01T08:05:09,false,2,CHATEAU DE PRAISNAUD,,,,PRAISNAUD,16490,AMBERNAC,,,16009,,,,,,,,,,,,,,,,,,,2020-10-27,F,,,,,55.20Z,NAFRev2,N,0.572539,45.987483,0.91,street,Impasse de Praisnaud 16490 Ambernac,16009_0860,G,IMPASSE DE PRAISNAUD,
342331352,00035,34233135200035,O,1993-02-02,NN,,,2007-01-31T13:32:57,true,3,,,,RUE,BOILVIN,16490,AMBERNAC,,,16009,,,,,,,,,,,,,,,,,,,2007-01-31,F,,,,,52.6D,NAFRev1,N,0.540883,45.978899,0.69,street,Impasse Boilvin 16490 Ambernac,16009_0140,G,IMPASSE BOILVIN,
342530862,00016,34253086200016,O,1987-10-01,NN,,,2008-01-04T22:04:51,true,3,,,,LD,CHERONNIES,16490,AMBERNAC,,,16009,,,,,,,,,,,,,,,,,,,2008-01-01,A,,,,,01.45Z,NAFRev2,N,0.578278,45.957633,0.92,street,Rue des Cheronnies 16490 Ambernac,16009_0250,G,RUE DES CHERONNIES,
344628391,00023,34462839100023,O,,NN,,,,true,1,,,,,ST MARTIN,16490,AMBERNAC,,,16009,,,,,,,,,,,,,,,,,,,1989-12-31,F,,,,,67.04,NAP,N,0.567041,45.979275,0.74,street,Rue de Saint Martin 16490 Ambernac,16009_1010,G,RUE DE SAINT MARTIN,
348275587,00015,34827558700015,O,1988-10-07,NN,,,2020-12-23T10:32:42,true,4,,,,,LE BOURG,16490,AMBERNAC,,,16009,,,,,,,,,,,,,,,,,,,2020-12-31,F,,,,,01.42Z,NAFRev2,N,0.543569,45.975714,0.31,street,Rue de la Fourgeaude 16490 Ambernac,16009_0450,G,RUE DE LA FOURGEAUDE,
348355884,00019,34835588400019,O,,,,,,true,1,,,,,CHEZ PENOT,16490,AMBERNAC,,,16009,,,,,,,,,,,,,,,,,,,1997-12-31,F,,,,,01.2A,NAF1993,N,0.567063,45.965706,0.92,street,Rue de Chez Penot 16490 Ambernac,16009_0320,G,RUE DE CHEZ PENOT,
349321588,00015,34932158800015,O,1989-01-24,02,2020,,2022-08-29T09:31:11,true,4,,,,,LES SABLES DU CENTRE OUEST,16490,AMBERNAC,,,16009,,,,,,,,,,,,,,,,,,,2008-01-01,A,,,,,08.12Z,NAFRev2,O,,,0,,,,,,
349382762,00012,34938276200012,O,,NN,,,,true,1,,,,,LES CHERONNIES,16490,AMBERNAC,,,16009,,,,,,,,,,,,,,,,,,,1993-10-04,F,,,,,01.1A,NAF1993,N,0.578278,45.957633,0.8,street,Rue des Cheronnies 16490 Ambernac,16009_0250,G,RUE DES CHERONNIES,
353036189,00010,35303618900010,O,1990-01-01,NN,,,,true,4,,,,,LE BOURG,16490,AMBERNAC,,,16009,,,,,,,,,,,,,,,,,,,2001-12-31,F,,,,,01.2A,NAF1993,N,0.543569,45.975714,0.31,street,Rue de la Fourgeaude 16490 Ambernac,16009_0450,G,RUE DE LA FOURGEAUDE,
356000547,00089,35600054700089,O,1991-01-01,NN,,,2006-10-28T00:11:46,false,3,,,,,BOURG,16490,AMBERNAC,,,16009,,,,,,,,,,,,,,,,,,,2005-08-16,F,BUREAU DE POSTE,,,,64.1A,NAFRev1,O,-1.229143,44.2011043,0.89,poi.school,École du bourg Mimizan,https://osm.org/way/35215942,G,,
379908924,00028,37990892400028,O,1990-07-01,NN,,,,false,4,,,,RUE,ST MARTIN,16490,AMBERNAC,,,16009,,,,,,,,,,,,,,,,,,,2000-06-30,F,,,,,45.3A,NAF1993,O,0.567041,45.979275,0.81,street,Rue de Saint Martin 16490 Ambernac,16009_1010,G,RUE DE SAINT MARTIN,
381020056,00010,38102005600010,O,1991-02-01,NN,,,2021-06-21T10:00:55,true,3,,,,,LUXERAT,16490,AMBERNAC,,,16009,,,,,,,,,,,,,,,,,,,2008-01-01,A,,,,,01.41Z,NAFRev2,N,0.560211,45.975405,0.92,street,Rue de Luxerat 16490 Ambernac,16009_0670,G,RUE DE LUXERAT,
381021237,00015,38102123700015,O,1991-02-01,01,2020,,2022-08-29T09:08:12,true,4,,,,,PUYNODE HAUT,16490,AMBERNAC,,,16009,,,,,,,,,,,,,,,,,,,2013-12-31,A,,,,,01.41Z,NAFRev2,O,0.542256,45.989677,0.91,street,Impasse de Puynode Haut 16490 Ambernac,16009_6fgvob,G,IMPASSE DE PUYNODE HAUT,
382737302,00010,38273730200010,O,1991-06-06,NN,,,2008-01-04T22:14:15,true,3,,,,,LA BELLIVIERE,16490,AMBERNAC,,,16009,,,,,,,,,,,,,,,,,,,2008-01-01,A,,,,,01.41Z,NAFRev2,N,0.554537,45.979526,0.92,street,Rue de la Belliviere 16490 Ambernac,16009_0120,G,RUE DE LA BELLIVIERE,
384143756,00011,38414375600011,O,1991-12-21,NN,,,2008-01-04T22:34:28,true,3,,,,LD,LES CHEYRONNIES,16490,AMBERNAC,,,16009,,,,,,,,,,,,,,,,,,,2008-01-01,A,,,,,68.20A,NAFRev2,N,0.578739,45.964814,0.69,street,Les Cherchonnies 16490 Ambernac,16009_j8kbkl,G,LES CHERCHONNIES,
384882650,00011,38488265000011,O,1992-04-10,NN,,,2006-11-25T11:47:10,true,3,,,,,MONTERMENOUX,16490,AMBERNAC,,,16009,,,,,,,,,,,,,,,,,,,2004-01-31,F,,,,,71.3G,NAFRev1,N,0.559169,45.985917,0.92,street,Rue de Montermenoux 16490 Ambernac,16009_0750,G,RUE DE MONTERMENOUX,
389764176,00019,38976417600019,O,1991-05-01,NN,,,,true,1,,,,,LA BELLIVIERE,16490,AMBERNAC,,,16009,,,,,,,,,,,,,,,,,,,1999-12-31,F,,,,,01.2A,NAF1993,N,0.554537,45.979526,0.92,street,Rue de la Belliviere 16490 Ambernac,16009_0120,G,RUE DE LA BELLIVIERE,
389810730,00017,38981073000017,O,1992-12-22,NN,,,2008-01-04T23:30:26,true,3,,,,,CHEZ PENOT,16490,AMBERNAC,,,16009,,,,,,,,,,,,,,,,,,,2008-01-01,A,,,,,01.49Z,NAFRev2,N,0.567063,45.965706,0.92,street,Rue de Chez Penot 16490 Ambernac,16009_0320,G,RUE DE CHEZ PENOT,
390227288,00011,39022728800011,O,1991-01-01,NN,,,2008-01-04T23:37:07,true,3,,,,,CLERMONT,16490,AMBERNAC,,,16009,,,,,,,,,,,,,,,,,,,2008-01-01,A,,,,,01.11Z,NAFRev2,N,0.509438,45.978261,0.92,street,Route de Clermont 16490 Ambernac,16009_0350,G,ROUTE DE CLERMONT,
390661635,00016,39066163500016,O,1993-01-01,NN,,,2008-01-04T23:42:54,true,3,,,,LD,LUXERAT,16490,AMBERNAC,,,16009,,,,,,,,,,,,,,,,,,,2008-01-01,A,,,,,68.20B,NAFRev2,N,0.560211,45.975405,0.92,street,Rue de Luxerat 16490 Ambernac,16009_0670,G,RUE DE LUXERAT,
391258373,00011,39125837300011,O,1992-01-01,NN,,,2008-01-04T23:50:39,true,3,,,,,LES CHERONNIES,16490,AMBERNAC,,,16009,,,,,,,,,,,,,,,,,,,2008-01-01,A,,,,,66.22Z,NAFRev2,N,0.578278,45.957633,0.8,street,Rue des Cheronnies 16490 Ambernac,16009_0250,G,RUE DES CHERONNIES,
393917760,00034,39391776000034,O,2008-02-01,NN,,,2021-10-27T08:21:58,false,2,,,,,LE CHAILLOT,16490,AMBERNAC,,,16009,,,,,,,,,,,,,,,,,,,2019-10-31,F,,,,,46.61Z,NAFRev2,O,4.867013,47.0675661,0.81,poi.vineyard,Rouge - Village - Les Chaillots (Vignoble) Aloxe-Corton,https://osm.org/way/277520498,G,,
398168922,00019,39816892200019,O,,NN,,,,true,1,,,,,LE BOURG,16490,AMBERNAC,,,16009,,,,,,,,,,,,,,,,,,,1995-07-03,F,,,,,02.0B,NAF1993,N,0.543569,45.975714,0.31,street,Rue de la Fourgeaude 16490 Ambernac,16009_0450,G,RUE DE LA FOURGEAUDE,
398429464,00017,39842946400017,O,1994-09-01,01,2020,,2022-08-29T09:19:43,false,4,,,,LD,L'ALMANDIE,16490,AMBERNAC,,,16009,,,,,,,,,,,,,,,,,,,2012-12-31,A,,,,,01.41Z,NAFRev2,O,0.523656,45.980794,0.76,street,Rue de l’Allemandie 16490 Ambernac,16009_0030,G,RUE DE L ALLEMANDIE,
400493888,00020,40049388800020,O,1995-04-01,01,2020,,2022-08-29T09:21:30,true,3,LA FAYE,,,,LA FAYE,16490,AMBERNAC,,,16009,,,,,,,,,,,,,,,,,,,2008-01-01,A,,,,,01.41Z,NAFRev2,N,0.589037,45.963973,0.91,street,Impasse de la Faye 16490 Ambernac,16009_0420,G,IMPASSE DE LA FAYE,
400626727,00012,40062672700012,O,1995-04-01,NN,,,2011-05-19T03:46:40,true,4,,,,LD,LA FAYE,16490,AMBERNAC,,,16009,,,,,,,,,,,,,,,,,,,2010-12-31,F,,,,,68.20B,NAFRev2,N,0.589037,45.963973,0.91,street,Impasse de la Faye 16490 Ambernac,16009_0420,G,IMPASSE DE LA FAYE,
403575061,00011,40357506100011,O,1995-11-01,NN,,,2021-07-23T15:04:09,true,4,,,,LD,PRAISNAUD,16490,AMBERNAC,,,16009,,,,,,,,,,,,,,,,,,,2001-07-31,F,,,,,01.1A,NAF1993,N,0.572539,45.987483,0.91,street,Impasse de Praisnaud 16490 Ambernac,16009_0860,G,IMPASSE DE PRAISNAUD,
407897016,00017,40789701600017,O,1996-06-03,NN,,,2011-11-18T11:55:49,true,4,,,,,LES CHAMPS,16490,AMBERNAC,,,16009,,,,,,,,,,,,,,,,,,,2011-10-26,F,,,,,01.11Z,NAFRev2,N,0.52584,45.989418,0.75,street,Impasse des Champs 16490 Ambernac,16009_0210,G,IMPASSE DES CHAMPS,
408559284,00034,40855928400034,O,1996-06-03,NN,,,2008-01-04T21:13:03,false,3,,,,,LES CHAMPS,16490,AMBERNAC,,,16009,,,,,,,,,,,,,,,,,,,2008-01-01,A,,,,,01.11Z,NAFRev2,N,0.52584,45.989418,0.75,street,Impasse des Champs 16490 Ambernac,16009_0210,G,IMPASSE DES CHAMPS,
409659984,00010,40965998400010,O,1984-12-31,NN,,,2012-11-26T02:35:52,true,5,,,,,LE BOURG,16490,AMBERNAC,,,16009,,,,,,,,,,,,,,,,,,,2010-09-30,F,,,,,01.11Z,NAFRev2,N,0.543569,45.975714,0.31,street,Rue de la Fourgeaude 16490 Ambernac,16009_0450,G,RUE DE LA FOURGEAUDE,
409659992,00013,40965999200013,O,1983-12-31,NN,,,2008-01-04T21:30:13,true,3,,,,,ALLEMANDIE,16490,AMBERNAC,,,16009,,,,,,,,,,,,,,,,,,,2008-01-01,A,,,,,01.24Z,NAFRev2,N,0.523656,45.980794,0.92,street,Rue de l’Allemandie 16490 Ambernac,16009_0030,G,RUE DE L ALLEMANDIE,
409660008,00015,40966000800015,O,1982-12-31,NN,,,2008-01-04T21:30:13,true,3,,,,,LA GRANGE,16490,AMBERNAC,,,16009,,,,,,,,,,,,,,,,,,,2008-01-01,A,,,,,01.45Z,NAFRev2,N,0.553626,45.991578,0.92,street,Rue de la Grange des Mottes 16490 Ambernac,16009_0540,G,RUE DE LA GRANGE DES MOTTES,
409660016,00018,40966001600018,O,1985-12-31,NN,,,2006-10-28T03:42:56,true,3,,,,,CHEZ BONNET,16490,AMBERNAC,,,16009,,,,,,,,,,,,,,,,,,,2005-11-16,F,,,,,01.2A,NAFRev1,N,3.5562911,45.9540266,0.89,poi.track,Chemin de Chez Fumas à Chez Bonnet Châteldon,https://osm.org/way/132627996,G,,
409660024,00012,40966002400012,O,1987-12-31,NN,,,2006-10-28T03:42:56,true,3,,,,,MONTERMENOUX,16490,AMBERNAC,,,16009,,,,,,,,,,,,,,,,,,,2005-12-31,F,,,,,01.2A,NAFRev1,N,0.559169,45.985917,0.92,street,Rue de Montermenoux 16490 Ambernac,16009_0750,G,RUE DE MONTERMENOUX,
409660032,00015,40966003200015,O,1993-11-01,NN,,,2008-01-04T21:30:13,true,3,,,,,LA GRANGE DES MOTTES,16490,AMBERNAC,,,16009,,,,,,,,,,,,,,,,,,,2008-01-01,A,,,,,01.41Z,NAFRev2,N,0.553626,45.991578,0.93,street,Rue de la Grange des Mottes 16490 Ambernac,16009_0540,G,RUE DE LA GRANGE DES MOTTES,
409660040,00018,40966004000018,O,1989-12-31,NN,,,2016-03-03T03:58:47,true,4,,,,,MONTERMENOUX,16490,AMBERNAC,,,16009,,,,,,,,,,,,,,,,,,,2001-06-21,F,,,,,01.3Z,NAF1993,N,0.559169,45.985917,0.92,street,Rue de Montermenoux 16490 Ambernac,16009_0750,G,RUE DE MONTERMENOUX,
409660057,00012,40966005700012,O,1991-12-31,NN,,,2021-02-23T11:31:46,true,4,,,,,NASSEAU,16490,AMBERNAC,,,16009,,,,,,,,,,,,,,,,,,,2016-05-03,A,,,,,68.20B,NAFRev2,N,0.576899,45.971819,0.91,street,Rue de Nasseau 16490 Ambernac,16009_0770,G,RUE DE NASSEAU,
409660065,00015,40966006500015,O,1982-12-31,NN,,,2017-05-17T11:34:52,true,4,,,,,LE BOURG,16490,AMBERNAC,,,16009,,,,,,,,,,,,,,,,,,,2017-03-31,F,,,,,01.45Z,NAFRev2,N,0.543569,45.975714,0.31,street,Rue de la Fourgeaude 16490 Ambernac,16009_0450,G,RUE DE LA FOURGEAUDE,
409660073,00019,40966007300019,O,1994-01-01,NN,,,2008-01-04T21:30:13,true,3,,,,,LA GRANGE DES MOTTES,16490,AMBERNAC,,,16009,,,,,,,,,,,,,,,,,,,2008-01-01,A,,,,,01.42Z,NAFRev2,N,0.553626,45.991578,0.93,street,Rue de la Grange des Mottes 16490 Ambernac,16009_0540,G,RUE DE LA GRANGE DES MOTTES,
409660081,00012,40966008100012,O,1992-11-02,NN,,,2022-02-26T03:50:48,true,4,,,,,LE BREUIL,16490,AMBERNAC,,,16009,,,,,,,,,,,,,,,,,,,2021-12-31,F,,,,,01.45Z,NAFRev2,N,5.3976545,49.1381358,0.9,poi.water,Le Breuil (Eau) Belleray,https://osm.org/way/72904083,G,,
409660099,00014,40966009900014,O,1995-01-01,NN,,,2008-01-04T21:30:13,true,3,,,,,ST MARTIN,16490,AMBERNAC,,,16009,,,,,,,,,,,,,,,,,,,2008-01-01,A,,,,,01.11Z,NAFRev2,N,0.567041,45.979275,0.74,street,Rue de Saint Martin 16490 Ambernac,16009_1010,G,RUE DE SAINT MARTIN,
410307201,00013,41030720100013,O,1997-01-04,NN,,4322BB,2022-02-21T14:58:27,true,6,,,,,LE BOURG,16490,AMBERNAC,,,16009,,,,,,,,,,,,,,,,,,,2018-10-31,F,,,,,43.22B,NAFRev2,N,0.543569,45.975714,0.31,street,Rue de la Fourgeaude 16490 Ambernac,16009_0450,G,RUE DE LA FOURGEAUDE,
413259607,00013,41325960700013,O,1982-12-31,NN,,,2006-10-28T04:08:56,true,3,,,,,LA LANDE DES CHERONNIES,16490,AMBERNAC,,,16009,,,,,,,,,,,,,,,,,,,2004-10-31,F,,,,,01.2A,NAFRev1,N,0.578278,45.957633,0.67,street,Rue des Cheronnies 16490 Ambernac,16009_0250,G,RUE DES CHERONNIES,
413259615,00016,41325961500016,O,1982-12-31,NN,,,2016-07-06T10:06:19,true,4,,,,,CHEZ GILLOU,16490,AMBERNAC,,,16009,,,,,,,,,,,,,,,,,,,2015-12-31,F,,,,,01.41Z,NAFRev2,N,0.54152,45.979114,0.7,street,Rue de Chez Guilloux 16490 Ambernac,16009_0280,G,RUE DE CHEZ GUILLOUX,
413259623,00010,41325962300010,O,1985-12-31,NN,,,2022-09-03T13:56:17,true,4,,7,,RUE,DE CHEZ PENOT,16490,AMBERNAC,,,16009,,,,,,,,,,,,,,,,,,,2022-08-01,A,,,,,55.20Z,NAFRev2,N,0.567,45.965868,0.94,housenumber,7 Rue de Chez Penot 16490 Ambernac,16009_0320_00007,G,7 RUE DE CHEZ PENOT,
413259623,00028,41325962300028,O,2009-12-19,,,,2016-01-12T00:19:15,false,1,,,,,CHEZ PENOT,16490,AMBERNAC,,,16009,,,,,,,,,,,,,,,,,,,2009-12-19,A,,,,,70.10Z,NAFRev2,N,0.567063,45.965706,0.92,street,Rue de Chez Penot 16490 Ambernac,16009_0320,G,RUE DE CHEZ PENOT,
413259631,00013,41325963100013,O,1989-12-31,NN,,,2006-10-28T04:08:56,true,3,,,,,LA LANDE DES CHERONNIES,16490,AMBERNAC,,,16009,,,,,,,,,,,,,,,,,,,2004-10-31,F,,,,,01.2C,NAFRev1,N,0.578278,45.957633,0.67,street,Rue des Cheronnies 16490 Ambernac,16009_0250,G,RUE DES CHERONNIES,
413259649,00015,41325964900015,O,1989-12-31,NN,,,2006-10-28T04:08:56,true,3,,,,,NASSEAU,16490,AMBERNAC,,,16009,,,,,,,,,,,,,,,,,,,2004-03-31,F,,,,,01.2C,NAFRev1,N,0.576899,45.971819,0.91,street,Rue de Nasseau 16490 Ambernac,16009_0770,G,RUE DE NASSEAU,
413259656,00010,41325965600010,O,1977-12-25,NN,,,2008-01-04T22:30:56,true,3,,,,,L'ALEMANDIE,16490,AMBERNAC,,,16009,,,,,,,,,,,,,,,,,,,2008-01-01,A,,,,,01.21Z,NAFRev2,N,0.523656,45.980794,0.85,street,Rue de l’Allemandie 16490 Ambernac,16009_0030,G,RUE DE L ALLEMANDIE,
413259664,00014,41325966400014,O,1994-08-01,NN,,,2012-03-26T02:42:38,true,3,,,,,CHEZ PASQUET,16490,AMBERNAC,,,16009,,,,,,,,,,,,,,,,,,,2008-01-01,A,,,,,01.42Z,NAFRev2,N,0.570507,45.977313,0.77,street,Impasse de Chez Paquet 16490 Ambernac,16009_iimdof,G,IMPASSE DE CHEZ PAQUET,
413265216,00023,41326521600023,O,1993-01-01,NN,,,2018-07-11T10:59:57,true,3,,,,,LE BREUIL,16490,AMBERNAC,,,16009,,,,,,,,,,,,,,,,,,,2008-01-01,A,,,,,01.42Z,NAFRev2,N,5.3976545,49.1381358,0.9,poi.water,Le Breuil (Eau) Belleray,https://osm.org/way/72904083,G,,
419551866,00017,41955186600017,O,1998-08-16,NN,,,2006-10-28T04:44:20,true,4,,,,,NASSEAU,16490,AMBERNAC,,,16009,,,,,,,,,,,,,,,,,,,2005-12-30,F,,,,,02.0A,NAFRev1,N,0.576899,45.971819,0.91,street,Rue de Nasseau 16490 Ambernac,16009_0770,G,RUE DE NASSEAU,
420869513,00010,42086951300010,O,1991-12-31,NN,,,2008-01-04T23:58:33,true,5,,,,,ST MARTIN,16490,AMBERNAC,,,16009,,,,,,,,,,,,,,,,,,,2008-01-01,A,,,,,68.20B,NAFRev2,N,0.567041,45.979275,0.74,street,Rue de Saint Martin 16490 Ambernac,16009_1010,G,RUE DE SAINT MARTIN,
422684126,00044,42268412600044,O,2001-05-01,,,,2016-04-12T03:56:11,false,3,,,,,PRAISNAUD,16490,AMBERNAC,,,16009,,,,,,,,,,,,,,,,,,,2015-10-20,F,,,,,55.20Z,NAFRev2,N,0.572539,45.987483,0.91,street,Impasse de Praisnaud 16490 Ambernac,16009_0860,G,IMPASSE DE PRAISNAUD,
424297372,00015,42429737200015,O,1999-01-01,NN,,,2021-02-23T11:46:29,true,4,,,,,CHEZ PENOT,16490,AMBERNAC,,,16009,,,,,,,,,,,,,,,,,,,2009-01-01,A,,,,,68.20B,NAFRev2,N,0.567063,45.965706,0.92,street,Rue de Chez Penot 16490 Ambernac,16009_0320,G,RUE DE CHEZ PENOT,
424684967,00021,42468496700021,O,2001-06-01,NN,,9529ZC,2020-10-06T16:10:07,true,4,,1,,RUE,DE PUYNODE,16490,AMBERNAC,,,16009,,,,,,,,,,,,,,,,,,,2020-06-17,A,LULU COUTURE,,,LULU COUTURE,14.39Z,NAFRev2,N,0.540493,45.982864,0.93,housenumber,1 Rue de Puynode Bas 16490 Ambernac,16009_xzxg6b_00001,G,1 RUE DE PUYNODE BAS,
427908629,00020,42790862900020,O,2013-05-01,,,,2015-06-18T10:28:01,true,2,,,,,CHEZ PENOT,16490,AMBERNAC,,,16009,,,,,,,,,,,,,,,,,,,2015-06-11,F,,,,ETA VILLETTE,01.61Z,NAFRev2,N,0.567063,45.965706,0.92,street,Rue de Chez Penot 16490 Ambernac,16009_0320,G,RUE DE CHEZ PENOT,
428113062,00015,42811306200015,O,1991-02-01,,,,,true,1,,,,,PUYNODE HAUT,16490,AMBERNAC,,,16009,,,,,,,,,,,,,,,,,,,1999-12-31,F,,,,,70.2B,NAF1993,N,0.542256,45.989677,0.91,street,Impasse de Puynode Haut 16490 Ambernac,16009_6fgvob,G,IMPASSE DE PUYNODE HAUT,
430985838,00019,43098583800019,O,1989-01-01,NN,,,2007-08-23T09:00:40,true,3,,,,,NASSEAU,16490,AMBERNAC,,,16009,,,,,,,,,,,,,,,,,,,2005-12-01,F,,,,,01.3Z,NAFRev1,N,0.576899,45.971819,0.91,street,Rue de Nasseau 16490 Ambernac,16009_0770,G,RUE DE NASSEAU,
432372035,00019,43237203500019,O,2000-01-01,NN,,,2008-01-04T18:35:24,true,3,,,,,LA BELEVIERE,16490,AMBERNAC,,,16009,,,,,,,,,,,,,,,,,,,2008-01-01,A,,,,,01.42Z,NAFRev2,N,0.554537,45.979526,0.72,street,Rue de la Belliviere 16490 Ambernac,16009_0120,G,RUE DE LA BELLIVIERE,
432515963,00010,43251596300010,O,2000-07-01,NN,,,2008-11-08T01:56:26,false,4,,,,RUE,ST MARTIN,16490,AMBERNAC,,,16009,,,,,,,,,,,,,,,,,,,2002-09-01,F,,,,,45.3A,NAF1993,O,0.567041,45.979275,0.81,street,Rue de Saint Martin 16490 Ambernac,16009_1010,G,RUE DE SAINT MARTIN,
433335890,00029,43333589000029,O,2020-06-15,,,,2022-08-25T04:06:16,false,2,,2,,RUE,DE NASSEAU,16490,AMBERNAC,,,16009,,,,,,,,,,,,,,,,,,,2022-07-01,F,,,,,86.90D,NAFRev2,N,0.576978,45.971641,0.94,housenumber,2 Rue de Nasseau 16490 Ambernac,16009_0770_00002,G,2 RUE DE NASSEAU,
438761686,00015,43876168600015,O,2001-08-01,NN,,,,true,4,,,,,LE MOULIN DU BREUIL,16490,AMBERNAC,,,16009,,,,,,,,,,,,,,,,,,,2002-11-20,F,,,,,01.2C,NAF1993,N,1.5528795,47.1336474,0.76,poi.track,Chemin Rural de la Fernigauderie et du Haut-Breuil au Moulin du Breuil Veuil,https://osm.org/way/235944338,G,,
439352063,00010,43935206300010,O,2001-10-02,NN,,,2016-11-10T13:49:27,false,3,,,,,LA VALLADE,16490,AMBERNAC,,,16009,,,,,,,,,,,,,,,,,,,2004-05-27,F,,,,,52.2E,NAFRev1,N,0.533623,45.953239,0.91,street,Impasse de la Vallade 16490 Ambernac,16009_1050,G,IMPASSE DE LA VALLADE,
439923103,00014,43992310300014,O,2001-08-03,01,2020,,2022-08-29T09:15:58,true,3,,,,,PRAISNAUD,16490,AMBERNAC,,,16009,,,,,,,,,,,,,,,,,,,2008-01-01,A,,,,,01.11Z,NAFRev2,N,0.572539,45.987483,0.91,street,Impasse de Praisnaud 16490 Ambernac,16009_0860,G,IMPASSE DE PRAISNAUD,
441009602,00018,44100960200018,O,1996-09-15,NN,,,2009-02-27T09:15:05,true,3,,,,,CLERMONT,16490,AMBERNAC,,,16009,,,,,,,,,,,,,,,,,,,2008-01-01,A,,,,,01.45Z,NAFRev2,N,0.509438,45.978261,0.92,street,Route de Clermont 16490 Ambernac,16009_0350,G,ROUTE DE CLERMONT,
441597630,00017,44159763000017,O,2002-02-07,NN,,,2008-01-04T21:23:09,true,3,,,,,L'ALMANDIE,16490,AMBERNAC,,,16009,,,,,,,,,,,,,,,,,,,2008-01-01,A,,,,,68.20B,NAFRev2,N,0.523656,45.980794,0.76,street,Rue de l’Allemandie 16490 Ambernac,16009_0030,G,RUE DE L ALLEMANDIE,
444211056,00015,44421105600015,O,2000-01-01,NN,,,2008-07-06T05:52:18,true,3,,,,,CHEZ GUILLOUX,16490,AMBERNAC,,,16009,,,,,,,,,,,,,,,,,,,2008-01-01,A,,,,,01.45Z,NAFRev2,N,0.54152,45.979114,0.93,street,Rue de Chez Guilloux 16490 Ambernac,16009_0280,G,RUE DE CHEZ GUILLOUX,
449031202,00012,44903120200012,O,2002-08-30,NN,,,2008-01-04T23:36:12,true,3,,,,,L'ALMANDIE,16490,AMBERNAC,,,16009,,,,,,,,,,,,,,,,,,,2008-01-01,A,,,,,01.42Z,NAFRev2,N,0.523656,45.980794,0.76,street,Rue de l’Allemandie 16490 Ambernac,16009_0030,G,RUE DE L ALLEMANDIE,