siren,nic,siret,statutDiffusionEtablissement,dateCreationEtablissement,trancheEffectifsEtablissement,anneeEffectifsEtablissement,activitePrincipaleRegistreMetiersEtablissement,dateDernierTraitementEtablissement,etablissementSiege,nombrePeriodesEtablissement,complementAdresseEtablissement,numeroVoieEtablissement,indiceRepetitionEtablissement,typeVoieEtablissement,libelleVoieEtablissement,codePostalEtablissement,libelleCommuneEtablissement,libelleCommuneEtrangerEtablissement,distributionSpecialeEtablissement,codeCommuneEtablissement,codeCedexEtablissement,libelleCedexEtablissement,codePaysEtrangerEtablissement,libellePaysEtrangerEtablissement,complementAdresse2Etablissement,numeroVoie2Etablissement,indiceRepetition2Etablissement,typeVoie2Etablissement,libelleVoie2Etablissement,codePostal2Etablissement,libelleCommune2Etablissement,libelleCommuneEtranger2Etablissement,distributionSpeciale2Etablissement,codeCommune2Etablissement,codeCedex2Etablissement,libelleCedex2Etablissement,codePaysEtranger2Etablissement,libellePaysEtranger2Etablissement,dateDebut,etatAdministratifEtablissement,enseigne1Etablissement,enseigne2Etablissement,enseigne3Etablissement,denominationUsuelleEtablissement,activitePrincipaleEtablissement,nomenclatureActivitePrincipaleEtablissement,caractereEmployeurEtablissement,longitude,latitude,geo_score,geo_type,geo_adresse,geo_id,geo_ligne,geo_l4,geo_l5
212202212,00016,21220221200016,O,1983-03-01,11,2020,,2022-08-29T09:06:20,true,4,,,,RUE,TREGUIER,22220,PLOUGUIEL,,,22221,,,,,,,,,,,,,,,,,,,2008-01-01,A,MAIRIE,,,,84.11Z,NAFRev2,O,-3.235612,48.793876,0.95,street,Rue de Tréguier 22220 Plouguiel,22221_0062,G,RUE DE TREGUIER,
212202212,00024,21220221200024,O,1983-12-21,03,2020,,2022-08-29T09:06:20,false,3,RTE DE PENVENAN,41,,RUE,DES ECOLES,22220,PLOUGUIEL,,,22221,,,,,,,,,,,,,,,,,,,2008-01-01,A,ECOLE PRIMAIRE PUBLIQUE,,,,85.20Z,NAFRev2,N,-3.242723,48.795821,0.95,housenumber,41 Rue des Écoles 22220 Plouguiel,22221_0016_00041,G,41 RUE DES ECOLES,
212202212,00040,21220221200040,O,2000-12-25,NN,,,2009-08-04T15:46:13,false,3,,,,RUE,TREGUIER,22220,PLOUGUIEL,,,22221,,,,,,,,,,,,,,,,,,,2008-01-01,F,LOTISSEMENT COMMUNAL,,,,42.99Z,NAFRev2,N,-3.235612,48.793876,0.95,street,Rue de Tréguier 22220 Plouguiel,22221_0062,G,RUE DE TREGUIER,
252203484,00016,25220348400016,O,2000-02-18,NN,,,2009-06-27T03:28:24,false,3,MAIRIE,,,RUE,TREGUIER,22220,PLOUGUIEL,,,22221,,,,,,,,,,,,,,,,,,,2004-04-25,F,,,,,80.4D,NAFRev1,N,-3.235612,48.793876,0.95,street,Rue de Tréguier 22220 Plouguiel,22221_0062,G,RUE DE TREGUIER,
262203920,00018,26220392000018,O,1984-09-17,NN,,,2010-06-26T03:06:37,true,4,MAIRIE,,,RUE,TREGUIER,22220,PLOUGUIEL,,,22221,,,,,,,,,,,,,,,,,,,2008-01-01,A,,,,,88.99B,NAFRev2,N,-3.235612,48.793876,0.95,street,Rue de Tréguier 22220 Plouguiel,22221_0062,G,RUE DE TREGUIER,
262205750,00017,26220575000017,O,1993-12-15,NN,,,2022-10-21T11:24:35,true,5,MAIRIE,5,,RUE,ECOLES,22220,PLOUGUIEL,,,22221,,,,,,,,,,,,,,,,,,,2022-01-01,F,,,,,88.99B,NAFRev2,N,-3.239161,48.797226,0.88,housenumber,5 Rue des Écoles 22220 Plouguiel,22221_0016_00005,G,5 RUE DES ECOLES,
300800927,00067,30080092700067,O,2002-04-02,NN,,,2007-04-06T07:39:35,true,3,LA ROCHE JAUNE,31,,RUE,DU CENTRE,22220,PLOUGUIEL,,,22221,,,,,,,,,,,,,,,,,,,2007-04-05,F,,,,,55.4B,NAFRev1,N,-3.209527,48.824567,0.95,housenumber,31 Rue du Centre 22220 Plouguiel,22221_0010_00031,G,31 RUE DU CENTRE,
301378501,00011,30137850100011,O,,,,,,true,1,,,,,SAINT FRANCOIS,22220,PLOUGUIEL,,,22221,,,,,,,,,,,,,,,,,,,1985-12-25,F,,,,,69.23,NAP,N,-3.238212,48.791803,0.94,locality,Saint Francois 22220 Plouguiel,22221_C396,G,SAINT FRANCOIS,
302356373,00035,30235637300035,O,2004-10-01,NN,,,2006-10-26T23:56:51,false,3,,26,,,KERAUTRET,22220,PLOUGUIEL,,,22221,,,,,,,,,,,,,,,,,,,2005-03-21,F,,,,,70.2C,NAFRev1,N,-3.213802,48.812098,0.87,housenumber,26 Lieu Dit Kerautret 22220 Plouguiel,22221_0l49ts_00026,G,26 LIEU DIT KERAUTRET,
302356373,00043,30235637300043,O,2005-11-01,,,,2008-01-17T09:03:57,false,3,,26,,,KERAUTRET,22220,PLOUGUIEL,,,22221,,,,,,,,,,,,,,,,,,,2008-01-01,F,,,,,01.11Z,NAFRev2,N,-3.213802,48.812098,0.87,housenumber,26 Lieu Dit Kerautret 22220 Plouguiel,22221_0l49ts_00026,G,26 LIEU DIT KERAUTRET,
302671136,00026,30267113600026,O,,NN,,,,true,1,,22,,RUE,DE TREGUIER,22220,PLOUGUIEL,,,22221,,,,,,,,,,,,,,,,,,,1996-12-31,F,,,,,93.0N,NAF1993,N,-3.236399,48.795,0.96,housenumber,22 Rue de Tréguier 22220 Plouguiel,22221_0062_00022,G,22 RUE DE TREGUIER,
303480198,00017,30348019800017,O,1975-01-01,NN,,,2012-11-29T13:20:53,false,4,,,,,KERBORN,22220,PLOUGUIEL,,,22221,,,,,,,,,,,,,,,,,,,2009-12-31,F,,,,,56.10A,NAFRev2,N,-3.262182,48.799,0.69,street,Kerboriou 22220 Plouguiel,22221_msd2vn,G,KERBORIOU,
303480198,00025,30348019800025,O,2012-12-27,,,,2013-08-08T11:36:38,true,2,,22,,RUE,DE TREGUIER,22220,PLOUGUIEL,,,22221,,,,,,,,,,,,,,,,,,,2012-12-28,F,,,,,56.30Z,NAFRev2,N,-3.236399,48.795,0.96,housenumber,22 Rue de Tréguier 22220 Plouguiel,22221_0062_00022,G,22 RUE DE TREGUIER,
306269788,00015,30626978800015,O,1976-01-01,NN,,,2016-04-26T01:50:52,true,5,,,,,BOURG,22220,PLOUGUIEL,,,22221,,,,,,,,,,,,,,,,,,,2014-02-28,F,,,,,47.73Z,NAFRev2,O,-1.229143,44.2011043,0.89,poi.school,École du bourg Mimizan,https://osm.org/way/35215942,G,,
306352261,00011,30635226100011,O,1900-01-01,NN,,,2008-11-07T00:22:04,true,4,,,,LD,BEC MELEN LA ROCHE JAUNE,22220,PLOUGUIEL,,,22221,,,,,,,,,,,,,,,,,,,2003-12-31,F,,,,,35.1B,NAFRev1,N,,,0,,,,,,
306936485,00029,30693648500029,O,1987-12-25,NN,,,,true,3,,,,,KERAUTRET,22220,PLOUGUIEL,,,22221,,,,,,,,,,,,,,,,,,,1999-12-25,F,,,,,05.0A,NAF1993,N,-3.214765,48.811155,0.93,street,Lieu Dit Kerautret 22220 Plouguiel,22221_0l49ts,G,LIEU DIT KERAUTRET,
307062851,00018,30706285100018,O,1900-01-01,NN,,,,true,4,,,,,BOURG,22220,PLOUGUIEL,,,22221,,,,,,,,,,,,,,,,,,,2003-10-01,F,,,,,85.1C,NAFRev1,N,-1.229143,44.2011043,0.89,poi.school,École du bourg Mimizan,https://osm.org/way/35215942,G,,
308069350,00012,30806935000012,O,,NN,,,,true,1,,,,LD,LA ROCHE JAUNE,22220,PLOUGUIEL,,,22221,,,,,,,,,,,,,,,,,,,1988-02-24,F,,,,,55.71,NAP,N,-3.20484,48.825226,0.94,locality,La Roche Jaune 22220 Plouguiel,22221_C382,G,LA ROCHE JAUNE,
309222735,00016,30922273500016,O,1975-01-01,NN,,,2008-11-07T00:23:58,true,3,,,,,BOURG,22220,PLOUGUIEL,,,22221,,,,,,,,,,,,,,,,,,,2005-01-31,F,,,,,45.4C,NAFRev1,N,-1.229143,44.2011043,0.89,poi.school,École du bourg Mimizan,https://osm.org/way/35215942,G,,
309845683,00015,30984568300015,O,1900-01-01,NN,,,2008-01-04T19:57:34,true,3,,,,,MAIRIE,22220,PLOUGUIEL,,,22221,,,,,,,,,,,,,,,,,,,2008-01-01,A,,,,,93.12Z,NAFRev2,N,3.0709671,50.6304695,0.92,poi.townhall,Hôtel de Ville Lille,https://osm.org/way/40917078,G,,
310100250,00011,31010025000011,O,,,,,,true,1,,,,LD,PORS AR GWIN,22220,PLOUGUIEL,,,22221,,,,,,,,,,,,,,,,,,,1985-12-25,F,,,,,55.60,NAP,N,-3.233955,48.793433,0.94,street,Pors Ar Gwin 22220 Plouguiel,22221_C250,G,PORS AR GWIN,
310440045,00022,31044004500022,O,,NN,,,,true,1,,,,,BOURG,22220,PLOUGUIEL,,,22221,,,,,,,,,,,,,,,,,,,1988-04-01,F,,,,,85.1G,NAF1993,N,-1.229143,44.2011043,0.89,poi.school,École du bourg Mimizan,https://osm.org/way/35215942,G,,
310577911,00012,31057791100012,O,,,,,,true,1,,,,,POUL BISSY,22220,PLOUGUIEL,,,22221,,,,,,,,,,,,,,,,,,,,F,,,,,57.09,NAP,N,-3.239157,48.796635,0.76,street,Impasse Poul Bissi 22220 Plouguiel,22221_0050,G,IMPASSE POUL BISSI,
311454326,00019,31145432600019,O,1992-10-01,NN,,,2015-01-22T09:07:56,true,4,,,,,KERALIO,22220,PLOUGUIEL,,,22221,,,,,,,,,,,,,,,,,,,2013-12-31,F,,,,,90.03B,NAFRev2,N,-3.249131,48.816883,0.92,street,Lieu Dit Keralio 22220 Plouguiel,22221_3ayz0d,G,LIEU DIT KERALIO,
312059678,00010,31205967800010,O,1978-01-01,NN,,,2007-01-18T09:12:28,true,3,,,,,BONNE NOUVELLE,22220,PLOUGUIEL,,,22221,,,,,,,,,,,,,,,,,,,1996-12-25,F,,,,,01.4A,NAF1993,N,-3.275756,48.795098,0.93,street,Lieu Dit Bonne Nouvelle 22220 Plouguiel,22221_B032,G,LIEU DIT BONNE NOUVELLE,
312439300,00053,31243930000053,O,2011-07-06,,,,2016-03-04T14:16:38,false,2,,5,,,KERGOULAS,22220,PLOUGUIEL,,,22221,,,,,,,,,,,,,,,,,,,2016-01-01,F,,,,,47.21Z,NAFRev2,N,-3.255727,48.804888,0.95,housenumber,5 Kergoulas 22220 Plouguiel,22221_72lq1g_00005,G,5 KERGOULAS,
312610496,00019,31261049600019,O,,NN,,,,true,1,,,,LD,SAINT JACQUES,22220,PLOUGUIEL,,,22221,,,,,,,,,,,,,,,,,,,,F,,,,,01.00,NAP,N,-3.237811,48.797556,0.49,street,Résidence Résidence Saint-Joseph 22220 Plouguiel,22221_A015,G,RESIDENCE RESIDENCE SAINT JOSEPH,
312714819,00025,31271481900025,O,2012-10-19,,,,2013-08-19T02:31:25,true,2,,6,B,RUE,SAINT GOUENO,22220,PLOUGUIEL,,,22221,,,,,,,,,,,,,,,,,,,2012-12-31,F,,,,,96.09Z,NAFRev2,N,-3.208446,48.822572,0.86,housenumber,6bis Rue Saint Gouéno 22220 Plouguiel,22221_0059_00006_bis,G,6BIS RUE SAINT GOUENO,
314451113,00018,31445111300018,O,,NN,,,,true,1,,,,LD,KERDANOU IZELLAN,22220,PLOUGUIEL,,,22221,,,,,,,,,,,,,,,,,,,1987-12-25,F,,,,,01.00,NAP,N,-3.263371,48.786612,0.67,locality,Kerdannou Huellan 22220 Plouguiel,22221_B269,G,KERDANNOU HUELLAN,
315772970,00028,31577297000028,O,1900-01-01,NN,,,2008-11-07T00:31:15,false,4,,,,,BOURG,22220,PLOUGUIEL,,,22221,,,,,,,,,,,,,,,,,,,2002-07-27,F,,,,,45.3E,NAF1993,O,-1.229143,44.2011043,0.89,poi.school,École du bourg Mimizan,https://osm.org/way/35215942,G,,
315772970,00036,31577297000036,O,2002-07-27,NN,,4391BZ,2020-08-25T10:26:40,true,4,,2,,,CROIX KEROUSY,22220,PLOUGUIEL,,,22221,,,,,,,,,,,,,,,,,,,2018-02-18,F,,,,,43.91B,NAFRev2,O,-3.237596,48.80278,0.83,housenumber,2 La Croix de Kerousy 22220 Plouguiel,22221_b179_00002,G,2 LA CROIX DE KEROUSY,
316563147,00016,31656314700016,O,1979-01-01,NN,,,,true,1,,,,,GROAS COAT,22220,PLOUGUIEL,,,22221,,,,,,,,,,,,,,,,,,,1999-12-31,F,,,,,85.1G,NAF1993,N,-3.247807,48.795822,0.94,locality,Groas Coat 22220 Plouguiel,22221_B224,G,GROAS COAT,
316563154,00012,31656315400012,O,,,,,,true,1,,,,,KERGOULAS,22220,PLOUGUIEL,,,22221,,,,,,,,,,,,,,,,,,,1985-12-25,F,,,,,67.01,NAP,N,-3.255727,48.804888,0.95,street,Kergoulas 22220 Plouguiel,22221_72lq1g,G,KERGOULAS,
318747235,00022,31874723500022,O,,NN,,,,true,1,,,,,LOT PENGUER,22220,PLOUGUIEL,,,22221,,,,,,,,,,,,,,,,,,,1995-06-14,F,,,,,64.11,NAP,N,-3.25504,48.796163,0.43,street,Penquer 22220 Plouguiel,22221_kytpll,G,PENQUER,
318946027,00014,31894602700014,O,1980-04-01,02,2020,,2022-08-29T09:16:09,true,4,,11,,,KERMENOU,22220,PLOUGUIEL,,,22221,,,,,,,,,,,,,,,,,,,2008-01-01,A,,,,,56.30Z,NAFRev2,O,-3.269326,48.790873,0.86,housenumber,11 Lieu Dit Kermenou 22220 Plouguiel,22221_q4mew8_00011,G,11 LIEU DIT KERMENOU,
319613139,00025,31961313900025,O,1983-07-01,NN,,4120AZ,2015-10-18T04:03:03,true,4,,,,LD,LA ROCHE JAUNE,22220,PLOUGUIEL,,,22221,,,,,,,,,,,,,,,,,,,2015-09-30,F,,,,,43.99C,NAFRev2,N,-3.20484,48.825226,0.94,locality,La Roche Jaune 22220 Plouguiel,22221_C382,G,LA ROCHE JAUNE,
319683504,00017,31968350400017,O,1980-09-01,NN,,,2008-11-07T00:35:32,true,4,LA ROCHE JAUNE,27,,RUE,DU CENTRE,22220,PLOUGUIEL,,,22221,,,,,,,,,,,,,,,,,,,2004-09-30,F,,,,,45.3F,NAFRev1,O,-3.210476,48.823757,0.95,housenumber,27 Rue du Centre 22220 Plouguiel,22221_0010_00027,G,27 RUE DU CENTRE,
320764160,00042,32076416000042,O,2010-05-03,,,,2012-11-09T00:20:12,true,2,,34,,RUE,DE TREGUIER,22220,PLOUGUIEL,,,22221,,,,,,,,,,,,,,,,,,,2011-08-31,F,,,,,47.89Z,NAFRev2,N,-3.235781,48.793988,0.96,housenumber,34 Rue de Tréguier 22220 Plouguiel,22221_0062_00034,G,34 RUE DE TREGUIER,
322212820,00011,32221282000011,O,1963-06-18,01,2020,,2022-08-29T09:17:25,true,4,SAINT-FRANCOIS,,,,LE VIEUX COUVENT ST FRANCO,22220,PLOUGUIEL,,,22221,,,,,,,,,,,,,,,,,,,2015-01-01,A,,,,,68.20B,NAFRev2,O,-3.240304,48.791076,0.51,street,Route du Vieux Couvent 22220 Plouguiel,22221_0075,G,ROUTE DU VIEUX COUVENT,
324785161,00039,32478516100039,O,,NN,,,,true,1,,,,,KERFALLS,22220,PLOUGUIEL,,,22221,,,,,,,,,,,,,,,,,,,1989-11-15,F,,,,,66.02,NAP,N,-3.237324,48.815302,0.41,street,Lieu Dit Kerfelest 22220 Plouguiel,22221_j1hzqi,G,LIEU DIT KERFELEST,
324875434,00031,32487543400031,O,2007-07-21,,,,2021-02-23T10:47:38,false,2,LA ROCHE JAUNE,,,,LE BELVEDERE,22220,PLOUGUIEL,,,22221,,,,,,,,,,,,,,,,,,,2008-01-01,A,,,,,68.20A,NAFRev2,N,-3.206017,48.825702,0.74,street,Rue du Belvédère 22220 Plouguiel,22221_0006,G,RUE DU BELVEDERE,
325078160,00042,32507816000042,O,2014-04-02,,,,2015-11-26T12:57:34,true,2,,,,LD,KERVELEZ,22220,PLOUGUIEL,,,22221,,,,,,,,,,,,,,,,,,,2015-11-30,F,,,,,71.11Z,NAFRev2,N,,,0,,,,,,
325135259,00035,32513525900035,O,2010-04-01,,,,2014-06-10T16:43:55,true,2,,20,,,DE KERAUTRET,22220,PLOUGUIEL,,,22221,,,,,,,,,,,,,,,,,,,2013-09-30,F,,,,,47.81Z,NAFRev2,N,-3.21238,48.813343,0.72,housenumber,20 Lieu Dit Kerautret 22220 Plouguiel,22221_0l49ts_00020,G,20 LIEU DIT KERAUTRET,
326288743,00015,32628874300015,O,,NN,,,,true,1,,,,RTE,DE TREGUIER,22220,PLOUGUIEL,,,22221,,,,,,,,,,,,,,,,,,,1987-05-25,F,,,,,64.41,NAP,N,-3.235612,48.793876,0.79,street,Rue de Tréguier 22220 Plouguiel,22221_0062,G,RUE DE TREGUIER,
327606315,00031,32760631500031,O,1983-12-01,NN,,,,true,1,,,,LD,ANCIENNE ECOLE,22220,PLOUGUIEL,,,22221,,,,,,,,,,,,,,,,,,,1999-12-31,F,,,,,85.1E,NAF1993,O,-3.250726,48.795879,0.58,street,Rue de l’Ancienne Gare 22220 Plouguiel,22221_0001,G,RUE DE L ANCIENNE GARE,
327826087,00014,32782608700014,O,,NN,,,,true,1,,,,,KERRIOU,22220,PLOUGUIEL,,,22221,,,,,,,,,,,,,,,,,,,1995-12-31,F,,,,,01.4A,NAF1993,N,-3.234471,48.808043,0.69,street,Lieu Dit Keriou 22220 Plouguiel,22221_0i7s5b,G,LIEU DIT KERIOU,
328377841,00015,32837784100015,O,1983-10-03,NN,,,2008-11-07T00:46:15,false,4,,24,,RUE,ANCIENNE GARE,22220,PLOUGUIEL,,,22221,,,,,,,,,,,,,,,,,,,2004-09-01,F,,,,,60.2E,NAFRev1,N,-3.248822,48.796152,0.91,housenumber,24 Rue de l’Ancienne Gare 22220 Plouguiel,22221_0001_00024,G,24 RUE DE L ANCIENNE GARE,
328377841,00023,32837784100023,O,2004-09-01,,,4932ZA,2015-03-17T00:19:19,true,4,,3,,,KERBALANGER,22220,PLOUGUIEL,,,22221,,,,,,,,,,,,,,,,,,,2012-08-29,F,,,,,49.32Z,NAFRev2,N,-3.232217,48.799004,0.87,housenumber,3 Lieu Dit Kerbalanger 22220 Plouguiel,22221_va7bgp_00003,G,3 LIEU DIT KERBALANGER,
328561311,00015,32856131100015,O,1983-08-01,NN,,,,true,1,,,,,KERGUILLERM,22220,PLOUGUIEL,,,22221,,,,,,,,,,,,,,,,,,,1999-09-30,F,,,,,01.1A,NAF1993,N,-3.271499,48.791183,0.41,street,Lieu Dit Kermenou 22220 Plouguiel,22221_q4mew8,G,LIEU DIT KERMENOU,
329573695,00015,32957369500015,O,1984-01-01,NN,,,,true,1,,,,,PRAT AMOUR,22220,PLOUGUIEL,,,22221,,,,,,,,,,,,,,,,,,,2002-03-30,F,,,,,01.3Z,NAF1993,N,-3.23536,48.801774,0.95,street,Prat Amour 22220 Plouguiel,22221_C290,G,PRAT AMOUR,
329707756,00014,32970775600014,O,1984-04-03,NN,,,2015-05-14T06:21:06,false,5,,,,LD,PENQUER,22220,PLOUGUIEL,,,22221,,,,,,,,,,,,,,,,,,,2013-05-31,F,,,,,31.09B,NAFRev2,O,-3.25504,48.796163,0.95,street,Penquer 22220 Plouguiel,22221_kytpll,G,PENQUER,
329793848,00022,32979384800022,O,1994-07-14,NN,,,2021-02-23T10:50:30,true,3,,,,,KERYANO,22220,PLOUGUIEL,,,22221,,,,,,,,,,,,,,,,,,,2008-01-01,A,,,,,03.11Z,NAFRev2,N,-3.21223,48.832204,0.45,street,Keranou 22220 Plouguiel,22221_1dpii2,G,KERANOU,
329916845,00012,32991684500012,O,,NN,,,,true,1,,,,LD,KERBORN,22220,PLOUGUIEL,,,22221,,,,,,,,,,,,,,,,,,,1987-03-31,F,,,,,55.72,NAP,N,-3.262182,48.799,0.69,street,Kerboriou 22220 Plouguiel,22221_msd2vn,G,KERBORIOU,
330129313,00012,33012931300012,O,,NN,,,,true,1,,,,,KERMADUR,22220,PLOUGUIEL,,,22221,,,,,,,,,,,,,,,,,,,1987-10-30,F,,,,,01.07,NAP,N,-3.220565,48.825209,0.93,street,Lieu Dit Kermadur 22220 Plouguiel,22221_644ebp,G,LIEU DIT KERMADUR,
331235234,00019,33123523400019,O,,NN,,,,true,1,,,,,LA ROCHE JAUNE,22220,PLOUGUIEL,,,22221,,,,,,,,,,,,,,,,,,,1989-12-04,F,,,,,67.07,NAP,N,-3.20484,48.825226,0.94,locality,La Roche Jaune 22220 Plouguiel,22221_C382,G,LA ROCHE JAUNE,
332239409,00011,33223940900011,O,,,,,,true,1,,7,,RUE,DE TREGUIER,22220,PLOUGUIEL,,,22221,,,,,,,,,,,,,,,,,,,1992-03-30,F,,,,,52.2C,NAF1993,N,-3.236901,48.79687,0.96,housenumber,7 Rue de Tréguier 22220 Plouguiel,22221_0062_00007,G,7 RUE DE TREGUIER,
332488659,00027,33248865900027,O,,,,,,true,1,,,,,LA ROCHE JAUNE,22220,PLOUGUIEL,,,22221,,,,,,,,,,,,,,,,,,,1988-11-02,F,,,,,44.39,NAP,N,-3.20484,48.825226,0.94,locality,La Roche Jaune 22220 Plouguiel,22221_C382,G,LA ROCHE JAUNE,
332541754,00013,33254175400013,O,1900-01-01,NN,,,2011-04-28T00:27:26,false,2,,,,LD,LA ROCHE JAUNE,22220,PLOUGUIEL,,,22221,,,,,,,,,,,,,,,,,,,1985-12-25,F,,,,,38.50,NAP,N,-3.20484,48.825226,0.94,locality,La Roche Jaune 22220 Plouguiel,22221_C382,G,LA ROCHE JAUNE,
333367878,00027,33336787800027,O,2009-11-10,,,,2011-02-08T06:29:36,true,2,LA ROCHE JAUNE,31,,RUE,DU CENTRE,22220,PLOUGUIEL,,,22221,,,,,,,,,,,,,,,,,,,2011-01-30,F,L'INCROYABLE,,,,56.30Z,NAFRev2,N,-3.209527,48.824567,0.95,housenumber,31 Rue du Centre 22220 Plouguiel,22221_0010_00031,G,31 RUE DU CENTRE,
333826873,00015,33382687300015,O,,NN,,,,true,1,,,,,KERBORN,22220,PLOUGUIEL,,,22221,,,,,,,,,,,,,,,,,,,,F,,,,,55.40,NAP,N,-3.262182,48.799,0.69,street,Kerboriou 22220 Plouguiel,22221_msd2vn,G,KERBORIOU,
334110137,00018,33411013700018,O,1985-12-01,NN,,,2008-04-05T00:37:02,true,3,,,,LD,LA ROCHE JAUNE,22220,PLOUGUIEL,,,22221,,,,,,,,,,,,,,,,,,,2008-01-01,A,,,,,68.20B,NAFRev2,N,-3.20484,48.825226,0.94,locality,La Roche Jaune 22220 Plouguiel,22221_C382,G,LA ROCHE JAUNE,
334772803,00022,33477280300022,O,,NN,,,,true,1,,,,,SAINT FRANCOIS,22220,PLOUGUIEL,,,22221,,,,,,,,,,,,,,,,,,,1989-09-30,F,,,,,64.12,NAP,N,-3.238212,48.791803,0.94,locality,Saint Francois 22220 Plouguiel,22221_C396,G,SAINT FRANCOIS,
335111175,00022,33511117500022,O,1993-05-01,NN,,,2008-02-25T13:29:49,true,3,,8,,RUE,DE KERILIS,22220,PLOUGUIEL,,,22221,,,,,,,,,,,,,,,,,,,2007-09-10,F,,,,,92.3B,NAFRev1,N,-3.244038,48.795909,0.9,housenumber,8 Rue de Kerillis 22220 Plouguiel,22221_0032_00008,G,8 RUE DE KERILLIS,
335261806,00012,33526180600012,O,1986-04-02,NN,,,2008-11-07T00:55:53,false,4,,,,,BOURG,22220,PLOUGUIEL,,,22221,,,,,,,,,,,,,,,,,,,1993-04-01,F,,,,,45.4C,NAF1993,N,-1.229143,44.2011043,0.89,poi.school,École du bourg Mimizan,https://osm.org/way/35215942,G,,
335261806,00020,33526180600020,O,1993-04-01,NN,,4332AA,2015-03-17T00:23:04,true,5,,37,,RUE,ANCIENNE GARE,22220,PLOUGUIEL,,,22221,,,,,,,,,,,,,,,,,,,2008-12-31,A,,,,,43.32A,NAFRev2,N,-3.256002,48.795217,0.91,housenumber,37 Rue de l’Ancienne Gare 22220 Plouguiel,22221_0001_00037,G,37 RUE DE L ANCIENNE GARE,
337906325,00051,33790632500051,O,2009-07-01,,,,2021-02-23T10:54:37,true,3,,14,,RUE,CRECH LANN,22220,PLOUGUIEL,,,22221,,,,,,,,,,,,,,,,,,,2011-09-21,A,,,,,73.11Z,NAFRev2,N,-3.236609,48.793407,0.85,housenumber,14 Rue de Crec H Lann 22220 Plouguiel,22221_0007_00014,G,14 RUE DE CREC H LANN,
337934806,00023,33793480600023,O,2019-07-01,,,4399CZ,2021-02-23T10:54:38,true,1,,17,,RUE,DU STADE,22220,PLOUGUIEL,,,22221,,,,,,,,,,,,,,,,,,,2019-07-01,A,,,,JD MULTI SERVICES TRAVAUX INTERIEURS ET EXTERIEURS,43.99C,NAFRev2,N,-3.239414,48.799123,0.95,housenumber,17 Rue du Stade 22220 Plouguiel,22221_0063_00017,G,17 RUE DU STADE,
339727828,00032,33972782800032,O,1993-06-15,,,,2014-07-08T00:43:38,true,5,,6,,RUE,GROS COAT,22220,PLOUGUIEL,,,22221,,,,,,,,,,,,,,,,,,,2012-03-14,F,,,,,18.12Z,NAFRev2,N,-3.247697,48.796258,0.83,housenumber,6 Rue de Groas Coat 22220 Plouguiel,22221_0012_00006,G,6 RUE DE GROAS COAT,
340068824,00036,34006882400036,O,1999-05-02,NN,,,2008-11-07T01:00:01,true,3,,,,,KER HUELLAN,22220,PLOUGUIEL,,,22221,,,,,,,,,,,,,,,,,,,2007-01-31,F,,,,,45.1A,NAFRev1,N,-3.284983,48.797449,0.94,locality,Ker Huellan 22220 Plouguiel,22221_B256,G,KER HUELLAN,
341815736,00010,34181573600010,O,,NN,,,,true,1,,,,RTE,DU PORT,22220,PLOUGUIEL,,,22221,,,,,,,,,,,,,,,,,,,1987-08-30,F,,,,,62.46,NAP,N,-3.205786,48.824347,0.72,street,Rue du Port 22220 Plouguiel,22221_0052,G,RUE DU PORT,
342611761,00012,34261176100012,O,,NN,,,,true,1,,,,,BOURG,22220,PLOUGUIEL,,,22221,,,,,,,,,,,,,,,,,,,1991-08-31,F,,,,,81.21,NAP,N,-1.229143,44.2011043,0.89,poi.school,École du bourg Mimizan,https://osm.org/way/35215942,G,,
343074761,00010,34307476100010,O,1987-11-24,00,2020,9602AA,2022-08-29T09:28:03,true,6,,10,,RUE,DES ECOLES,22220,PLOUGUIEL,,,22221,,,,,,,,,,,,,,,,,,,2020-05-25,F,PROFIL,,,,96.02A,NAFRev2,O,-3.242267,48.7968,0.95,housenumber,10 Rue des Écoles 22220 Plouguiel,22221_0016_00010,G,10 RUE DES ECOLES,
343294419,00019,34329441900019,O,1988-01-01,NN,,,2019-02-12T03:52:32,true,4,,,,,BOURG,22220,PLOUGUIEL,,,22221,,,,,,,,,,,,,,,,,,,2018-12-31,F,,,,,01.61Z,NAFRev2,N,-1.229143,44.2011043,0.89,poi.school,École du bourg Mimizan,https://osm.org/way/35215942,G,,
343455069,00017,34345506900017,O,,NN,,,,true,1,,,,RTE,DE TREGUIER,22220,PLOUGUIEL,,,22221,,,,,,,,,,,,,,,,,,,1989-04-30,F,,,,,64.41,NAP,N,-3.235612,48.793876,0.79,street,Rue de Tréguier 22220 Plouguiel,22221_0062,G,RUE DE TREGUIER,
343566956,00011,34356695600011,O,,NN,,,,true,1,,,,LD,BEG MELEN,22220,PLOUGUIEL,,,22221,,,,,,,,,,,,,,,,,,,1991-09-04,F,,,,,05.0C,NAF1993,N,-3.209534,48.814364,0.95,street,Beg Melen 22220 Plouguiel,22221_B012,G,BEG MELEN,
343927836,00035,34392783600035,O,2012-08-27,,,4321AB,2021-09-17T11:34:17,false,6,,2,B,CHE,DU VIEUX PONT,22220,PLOUGUIEL,,,22221,,,,,,,,,,,,,,,,,,,2018-08-07,F,,,,,43.12A,NAFRev2,N,-3.240043,48.793321,0.86,housenumber,2b Chemin du Vieux Pont 22220 Plouguiel,22221_0073_00002_b,G,2B CHEMIN DU VIEUX PONT,
344607668,00011,34460766800011,O,1988-04-02,NN,,,2008-11-08T00:19:45,false,4,,,,LD,GROAS COAT,22220,PLOUGUIEL,,,22221,,,,,,,,,,,,,,,,,,,2003-05-06,F,,,,,50.1Z,NAFRev1,O,-3.247807,48.795822,0.94,locality,Groas Coat 22220 Plouguiel,22221_B224,G,GROAS COAT,
344607668,00037,34460766800037,O,2003-05-06,03,2020,,2023-01-06T13:40:44,true,5,,5,,ZA,CROAS AR BRABANT,22220,PLOUGUIEL,,,22221,,,,,,,,,,,,,,,,,,,2022-11-10,A,,,,AGRI 22,45.20A,NAFRev2,O,,,0,,,,,,
344778626,00012,34477862600012,O,1988-04-15,NN,,,2009-10-24T05:42:57,false,4,,,,,PORS GWIN,22220,PLOUGUIEL,,,22221,,,,,,,,,,,,,,,,,,,1997-07-01,F,SARL COPRMER,,,,14.2A,NAF1993,N,-3.233955,48.793433,0.84,street,Pors Ar Gwin 22220 Plouguiel,22221_C250,G,PORS AR GWIN,
349150896,00018,34915089600018,O,1989-01-02,NN,,,2010-05-09T05:41:57,true,4,,,,,BOURG,22220,PLOUGUIEL,,,22221,,,,,,,,,,,,,,,,,,,2009-12-31,F,,,,,47.11B,NAFRev2,N,-1.229143,44.2011043,0.89,poi.school,École du bourg Mimizan,https://osm.org/way/35215942,G,,
351371372,00019,35137137200019,O,1989-07-02,01,2020,4520AB,2022-08-29T09:01:52,true,4,,,,,KERMENOU,22220,PLOUGUIEL,,,22221,,,,,,,,,,,,,,,,,,,2008-01-01,A,,,,,45.20A,NAFRev2,O,-3.271499,48.791183,0.93,street,Lieu Dit Kermenou 22220 Plouguiel,22221_q4mew8,G,LIEU DIT KERMENOU,
351541461,00023,35154146100023,O,2015-10-12,,,,2021-02-23T11:04:08,true,1,,4,T,RUE,DU CENTRE,22220,PLOUGUIEL,,,22221,,,,,,,,,,,,,,,,,,,2015-10-12,A,,,,,90.03A,NAFRev2,N,-3.211903,48.822625,0.85,housenumber,4ter Rue du Centre 22220 Plouguiel,22221_0010_00004_ter,G,4TER RUE DU CENTRE,
352854624,00025,35285462400025,O,2010-11-01,,,,2021-02-23T11:05:15,true,1,LA ROCHE JAUNE,,,,1 RUE KERARET,22220,PLOUGUIEL,,,22221,,,,,,,,,,,,,,,,,,,2010-11-01,A,,,,,01.13Z,NAFRev2,N,-3.204759,48.830789,0.93,housenumber,1 Rue de Keraret 22220 Plouguiel,22221_0029_00001,G,1 RUE DE KERARET,
353743453,00014,35374345300014,O,,NN,,,,true,1,,,,,LA ROCHE JAUNE,22220,PLOUGUIEL,,,22221,,,,,,,,,,,,,,,,,,,1992-07-29,F,,,,,55.4B,NAF1993,N,-3.20484,48.825226,0.94,locality,La Roche Jaune 22220 Plouguiel,22221_C382,G,LA ROCHE JAUNE,
353840069,00010,35384006900010,O,1990-03-01,NN,,,,true,1,,,,,LA ROCHE JAUNE,22220,PLOUGUIEL,,,22221,,,,,,,,,,,,,,,,,,,2002-09-09,F,,,,,61.1B,NAF1993,N,-3.20484,48.825226,0.94,locality,La Roche Jaune 22220 Plouguiel,22221_C382,G,LA ROCHE JAUNE,
377501507,00034,37750150700034,O,,,,,,true,1,,8,,RUE,DU CENTRE,22220,PLOUGUIEL,,,22221,,,,,,,,,,,,,,,,,,,1992-05-12,F,,,,,05.0C,NAF1993,N,-3.210298,48.823423,0.95,housenumber,8 Rue du Centre 22220 Plouguiel,22221_0010_00008,G,8 RUE DU CENTRE,
379014236,00028,37901423600028,O,2007-02-01,,,,2021-02-23T11:07:40,true,2,,,,,LA ROCHE ROUGE,22220,PLOUGUIEL,,,22221,,,,,,,,,,,,,,,,,,,2008-01-01,A,,,,,70.10Z,NAFRev2,O,-3.230195,48.79459,0.94,street,La Roche Rouge 22220 Plouguiel,22221_C387,G,LA ROCHE ROUGE,