siren,nic,siret,statutDiffusionEtablissement,dateCreationEtablissement,trancheEffectifsEtablissement,anneeEffectifsEtablissement,activitePrincipaleRegistreMetiersEtablissement,dateDernierTraitementEtablissement,etablissementSiege,nombrePeriodesEtablissement,complementAdresseEtablissement,numeroVoieEtablissement,indiceRepetitionEtablissement,typeVoieEtablissement,libelleVoieEtablissement,codePostalEtablissement,libelleCommuneEtablissement,libelleCommuneEtrangerEtablissement,distributionSpecialeEtablissement,codeCommuneEtablissement,codeCedexEtablissement,libelleCedexEtablissement,codePaysEtrangerEtablissement,libellePaysEtrangerEtablissement,complementAdresse2Etablissement,numeroVoie2Etablissement,indiceRepetition2Etablissement,typeVoie2Etablissement,libelleVoie2Etablissement,codePostal2Etablissement,libelleCommune2Etablissement,libelleCommuneEtranger2Etablissement,distributionSpeciale2Etablissement,codeCommune2Etablissement,codeCedex2Etablissement,libelleCedex2Etablissement,codePaysEtranger2Etablissement,libellePaysEtranger2Etablissement,dateDebut,etatAdministratifEtablissement,enseigne1Etablissement,enseigne2Etablissement,enseigne3Etablissement,denominationUsuelleEtablissement,activitePrincipaleEtablissement,nomenclatureActivitePrincipaleEtablissement,caractereEmployeurEtablissement,longitude,latitude,geo_score,geo_type,geo_adresse,geo_id,geo_ligne,geo_l4,geo_l5
213602105,00016,21360210500016,O,1983-03-01,02,2020,,2022-08-29T09:07:00,true,4,,,,,,36230,SARZAY,,,36210,,,,,,,,,,,,,,,,,,,2008-01-01,A,MAIRIE,,,,84.11Z,NAFRev2,O,,,0,,,,,,
213602105,00024,21360210500024,O,1983-12-21,NN,,,2021-10-27T08:08:06,false,3,,,,,LE BOURG,36230,SARZAY,,,36210,,,,,,,,,,,,,,,,,,,2008-01-01,A,ECOLE PRIMAIRE PUBLIQUE,,,,85.20Z,NAFRev2,N,1.905605,46.602582,0.71,locality,Les Champs du Bourg 36230 Sarzay,36210_B082,G,LES CHAMPS DU BOURG,
263601551,00017,26360155100017,O,1992-01-01,NN,,,2018-01-30T13:54:52,true,4,MAIRIE,,,,,36230,SARZAY,,,36210,,,,,,,,,,,,,,,,,,,2018-01-01,F,CCAS,,,,88.99B,NAFRev2,N,1.905364,46.599094,0.65,street,La Metairie 36230 Sarzay,36210_1259uy,D,LA METAIRIE,
306334210,00060,30633421000060,O,1993-01-01,NN,,,2016-01-12T00:10:42,true,3,,,,,MONTGARNI,36230,SARZAY,,,36210,,,,,,,,,,,,,,,,,,,2008-01-01,A,,,,,01.50Z,NAFRev2,N,1.907033,46.586165,0.94,street,Montgarni 36230 Sarzay,36210_6w46wa,G,MONTGARNI,
306334210,00078,30633421000078,O,2000-05-02,NN,,,2016-01-12T00:10:47,false,3,,,,,DOMAINE MONTGARNI,36230,SARZAY,,,36210,,,,,,,,,,,,,,,,,,,2008-01-01,A,,,,,56.10A,NAFRev2,N,1.907033,46.586165,0.57,street,Montgarni 36230 Sarzay,36210_6w46wa,G,MONTGARNI,
306661828,00096,30666182800096,O,2008-10-09,,,,2011-06-21T13:05:47,false,4,LE PONDRON,7,,RTE,DES COUTURES,36230,SARZAY,,,36210,,,,,,,,,,,,,,,,,,,2011-06-01,F,,,,,56.10C,NAFRev2,N,1.893665,46.575196,0.84,housenumber,7 Route des Coutures 36230 Sarzay,36210_0012_00007,G,7 ROUTE DES COUTURES,
308671361,00019,30867136100019,O,,NN,,,,true,1,,,,LD,LE PONDERON,36230,SARZAY,,,36210,,,,,,,,,,,,,,,,,,,1996-12-31,F,,,,,55.3A,NAF1993,O,1.932584,46.614628,0.39,street,Le Chiron 36230 Sarzay,36210_gittj6,G,LE CHIRON,
319403101,00011,31940310100011,O,1980-07-16,NN,,,2008-11-07T00:35:14,true,4,,,,,LES CACOTS,36230,SARZAY,,,36210,,,,,,,,,,,,,,,,,,,2003-09-30,F,,,,,45.3A,NAFRev1,N,1.898122,46.611724,0.43,street,Les Sadets 36230 Sarzay,36210_y6digu,G,LES SADETS,
322139015,00026,32213901500026,O,1984-01-01,NN,,,2008-01-04T18:33:01,true,5,,4,,LD,CHENIL,36230,SARZAY,,,36210,,,,,,,,,,,,,,,,,,,2008-01-01,A,,,,,01.11Z,NAFRev2,N,1.921993,46.601768,0.71,locality,Le Petit Chenil 36230 Sarzay,36210_B208,G,LE PETIT CHENIL,
322350380,00018,32235038000018,O,,NN,,,,true,1,,,,LD,PONDERON,36230,SARZAY,,,36210,,,,,,,,,,,,,,,,,,,,F,,,,,55.60,NAP,N,1.886594,46.574777,0.6,street,La Gare du Pondron 36230 Sarzay,36210_B181,G,LA GARE DU PONDRON,
322418971,00014,32241897100014,O,1981-08-16,NN,,,2006-10-27T01:18:36,true,4,,,,,LE VIGNONNET,36230,SARZAY,,,36210,,,,,,,,,,,,,,,,,,,2004-07-15,F,,,,,01.1A,NAFRev1,N,1.893557,46.576966,0.79,street,Route de Vignonnet 36230 Sarzay,36210_0062,G,ROUTE DE VIGNONNET,
323742908,00011,32374290800011,O,1982-01-01,NN,,,2007-01-18T09:16:22,true,3,,,,LD,BELLEVUE,36230,SARZAY,,,36210,,,,,,,,,,,,,,,,,,,1995-12-25,F,,,,,01.3Z,NAF1993,N,1.883524,46.589851,0.94,street,Bellevue 36230 Sarzay,36210_4qjdio,G,BELLEVUE,
325427540,00019,32542754000019,O,1982-04-01,NN,,,2007-01-18T09:16:45,true,4,,,,HAM,FRAGNE,36230,SARZAY,,,36210,,,,,,,,,,,,,,,,,,,1994-12-25,F,,,,,01.1A,NAF1993,N,1.912183,46.58258,0.93,street,Le Fragne 36230 Sarzay,36210_qed1jh,G,LE FRAGNE,
328502844,00017,32850284400017,O,1983-11-11,NN,,,2007-01-18T09:18:15,true,4,,,,,PEYROUSE,36230,SARZAY,,,36210,,,,,,,,,,,,,,,,,,,1995-12-25,F,,,,,01.2A,NAF1993,N,1.934512,46.621185,0.61,street,La Perouse 36230 Sarzay,36210_gblvqe,G,LA PEROUSE,
329012496,00017,32901249600017,O,,NN,,,,true,1,,,,,LE PONDEROU,36230,SARZAY,,,36210,,,,,,,,,,,,,,,,,,,1987-12-31,F,,,,,87.07,NAP,N,1.895413,46.599367,0.38,street,Le Portail 36230 Sarzay,36210_k511dt,G,LE PORTAIL,
329454961,00015,32945496100015,O,1984-04-02,NN,,,,true,1,,,,LD,LES ASSINES,36230,SARZAY,,,36210,,,,,,,,,,,,,,,,,,,2001-12-01,F,,,,,01.4A,NAF1993,N,1.921687,46.621049,0.93,street,Les Assines 36230 Sarzay,36210_t0l7pj,G,LES ASSINES,
329740393,00015,32974039300015,O,1984-03-05,NN,,,,true,1,,,,,LES ASSINES,36230,SARZAY,,,36210,,,,,,,,,,,,,,,,,,,2001-12-31,F,,,,,01.3Z,NAF1993,N,1.921687,46.621049,0.93,street,Les Assines 36230 Sarzay,36210_t0l7pj,G,LES ASSINES,
330140336,00018,33014033600018,O,1984-07-09,NN,,,,true,1,,15,,RTE,DE LA CHATRE,36230,SARZAY,,,36210,,,,,,,,,,,,,,,,,,,1999-12-31,F,,,,,45.2V,NAF1993,N,1.921863,46.602404,0.85,housenumber,15 Route de la Chatre 36230 Sarzay,36210_0010_00015,G,15 ROUTE DE LA CHATRE,
331343319,00017,33134331900017,O,1984-11-11,NN,,,2013-09-12T10:41:09,false,3,,,,LD,FRAGNE,36230,SARZAY,,,36210,,,,,,,,,,,,,,,,,,,2002-12-31,F,,,,,01.1A,NAF1993,N,1.912183,46.58258,0.93,street,Le Fragne 36230 Sarzay,36210_qed1jh,G,LE FRAGNE,
332656230,00015,33265623000015,O,1985-01-01,NN,,,2007-04-18T08:40:36,true,3,,,,LD,BELLEVUE,36230,SARZAY,,,36210,,,,,,,,,,,,,,,,,,,2006-11-17,F,,,,,01.3Z,NAFRev1,N,1.883524,46.589851,0.94,street,Bellevue 36230 Sarzay,36210_4qjdio,G,BELLEVUE,
334680030,00023,33468003000023,O,1994-12-27,NN,,,2006-12-15T00:27:42,false,2,,,,,LE CHATEAU,36230,SARZAY,,,36210,,,,,,,,,,,,,,,,,,,1995-03-31,F,,,,,55.2E,NAF1993,N,1.905418,46.599922,0.93,street,Le Chateau 36230 Sarzay,36210_zd42ex,G,LE CHATEAU,
338097751,00014,33809775100014,O,1986-07-01,NN,,9521ZZ,2015-05-20T05:26:50,true,4,LES PONDRON,3,,RTE,DES COUTURES,36230,SARZAY,,,36210,,,,,,,,,,,,,,,,,,,2015-05-31,F,,,,,95.21Z,NAFRev2,N,1.892232,46.577075,0.84,housenumber,3 Route des Coutures 36230 Sarzay,36210_0012_00003,G,3 ROUTE DES COUTURES,
339727646,00012,33972764600012,O,,,,,,true,1,,,,LD,LE PONDERON,36230,SARZAY,,,36210,,,,,,,,,,,,,,,,,,,1993-06-30,F,,,,,55.3A,NAF1993,N,1.932584,46.614628,0.39,street,Le Chiron 36230 Sarzay,36210_gittj6,G,LE CHIRON,
348177379,00024,34817737900024,O,2010-04-01,,,2640ZZ,2016-06-02T03:58:30,true,2,,1,,,MOULIN DE BAUDRY,36230,SARZAY,,,36210,,,,,,,,,,,,,,,,,,,2015-12-31,F,,,,,26.40Z,NAFRev2,N,1.903187,46.605729,0.93,housenumber,1 Moulin de Baudry 36230 Sarzay,36210_b179_00001,G,1 MOULIN DE BAUDRY,
348652686,00018,34865268600018,O,,NN,,,2021-05-05T10:53:58,true,1,,,,,VIGNONNET,36230,SARZAY,,,36210,,,,,,,,,,,,,,,,,,,1990-10-24,F,,,,,77.03,NAP,N,1.890166,46.590513,0.94,street,Vignonnet 36230 Sarzay,36210_84wfxq,G,VIGNONNET,
349571711,00028,34957171100028,O,2004-07-12,NN,,,2021-07-02T21:57:09,false,4,,3,,,LA PEROUSE,36230,SARZAY,,,36210,,,,,,,,,,,,,,,,,,,2017-12-31,F,,,,,47.89Z,NAFRev2,N,1.934701,46.620706,0.94,housenumber,3 La Perouse 36230 Sarzay,36210_gblvqe_00003,G,3 LA PEROUSE,
350650917,00015,35065091700015,O,1989-05-09,NN,,,2021-10-27T08:01:13,true,8,,9,,LD,LES ROBERTS,36230,SARZAY,,,36210,,,,,,,,,,,,,,,,,,,2019-11-13,A,,,,,43.32A,NAFRev2,N,1.905187,46.597208,0.94,housenumber,9 Les Roberts 36230 Sarzay,36210_6qy7if_00009,G,9 LES ROBERTS,
378328017,00017,37832801700017,O,1990-01-01,NN,,,,true,1,,,,,MONTGARNI,36230,SARZAY,,,36210,,,,,,,,,,,,,,,,,,,1992-11-29,F,,,,,01.3Z,NAF1993,N,1.907033,46.586165,0.94,street,Montgarni 36230 Sarzay,36210_6w46wa,G,MONTGARNI,
379177637,00012,37917763700012,O,1990-01-01,NN,,,2007-01-18T09:28:53,true,3,,,,,MONTGARNI,36230,SARZAY,,,36210,,,,,,,,,,,,,,,,,,,1996-12-25,F,,,,,01.2A,NAF1993,N,1.907033,46.586165,0.94,street,Montgarni 36230 Sarzay,36210_6w46wa,G,MONTGARNI,
381003367,00046,38100336700046,O,2000-01-01,NN,,,2011-04-23T07:22:59,false,5,,,,,LE PONDRON,36230,SARZAY,,,36210,,,,,,,,,,,,,,,,,,,2009-10-31,A,,,,,46.61Z,NAFRev2,N,1.886594,46.574777,0.67,street,La Gare du Pondron 36230 Sarzay,36210_B181,G,LA GARE DU PONDRON,
381003367,00053,38100336700053,O,1999-09-01,NN,,,2010-03-29T19:44:17,false,5,,,,,LES MOURIS,36230,SARZAY,,,36210,,,,,,,,,,,,,,,,,,,2010-04-01,F,,,,,46.61Z,NAFRev2,N,1.905605,46.602582,0.43,locality,Les Champs du Bourg 36230 Sarzay,36210_B082,G,LES CHAMPS DU BOURG,
381192640,00013,38119264000013,O,1991-01-14,NN,,,2006-12-15T00:41:53,false,3,,,,,LE VIGONNET,36230,SARZAY,,,36210,,,,,,,,,,,,,,,,,,,1993-09-30,F,,,,,51.1R,NAF1993,N,,,0,,,,,,
388142804,00011,38814280400011,O,1992-06-10,,,,,true,1,,,,,FRAGNE,36230,SARZAY,,,36210,,,,,,,,,,,,,,,,,,,1998-01-03,F,,,,,91.3E,NAF1993,N,1.912183,46.58258,0.93,street,Le Fragne 36230 Sarzay,36210_qed1jh,G,LE FRAGNE,
391600186,00012,39160018600012,O,1992-01-01,NN,,,2008-01-04T23:54:41,true,3,,,,,LES SADETS,36230,SARZAY,,,36210,,,,,,,,,,,,,,,,,,,2008-01-01,A,,,,,01.50Z,NAFRev2,N,1.898122,46.611724,0.94,street,Les Sadets 36230 Sarzay,36210_y6digu,G,LES SADETS,
392991378,00010,39299137800010,O,1992-06-01,NN,,,2008-01-05T00:11:15,true,3,LE BOURG,,,,CHATEAU DE SARZAY,36230,SARZAY,,,36210,,,,,,,,,,,,,,,,,,,2008-01-01,A,,,,,91.03Z,NAFRev2,N,1.905418,46.599922,0.72,street,Le Chateau 36230 Sarzay,36210_zd42ex,G,LE CHATEAU,
399121532,00010,39912153200010,O,1992-01-01,NN,,,2007-06-17T03:54:07,true,3,,,,,VIGNONNET,36230,SARZAY,,,36210,,,,,,,,,,,,,,,,,,,2006-04-19,F,,,,,01.1A,NAFRev1,N,1.890166,46.590513,0.94,street,Vignonnet 36230 Sarzay,36210_84wfxq,G,VIGNONNET,
403492184,00011,40349218400011,O,1994-01-01,NN,,,2007-01-18T09:37:50,true,3,,,,,LES SADETS,36230,SARZAY,,,36210,,,,,,,,,,,,,,,,,,,1998-12-25,F,,,,,01.3Z,NAF1993,N,1.898122,46.611724,0.94,street,Les Sadets 36230 Sarzay,36210_y6digu,G,LES SADETS,
404007551,00017,40400755100017,O,1996-01-01,NN,,,2016-04-26T03:43:19,true,4,,,,,LES SADETS,36230,SARZAY,,,36210,,,,,,,,,,,,,,,,,,,2012-12-31,A,,,,,01.50Z,NAFRev2,O,1.898122,46.611724,0.94,street,Les Sadets 36230 Sarzay,36210_y6digu,G,LES SADETS,
405281361,00015,40528136100015,O,1981-01-01,NN,,,2011-11-18T00:16:35,true,7,,2,,,FRAGNE,36230,SARZAY,,,36210,,,,,,,,,,,,,,,,,,,2009-11-11,F,,,,,01.42Z,NAFRev2,N,1.913037,46.577533,0.83,housenumber,2 Le Fragne 36230 Sarzay,36210_qed1jh_00002,G,2 LE FRAGNE,
405281379,00017,40528137900017,O,1984-12-31,NN,,,2022-01-31T08:25:50,true,3,PEYROUSE,,,,,36230,SARZAY,,,36210,,,,,,,,,,,,,,,,,,,2008-01-01,A,,,,,01.43Z,NAFRev2,N,1.934512,46.621185,0.61,street,La Perouse 36230 Sarzay,36210_gblvqe,D,LA PEROUSE,
405281387,00010,40528138700010,O,1982-12-31,NN,,,2008-01-04T20:53:00,true,3,LES SADETS,,,,,36230,SARZAY,,,36210,,,,,,,,,,,,,,,,,,,2008-01-01,A,,,,,01.11Z,NAFRev2,N,1.898122,46.611724,0.94,street,Les Sadets 36230 Sarzay,36210_y6digu,D,LES SADETS,
408213346,00013,40821334600013,O,1900-01-01,NN,,,2011-05-03T00:26:46,false,3,,,,,CHATEAU,36230,SARZAY,,,36210,,,,,,,,,,,,,,,,,,,1996-12-25,F,,,,,55.3B,NAF1993,N,1.905418,46.599922,0.92,street,Le Chateau 36230 Sarzay,36210_zd42ex,G,LE CHATEAU,
408989341,00016,40898934100016,O,1981-01-01,NN,,,2019-03-01T11:29:10,true,4,,,,,LE PONDERON,36230,SARZAY,,,36210,,,,,,,,,,,,,,,,,,,2018-07-01,A,,,,,01.11Z,NAFRev2,N,1.932584,46.614628,0.39,street,Le Chiron 36230 Sarzay,36210_gittj6,G,LE CHIRON,
409433745,00034,40943374500034,O,2003-02-01,,,,2008-01-04T21:26:49,true,5,,,,LD,LE PORTAIL,36230,SARZAY,,,36210,,,,,,,,,,,,,,,,,,,2008-01-01,A,,,,,55.20Z,NAFRev2,N,1.895413,46.599367,0.93,street,Le Portail 36230 Sarzay,36210_k511dt,G,LE PORTAIL,
409523206,00012,40952320600012,O,1996-09-25,NN,,,2008-01-05T20:24:43,true,3,,,,,LE BOURG,36230,SARZAY,,,36210,,,,,,,,,,,,,,,,,,,2008-01-01,A,,,,,68.20B,NAFRev2,N,1.905605,46.602582,0.71,locality,Les Champs du Bourg 36230 Sarzay,36210_B082,G,LES CHAMPS DU BOURG,
411727480,00013,41172748000013,O,1996-01-01,NN,,,,true,1,,,,,LES SADETS,36230,SARZAY,,,36210,,,,,,,,,,,,,,,,,,,2002-11-11,F,,,,,01.1A,NAF1993,N,1.898122,46.611724,0.94,street,Les Sadets 36230 Sarzay,36210_y6digu,G,LES SADETS,
415212109,00011,41521210900011,O,1997-06-01,NN,,,2008-01-04T23:00:53,true,4,,,,,CHENIL,36230,SARZAY,,,36210,,,,,,,,,,,,,,,,,,,2008-01-01,A,,,,,01.11Z,NAFRev2,N,1.921993,46.601768,0.91,locality,Le Petit Chenil 36230 Sarzay,36210_B208,G,LE PETIT CHENIL,
419130935,00010,41913093500010,O,1998-05-29,NN,,,2019-06-24T13:33:43,true,5,,,,LD,LE PONDERON,36230,SARZAY,,,36210,,,,,,,,,,,,,,,,,,,2018-06-30,F,,,,,01.11Z,NAFRev2,O,1.932584,46.614628,0.39,street,Le Chiron 36230 Sarzay,36210_gittj6,G,LE CHIRON,
422976639,00019,42297663900019,O,1991-12-31,,,,,true,1,,,,,LE VIGNONNET,36230,SARZAY,,,36210,,,,,,,,,,,,,,,,,,,1999-12-31,F,,,,,01.1A,NAF1993,N,1.893557,46.576966,0.79,street,Route de Vignonnet 36230 Sarzay,36210_0062,G,ROUTE DE VIGNONNET,
423124759,00022,42312475900022,O,2021-03-01,,,,2021-04-07T10:01:04,true,1,,26,B,LD,VIGNONNET,36230,SARZAY,,,36210,,,,,,,,,,,,,,,,,,,2021-03-01,A,,,,AF.DIAG-IMMO,71.20B,NAFRev2,N,1.889921,46.592598,0.94,housenumber,26b Vignonnet 36230 Sarzay,36210_84wfxq_00026_b,G,26B VIGNONNET,
425347325,00010,42534732500010,O,1987-01-01,NN,,,2020-03-31T03:38:08,true,3,,,,LD,LE PONDERON,36230,SARZAY,,,36210,,,,,,,,,,,,,,,,,,,2008-01-01,A,,,,,01.11Z,NAFRev2,N,1.932584,46.614628,0.39,street,Le Chiron 36230 Sarzay,36210_gittj6,G,LE CHIRON,
425347499,00013,42534749900013,O,1996-06-01,NN,,,2008-01-05T01:15:15,true,3,,,,,,36230,SARZAY,,,36210,,,,,,,,,,,,,,,,,,,2008-01-01,A,,,,,96.09Z,NAFRev2,N,,,0,,,,,,
428851984,00016,42885198400016,O,2000-01-01,NN,,,2018-12-06T10:24:24,true,4,,,,,LE VIGNONNET,36230,SARZAY,,,36210,,,,,,,,,,,,,,,,,,,2018-12-31,F,,,,,01.11Z,NAFRev2,N,1.893557,46.576966,0.79,street,Route de Vignonnet 36230 Sarzay,36210_0062,G,ROUTE DE VIGNONNET,
430879197,00019,43087919700019,O,1990-01-01,NN,,,2008-01-05T01:56:58,true,3,,,,,CHAMPEAU,36230,SARZAY,,,36210,,,,,,,,,,,,,,,,,,,2008-01-01,A,,,,,01.42Z,NAFRev2,N,1.934724,46.610515,0.83,street,Champeaux 36230 Sarzay,36210_uap1uh,G,CHAMPEAUX,
430879908,00019,43087990800019,O,1970-01-01,NN,,,2008-01-05T01:56:59,true,3,,,,,LA PEROUSE,36230,SARZAY,,,36210,,,,,,,,,,,,,,,,,,,2008-01-01,A,,,,,01.41Z,NAFRev2,N,1.934512,46.621185,0.94,street,La Perouse 36230 Sarzay,36210_gblvqe,G,LA PEROUSE,
430879916,00012,43087991600012,O,1981-01-01,NN,,,2008-01-05T01:56:59,true,3,,,,,VIGNONNET,36230,SARZAY,,,36210,,,,,,,,,,,,,,,,,,,2008-01-01,A,,,,,01.43Z,NAFRev2,N,1.890166,46.590513,0.94,street,Vignonnet 36230 Sarzay,36210_84wfxq,G,VIGNONNET,
432155422,00020,43215542200020,O,2002-03-27,NN,,,2010-09-29T16:16:44,true,5,LE PETIT CHENIL,17,,RTE,DE LA CHATRE,36230,SARZAY,,,36210,,,,,,,,,,,,,,,,,,,2010-06-30,F,,,,,47.81Z,NAFRev2,N,1.923178,46.600392,0.85,housenumber,17 Route de la Chatre 36230 Sarzay,36210_0010_00017,G,17 ROUTE DE LA CHATRE,
433964079,00019,43396407900019,O,2000-11-06,NN,,,2022-03-16T03:47:37,false,4,,,,,LES GROS,36230,SARZAY,,,36210,,,,,,,,,,,,,,,,,,,2022-01-11,F,,,,,68.20B,NAFRev2,N,1.924357,46.61709,0.94,street,Les Gros 36230 Sarzay,36210_wuqkmn,G,LES GROS,
437889173,00013,43788917300013,O,2000-11-25,NN,,,2011-04-06T10:44:15,false,4,,,,,LA FRAGNE,36230,SARZAY,,,36210,,,,,,,,,,,,,,,,,,,2009-06-25,F,,,,,94.99Z,NAFRev2,N,1.912183,46.58258,0.66,street,Le Fragne 36230 Sarzay,36210_qed1jh,G,LE FRAGNE,
438047391,00018,43804739100018,O,1992-01-01,NN,,,2009-11-27T05:20:27,true,4,,,,,VIGNONNET,36230,SARZAY,,,36210,,,,,,,,,,,,,,,,,,,2009-12-31,F,,,,,01.11Z,NAFRev2,N,1.890166,46.590513,0.94,street,Vignonnet 36230 Sarzay,36210_84wfxq,G,VIGNONNET,
439215880,00014,43921588000014,O,2001-09-06,NN,,,2016-04-26T03:04:34,true,4,MAIRIE,3,,PL,RAYMOND PLIQUE,36230,SARZAY,,,36210,,,,,,,,,,,,,,,,,,,2014-07-31,A,,,,,94.99Z,NAFRev2,N,1.904222,46.601686,0.84,housenumber,3 Place Raymond Plique 36230 Sarzay,36210_0050_00003,G,3 PLACE RAYMOND PLIQUE,
439455478,00016,43945547800016,O,2001-09-25,NN,,,2010-04-18T09:15:02,true,4,,,,,LE CHATEAU,36230,SARZAY,,,36210,,,,,,,,,,,,,,,,,,,2008-03-31,A,,,,,91.03Z,NAFRev2,N,1.905418,46.599922,0.93,street,Le Chateau 36230 Sarzay,36210_zd42ex,G,LE CHATEAU,
439742669,00013,43974266900013,O,2002-01-01,NN,,,2008-01-04T20:41:38,true,3,,6,,,LES ASSINES,36230,SARZAY,,,36210,,,,,,,,,,,,,,,,,,,2008-01-01,A,,,,,01.50Z,NAFRev2,N,1.921687,46.621049,0.93,housenumber,6 Les Assines 36230 Sarzay,36210_t0l7pj_00006,G,6 LES ASSINES,
440432938,00015,44043293800015,O,2001-12-15,NN,,,2008-11-08T02:10:37,true,3,LE BOURG,1,,RTE,DE NOHANT,36230,SARZAY,,,36210,,,,,,,,,,,,,,,,,,,2004-12-10,F,,,,,55.3A,NAFRev1,O,1.905277,46.601494,0.83,housenumber,1 Route de Nohant 36230 Sarzay,36210_0044_00001,G,1 ROUTE DE NOHANT,
440894590,00023,44089459000023,O,2001-12-23,NN,,,2018-07-06T16:06:35,true,3,,17,,RTE,DE LA CHATRE,36230,SARZAY,,,36210,,,,,,,,,,,,,,,,,,,2008-01-01,A,,,,,68.20B,NAFRev2,N,1.923178,46.600392,0.85,housenumber,17 Route de la Chatre 36230 Sarzay,36210_0010_00017,G,17 ROUTE DE LA CHATRE,
441326139,00017,44132613900017,O,2002-03-01,NN,,,2015-07-22T08:45:22,false,3,,5,,PL,RAYMOND PLIQUE,36230,SARZAY,,,36210,,,,,,,,,,,,,,,,,,,2003-11-26,F,,,,,45.4A,NAFRev1,N,1.904017,46.601816,0.84,housenumber,5 Place Raymond Plique 36230 Sarzay,36210_0050_00005,G,5 PLACE RAYMOND PLIQUE,
441818101,00012,44181810100012,O,2002-04-16,NN,,,2008-10-19T04:35:21,true,3,,,,,LE FRAGNE,36230,SARZAY,,,36210,,,,,,,,,,,,,,,,,,,2006-12-31,F,,,,,01.3Z,NAFRev1,N,1.912183,46.58258,0.94,street,Le Fragne 36230 Sarzay,36210_qed1jh,G,LE FRAGNE,
441860988,00019,44186098800019,O,2002-04-01,NN,,,2008-01-04T21:29:18,true,3,,,,,COTE NOIRE,36230,SARZAY,,,36210,,,,,,,,,,,,,,,,,,,2008-01-01,A,,,,,01.11Z,NAFRev2,N,1.916295,46.58716,0.92,street,La Cote Noire 36230 Sarzay,36210_B112,G,LA COTE NOIRE,
441935459,00012,44193545900012,O,1990-12-31,,,,2016-04-07T14:34:13,true,4,,,,,LES ROBERTS,36230,SARZAY,,,36210,,,,,,,,,,,,,,,,,,,2015-12-31,A,,,,,68.20B,NAFRev2,N,1.905202,46.597409,0.94,street,Les Roberts 36230 Sarzay,36210_6qy7if,G,LES ROBERTS,
442214706,00016,44221470600016,O,2002-06-01,NN,,4331ZB,2017-02-16T04:16:40,false,6,,5,,,LA PEROUSE,36230,SARZAY,,,36210,,,,,,,,,,,,,,,,,,,2017-01-01,F,,,,,43.31Z,NAFRev2,N,1.933763,46.620064,0.94,housenumber,5 La Perouse 36230 Sarzay,36210_gblvqe_00005,G,5 LA PEROUSE,
442346219,00011,44234621900011,O,2002-07-02,NN,,8121ZZ,2020-06-19T03:44:36,false,4,LE PONDERON,1,,RTE,DES COUTURES,36230,SARZAY,,,36210,,,,,,,,,,,,,,,,,,,2020-06-15,F,,,,,81.30Z,NAFRev2,N,1.892435,46.577358,0.84,housenumber,1 Route des Coutures 36230 Sarzay,36210_0012_00001,G,1 ROUTE DES COUTURES,
444227490,00018,44422749000018,O,2003-01-01,NN,,,2008-01-04T22:22:45,true,3,,,,,LE FRAGNE,36230,SARZAY,,,36210,,,,,,,,,,,,,,,,,,,2008-01-01,A,,,,,01.11Z,NAFRev2,N,1.912183,46.58258,0.94,street,Le Fragne 36230 Sarzay,36210_qed1jh,G,LE FRAGNE,
447521345,00010,44752134500010,O,2003-02-11,NN,,,2018-04-19T13:31:36,false,4,,,,,LE PORTAIL,36230,SARZAY,,,36210,,,,,,,,,,,,,,,,,,,2017-12-31,F,,,,,68.20B,NAFRev2,N,1.895413,46.599367,0.93,street,Le Portail 36230 Sarzay,36210_k511dt,G,LE PORTAIL,
448101907,00021,44810190700021,O,2016-03-15,,,4322AZ,2019-04-26T04:13:45,true,2,,20,B,,ROUTE DE LA GARE,36230,SARZAY,,,36210,,,,,,,,,,,,,,,,,,,2018-12-31,F,,,,,43.22A,NAFRev2,N,1.886467,46.574423,0.85,housenumber,20bis Route de la Gare 36230 Sarzay,36210_0030_00020_bis,G,20BIS ROUTE DE LA GARE,
448958702,00012,44895870200012,O,2003-04-29,NN,,,2008-01-05T21:26:10,true,3,,,,,LE CHATEAU,36230,SARZAY,,,36210,,,,,,,,,,,,,,,,,,,2008-01-01,A,,,,,68.20B,NAFRev2,N,1.905418,46.599922,0.93,street,Le Chateau 36230 Sarzay,36210_zd42ex,G,LE CHATEAU,
449940188,00013,44994018800013,O,2003-09-01,NN,,,2016-01-12T00:24:52,true,3,CHENIL,4,,RTE,DE NOHANT,36230,SARZAY,,,36210,,,,,,,,,,,,,,,,,,,2008-01-01,A,,,,,01.11Z,NAFRev2,N,1.918797,46.607921,0.83,housenumber,4 Route de Nohant 36230 Sarzay,36210_0044_00004,G,4 ROUTE DE NOHANT,
452086028,00019,45208602800019,O,2004-02-15,NN,,,2020-08-07T10:51:30,false,3,,4,,,LE PONDERON,36230,SARZAY,,,36210,,,,,,,,,,,,,,,,,,,2004-12-25,F,,,,,51.1T,NAFRev1,N,1.932584,46.614628,0.39,street,Le Chiron 36230 Sarzay,36210_gittj6,G,LE CHIRON,
477609044,00011,47760904400011,O,2004-06-15,NN,,,2018-11-15T08:42:12,true,3,,,,,LE CHATEAU,36230,SARZAY,,,36210,,,,,,,,,,,,,,,,,,,2008-01-01,A,,,,,68.20B,NAFRev2,N,1.905418,46.599922,0.93,street,Le Chateau 36230 Sarzay,36210_zd42ex,G,LE CHATEAU,
479564247,00019,47956424700019,O,2004-11-15,NN,,,2008-01-05T21:42:52,true,3,,1,,RTE,DE NOHANT,36230,SARZAY,,,36210,,,,,,,,,,,,,,,,,,,2008-01-01,A,,,,,68.20B,NAFRev2,N,1.905277,46.601494,0.83,housenumber,1 Route de Nohant 36230 Sarzay,36210_0044_00001,G,1 ROUTE DE NOHANT,
479607889,00017,47960788900017,O,2004-11-25,NN,,5610CQ,2020-08-25T10:23:24,true,5,,1,,RTE,DE NOHANT,36230,SARZAY,,,36210,,,,,,,,,,,,,,,,,,,2019-03-20,F,,,,,56.10A,NAFRev2,N,1.905277,46.601494,0.83,housenumber,1 Route de Nohant 36230 Sarzay,36210_0044_00001,G,1 ROUTE DE NOHANT,
488402892,00019,48840289200019,O,2006-01-01,03,2020,1071CB,2022-12-01T15:04:32,true,2,LE PETIT CHENIL,17,,RTE,DE LA CHATRE,36230,SARZAY,,,36210,,,,,,,,,,,,,,,,,,,2008-01-01,A,,,,,10.71C,NAFRev2,O,1.923178,46.600392,0.85,housenumber,17 Route de la Chatre 36230 Sarzay,36210_0010_00017,G,17 ROUTE DE LA CHATRE,
488402892,00027,48840289200027,O,2022-10-01,,,,2022-12-01T15:04:32,false,1,DOMAINE DU PETIT CHENIL,17,,RTE,DE LA CHATRE,36230,SARZAY,,,36210,,,,,,,,,,,,,,,,,,,2022-10-01,A,,,,,35.11Z,NAFRev2,N,1.923178,46.600392,0.85,housenumber,17 Route de la Chatre 36230 Sarzay,36210_0010_00017,G,17 ROUTE DE LA CHATRE,
489998880,00012,48999888000012,O,2006-04-20,NN,,,2020-08-25T10:34:44,false,3,,,,,VIGNONNET,36230,SARZAY,,,36210,,,,,,,,,,,,,,,,,,,2018-12-31,F,,,,,01.50Z,NAFRev2,O,1.890166,46.590513,0.94,street,Vignonnet 36230 Sarzay,36210_84wfxq,G,VIGNONNET,
492600291,00016,49260029100016,O,2006-11-01,,,,2009-03-05T15:31:13,true,3,ROUTE DES COUTURES,,,LD,LE PONDERON,36230,SARZAY,,,36210,,,,,,,,,,,,,,,,,,,2008-12-31,F,,,,,88.99B,NAFRev2,N,1.932584,46.614628,0.39,street,Le Chiron 36230 Sarzay,36210_gittj6,G,LE CHIRON,
494565112,00013,49456511200013,O,2006-11-18,,,,2008-01-05T05:13:42,true,2,,29,,,VIOLET,36230,SARZAY,,,36210,,,,,,,,,,,,,,,,,,,2007-06-30,F,,,,,01.3Z,NAFRev1,N,1.917134,46.596851,0.94,housenumber,29 Violet 36230 Sarzay,36210_b47u3u_00029,G,29 VIOLET,
497548149,00010,49754814900010,O,2007-05-01,NN,,,2020-09-10T03:47:43,false,3,,,,LD,BELLEVUE,36230,SARZAY,,,36210,,,,,,,,,,,,,,,,,,,2012-12-31,F,,,,,01.11Z,NAFRev2,N,1.883524,46.589851,0.94,street,Bellevue 36230 Sarzay,36210_4qjdio,G,BELLEVUE,
497961698,00014,49796169800014,O,2007-06-01,NN,,5610CQ,2021-02-23T14:05:32,true,4,,3,,PL,DES A.F.N.,36230,SARZAY,,,36210,,,,,,,,,,,,,,,,,,,2013-01-31,A,CAFE RESTAURANT DE LA VALLEE NOIRE,,,,56.30Z,NAFRev2,O,0.807251,47.3571195,0.76,poi.footway,Mail des Anciens d'Indochine et d'A.F.N. (Chemin piéton) Véretz,https://osm.org/way/219589523,G,,
508561248,00016,50856124800016,O,1992-06-19,,,,2008-10-15T13:02:01,true,1,,,,,MAIRIE,36230,SARZAY,,,36210,,,,,,,,,,,,,,,,,,,1992-06-19,A,,,,,94.99Z,NAFRev2,N,1.905364,46.599094,0.65,street,La Metairie 36230 Sarzay,36210_1259uy,G,LA METAIRIE,
509230751,00018,50923075100018,O,1992-06-19,,,,2008-12-01T15:06:42,true,1,,,,,SALLE POLYVALENTE,36230,SARZAY,,,36210,,,,,,,,,,,,,,,,,,,1992-06-19,A,,,,,93.12Z,NAFRev2,N,5.9758591,48.7270933,0.92,poi.community_centre,Salle polyvalente (Salle des fêtes) Villey-Saint-Étienne,https://osm.org/way/572194054,G,,