siren,nic,siret,statutDiffusionEtablissement,dateCreationEtablissement,trancheEffectifsEtablissement,anneeEffectifsEtablissement,activitePrincipaleRegistreMetiersEtablissement,dateDernierTraitementEtablissement,etablissementSiege,nombrePeriodesEtablissement,complementAdresseEtablissement,numeroVoieEtablissement,indiceRepetitionEtablissement,typeVoieEtablissement,libelleVoieEtablissement,codePostalEtablissement,libelleCommuneEtablissement,libelleCommuneEtrangerEtablissement,distributionSpecialeEtablissement,codeCommuneEtablissement,codeCedexEtablissement,libelleCedexEtablissement,codePaysEtrangerEtablissement,libellePaysEtrangerEtablissement,complementAdresse2Etablissement,numeroVoie2Etablissement,indiceRepetition2Etablissement,typeVoie2Etablissement,libelleVoie2Etablissement,codePostal2Etablissement,libelleCommune2Etablissement,libelleCommuneEtranger2Etablissement,distributionSpeciale2Etablissement,codeCommune2Etablissement,codeCedex2Etablissement,libelleCedex2Etablissement,codePaysEtranger2Etablissement,libellePaysEtranger2Etablissement,dateDebut,etatAdministratifEtablissement,enseigne1Etablissement,enseigne2Etablissement,enseigne3Etablissement,denominationUsuelleEtablissement,activitePrincipaleEtablissement,nomenclatureActivitePrincipaleEtablissement,caractereEmployeurEtablissement,longitude,latitude,geo_score,geo_type,geo_adresse,geo_id,geo_ligne,geo_l4,geo_l5
185703386,00010,18570338600010,O,1985-10-28,01,2020,,2022-08-29T09:04:10,true,3,,,,PL,SAINT MARTIN,57645,RETONFEY,,,57575,,,,,,,,,,,,,,,,,,,2008-01-01,A,,,,,94.91Z,NAFRev2,N,6.304788,49.134576,0.83,street,Place Saint Martin 57645 Retonfey,57575_0200,G,PLACE SAINT MARTIN,
215705757,00015,21570575700015,O,1983-03-01,11,2020,,2022-08-29T09:07:52,true,4,,8,,PL,SAINT MARTIN,57645,RETONFEY,,,57575,,,,,,,,,,,,,,,,,,,2008-01-01,A,MAIRIE,,,,84.11Z,NAFRev2,O,6.305221,49.134605,0.85,housenumber,8 Place Saint Martin 57645 Retonfey,57575_0200_00008,G,8 PLACE SAINT MARTIN,
215705757,00023,21570575700023,O,1983-12-21,02,2020,,2022-08-29T09:07:52,false,4,,,,RUE,DE LOMBEZ,57645,RETONFEY,,,57575,,,,,,,,,,,,,,,,,,,2021-12-25,A,ECOLE ELEMENTAIRE,,,,85.20Z,NAFRev2,N,6.307034,49.138009,0.95,street,Rue de Lombez 57645 Retonfey,57575_0195,G,RUE DE LOMBEZ,
215705757,00031,21570575700031,O,1983-12-21,01,2020,,2022-08-29T09:07:52,false,3,,7,,RUE,DE LOMBEZ,57645,RETONFEY,,,57575,,,,,,,,,,,,,,,,,,,2008-01-01,A,ECOLE MATERNELLE PUBLIQUE,,,,85.10Z,NAFRev2,N,6.307075,49.138389,0.95,housenumber,7 Rue de Lombez 57645 Retonfey,57575_0195_00007,G,7 RUE DE LOMBEZ,
215705757,00049,21570575700049,O,1998-01-01,NN,,,2019-07-25T12:01:31,false,4,MAIRIE,8,,PL,SAINT MARTIN,57645,RETONFEY,,,57575,,,,,,,,,,,,,,,,,,,2019-03-20,F,ZONE ARTISANALE,,,,42.99Z,NAFRev2,N,6.305221,49.134605,0.85,housenumber,8 Place Saint Martin 57645 Retonfey,57575_0200_00008,G,8 PLACE SAINT MARTIN,
215705757,00056,21570575700056,O,2014-07-16,NN,,,2021-02-23T10:32:52,false,1,,8,,PL,SAINT MARTIN,57645,RETONFEY,,,57575,,,,,,,,,,,,,,,,,,,2014-07-16,A,ENERGIE PHOTOVOLTAIQUE,,,,35.11Z,NAFRev2,N,6.305221,49.134605,0.85,housenumber,8 Place Saint Martin 57645 Retonfey,57575_0200_00008,G,8 PLACE SAINT MARTIN,
265703215,00011,26570321500011,O,1995-01-01,NN,,,2020-11-09T14:02:01,true,4,MAIRIE,8,,PL,SAINT MARTIN,57645,RETONFEY,,,57575,,,,,,,,,,,,,,,,,,,2020-06-30,F,CCAS,,,,88.99B,NAFRev2,N,6.305221,49.134605,0.85,housenumber,8 Place Saint Martin 57645 Retonfey,57575_0200_00008,G,8 PLACE SAINT MARTIN,
295701965,00010,29570196500010,O,,NN,,,2006-11-25T09:10:51,true,1,,,,,,57645,RETONFEY,,,57575,,,,,,,,,,,,,,,,,,,1988-12-25,F,,,,,90.12,NAP,N,,,0,,,,,,
301294989,00019,30129498900019,O,1900-01-01,NN,,,2008-01-04T19:14:18,true,3,,,,,,57645,RETONFEY,,,57575,,,,,,,,,,,,,,,,,,,2008-01-01,A,,,,,88.99B,NAFRev2,N,,,0,,,,,,
301561767,00015,30156176700015,O,,NN,,,,true,1,,44,,RUE,DES FONTAINES,57645,RETONFEY,,,57575,,,,,,,,,,,,,,,,,,,1993-03-04,F,,,,,51.1R,NAF1993,N,6.309857,49.138353,0.96,housenumber,44 Rue des Fontaines 57645 Retonfey,57575_0120_00044,G,44 RUE DES FONTAINES,
301832689,00030,30183268900030,O,2018-05-21,,,4932ZB,2021-02-23T10:36:05,true,1,,1,,PL,DU GUE,57645,RETONFEY,,,57575,,,,,,,,,,,,,,,,,,,2018-05-21,A,,,,STANDING-VTC-GRANDEST,49.32Z,NAFRev2,N,6.308276,49.134572,0.8,housenumber,1 Place du Gue 57645 Retonfey,57575_0140_00001,G,1 PLACE DU GUE,
303815666,00019,30381566600019,O,1975-01-01,NN,,,2021-03-24T03:37:24,true,6,,58,,RUE,TINCHOTTE,57645,RETONFEY,,,57575,,,,,,,,,,,,,,,,,,,2021-01-31,F,,,,,68.20B,NAFRev2,N,6.312733,49.137985,0.69,housenumber,58 La Tinchotte 57645 Retonfey,57575_pu81aa_00058,G,58 LA TINCHOTTE,
303890123,00035,30389012300035,O,1995-06-01,NN,,,2012-06-07T10:47:17,false,4,,,,,ZONE ARTISANALE,57645,RETONFEY,,,57575,,,,,,,,,,,,,,,,,,,2012-04-13,F,,,,,52.10B,NAFRev2,N,6.316695,49.133803,0.95,street,Zone Artisanale 57645 Retonfey,57575_B085,G,ZONE ARTISANALE,
304172539,00013,30417253900013,O,1975-01-01,NN,,,,true,1,,5,,RUE,DE LA SCIE,57645,RETONFEY,,,57575,,,,,,,,,,,,,,,,,,,2002-12-31,F,,,,,50.1Z,NAF1993,N,6.307985,49.135799,0.95,housenumber,5 Rue de la Scie 57645 Retonfey,57575_0235_00005,G,5 RUE DE LA SCIE,
304989601,00022,30498960100022,O,,NN,,,,true,1,,1,,RUE,DES BLEUETS,57645,RETONFEY,,,57575,,,,,,,,,,,,,,,,,,,1989-12-31,F,,,,,64.11,NAP,N,6.30141,49.139138,0.95,housenumber,1 Rue des Bleuets 57645 Retonfey,57575_0030_00001,G,1 RUE DES BLEUETS,
307294884,00050,30729488400050,O,1997-09-01,NN,,,2009-11-25T08:56:50,false,4,,21,A,RUE,DES FONTAINES,57645,RETONFEY,,,57575,,,,,,,,,,,,,,,,,,,2008-01-01,F,,,,,47.89Z,NAFRev2,N,6.30836,49.137239,0.96,housenumber,21a Rue des Fontaines 57645 Retonfey,57575_0120_00021_a,G,21A RUE DES FONTAINES,
312708480,00024,31270848000024,O,1900-01-01,NN,,,2008-11-07T00:27:52,false,4,,3,,RUE,DES FONTAINES,57645,RETONFEY,,,57575,,,,,,,,,,,,,,,,,,,2000-02-21,F,,,,,45.4C,NAF1993,O,6.305346,49.13548,0.96,housenumber,3 Rue des Fontaines 57645 Retonfey,57575_0120_00003,G,3 RUE DES FONTAINES,
313103004,00013,31310300400013,O,,,,,,true,1,,8,,RUE,DES TISSERANDS,57645,RETONFEY,,,57575,,,,,,,,,,,,,,,,,,,1985-12-25,F,,,,,21.08,NAP,N,6.306937,49.134088,0.95,housenumber,8 Rue des Tisserands 57645 Retonfey,57575_0240_00008,G,8 RUE DES TISSERANDS,
313165151,00058,31316515100058,O,1993-01-01,NN,,,2017-10-25T15:23:28,false,5,,4,B,RUE,DE LA TOURNAILLE,57645,RETONFEY,,,57575,,,,,,,,,,,,,,,,,,,2016-10-21,F,,,,,68.20B,NAFRev2,N,6.301737,49.136395,0.87,housenumber,4bis Rue de la Tournaille 57645 Retonfey,57575_0243_00004_bis,G,4BIS RUE DE LA TOURNAILLE,
314801242,00012,31480124200012,O,1900-01-01,,,,2018-01-09T12:10:55,true,5,,2,,RUE,DES ROSES,57645,RETONFEY,,,57575,,,,,,,,,,,,,,,,,,,2017-12-24,F,,,,,82.99Z,NAFRev2,N,6.300964,49.139051,0.95,housenumber,2 Rue des Roses 57645 Retonfey,57575_0230_00002,G,2 RUE DES ROSES,
315812669,00028,31581266900028,O,,NN,,,,true,1,,,,,ZONE ARTISANALE,57645,RETONFEY,,,57575,,,,,,,,,,,,,,,,,,,1989-02-12,F,,,,,55.73,NAP,N,6.316695,49.133803,0.95,street,Zone Artisanale 57645 Retonfey,57575_B085,G,ZONE ARTISANALE,
317497766,00012,31749776600012,O,1979-01-01,NN,,,2019-01-10T19:35:27,true,4,,17,,RUE,DES FONTAINES,57645,RETONFEY,,,57575,,,,,,,,,,,,,,,,,,,2018-12-31,F,,,,,43.99C,NAFRev2,N,6.307657,49.136878,0.96,housenumber,17 Rue des Fontaines 57645 Retonfey,57575_0120_00017,G,17 RUE DES FONTAINES,
317504918,00010,31750491800010,O,1979-01-01,NN,,4399CZ,2019-01-25T19:35:05,true,4,,17,,RUE,DES FONTAINES,57645,RETONFEY,,,57575,,,,,,,,,,,,,,,,,,,2009-12-25,F,,,,,43.99C,NAFRev2,N,6.307657,49.136878,0.96,housenumber,17 Rue des Fontaines 57645 Retonfey,57575_0120_00017,G,17 RUE DES FONTAINES,
317504926,00013,31750492600013,O,1979-01-01,NN,,4399CZ,2019-01-31T10:17:54,true,4,,17,,RUE,DES FONTAINES,57645,RETONFEY,,,57575,,,,,,,,,,,,,,,,,,,2018-12-31,F,,,,,43.99C,NAFRev2,N,6.307657,49.136878,0.96,housenumber,17 Rue des Fontaines 57645 Retonfey,57575_0120_00017,G,17 RUE DES FONTAINES,
317551406,00018,31755140600018,O,,NN,,,,true,1,,23,,RUE,DE METZ,57645,RETONFEY,,,57575,,,,,,,,,,,,,,,,,,,1996-12-31,F,,,,,45.3A,NAF1993,N,6.302255,49.136901,0.95,housenumber,23 Rue de Metz 57645 Retonfey,57575_0197_00023,G,23 RUE DE METZ,
317800654,00020,31780065400020,O,1900-01-01,NN,,,2013-02-27T09:59:03,false,3,,8,,RUE,DES TISSERANDS,57645,RETONFEY,,,57575,,,,,,,,,,,,,,,,,,,1990-12-31,F,,,,,51.10,NAP,N,6.306937,49.134088,0.95,housenumber,8 Rue des Tisserands 57645 Retonfey,57575_0240_00008,G,8 RUE DES TISSERANDS,
318374329,00015,31837432900015,O,,NN,,,,true,1,,11,,PL,DU GUE,57645,RETONFEY,,,57575,,,,,,,,,,,,,,,,,,,1995-12-25,F,,,,,52.6G,NAF1993,N,6.307879,49.135316,0.81,housenumber,11 Place du Gue 57645 Retonfey,57575_0140_00011,G,11 PLACE DU GUE,
318807823,00022,31880782300022,O,1989-12-31,,,,2008-11-07T00:34:37,true,4,,,,,ZONE ARTISANALE,57645,RETONFEY,,,57575,,,,,,,,,,,,,,,,,,,1995-08-23,F,,,,,71.3C,NAF1993,N,6.316695,49.133803,0.95,street,Zone Artisanale 57645 Retonfey,57575_B085,G,ZONE ARTISANALE,
319979209,00016,31997920900016,O,,,,,,true,1,,3,,IMP,DES IRIS,57645,RETONFEY,,,57575,,,,,,,,,,,,,,,,,,,1990-01-02,F,,,,,60.2E,NAF1993,N,6.301976,49.140035,0.82,housenumber,3 Impasse des Iris 57645 Retonfey,57575_0185_00003,G,3 IMPASSE DES IRIS,
319997995,00034,31999799500034,O,,NN,,,,true,1,,,,,ZONE ARTISANALE,57645,RETONFEY,,,57575,,,,,,,,,,,,,,,,,,,1991-01-01,F,,,,,45.2V,NAF1993,N,6.316695,49.133803,0.95,street,Zone Artisanale 57645 Retonfey,57575_B085,G,ZONE ARTISANALE,
320494040,00035,32049404000035,O,1994-06-10,NN,,,2006-11-25T09:47:21,false,3,,11,,RUE,DE LA TINCHOTTE,57645,RETONFEY,,,57575,,,,,,,,,,,,,,,,,,,2003-03-31,F,,,,,52.6D,NAFRev1,N,6.310949,49.138539,0.67,housenumber,11 La Tinchotte 57645 Retonfey,57575_pu81aa_00011,G,11 LA TINCHOTTE,
322366527,00016,32236652700016,O,,,,,2006-11-25T09:51:41,true,1,,71,,RUE,DE LA TRUCHOTTE,57645,RETONFEY,,,57575,,,,,,,,,,,,,,,,,,,1986-12-31,F,,,,,86.10,NAP,N,6.31335,49.137795,0.51,housenumber,71 La Tinchotte 57645 Retonfey,57575_pu81aa_00071,G,71 LA TINCHOTTE,
323338038,00017,32333803800017,O,1981-11-01,NN,,,,true,3,,,,,ZONE ARTISANALE,57645,RETONFEY,,,57575,,,,,,,,,,,,,,,,,,,1992-07-23,F,,,,,93.0B,NAF1993,N,6.316695,49.133803,0.95,street,Zone Artisanale 57645 Retonfey,57575_B085,G,ZONE ARTISANALE,
324418110,00122,32441811000122,O,2009-01-01,01,2020,,2022-08-29T09:18:23,false,3,LES CASTORS JOUEURS,7,,RUE,DE LOMBEZ,57645,RETONFEY,,,57575,,,,,,,,,,,,,,,,,,,2020-12-31,F,ACCUEIL PERISCOLAIRE ADPEP 57,,,,88.91A,NAFRev2,O,6.307075,49.138389,0.95,housenumber,7 Rue de Lombez 57645 Retonfey,57575_0195_00007,G,7 RUE DE LOMBEZ,
326249133,00025,32624913300025,O,1990-08-02,NN,,,,false,3,,1,,RUE,DES BLEUETS,57645,RETONFEY,,,57575,,,,,,,,,,,,,,,,,,,1992-02-01,F,,,,,52.6E,NAF1993,N,6.30141,49.139138,0.95,housenumber,1 Rue des Bleuets 57645 Retonfey,57575_0030_00001,G,1 RUE DES BLEUETS,
326446218,00017,32644621800017,O,1983-01-20,NN,,,,true,3,,,,,ZONE ARTISANALE,57645,RETONFEY,,,57575,,,,,,,,,,,,,,,,,,,1993-12-25,F,,,,,36.3Z,NAF1993,N,6.316695,49.133803,0.95,street,Zone Artisanale 57645 Retonfey,57575_B085,G,ZONE ARTISANALE,
326699071,00022,32669907100022,O,1994-11-01,01,2020,,2022-08-29T09:19:26,true,3,,1,,,PETIT MARAIS,57645,RETONFEY,,,57575,,,,,,,,,,,,,,,,,,,2008-01-01,A,,,,,01.50Z,NAFRev2,N,6.311601,49.146342,0.94,housenumber,1 Petit Marais 57645 Retonfey,57575_4anz1w_00001,G,1 PETIT MARAIS,
326808243,00017,32680824300017,O,,,,,,true,1,,16,,CHE,DES VIGNES,57645,RETONFEY,,,57575,,,,,,,,,,,,,,,,,,,1984-12-25,F,,,,,65.01,NAP,N,6.302936,49.132762,0.84,housenumber,16 Chemin des Vignes 57645 Retonfey,57575_0250_00016,G,16 CHEMIN DES VIGNES,
327497954,00021,32749795400021,O,2002-11-04,NN,,,2008-11-07T00:45:08,true,4,,53,,,LA TINCHOTTE,57645,RETONFEY,,,57575,,,,,,,,,,,,,,,,,,,2003-05-31,F,,,,,45.4F,NAFRev1,N,6.312593,49.137613,0.96,housenumber,53 La Tinchotte 57645 Retonfey,57575_pu81aa_00053,G,53 LA TINCHOTTE,
327650644,00039,32765064400039,O,2006-04-15,,,,2009-09-23T05:39:38,true,3,,2,,RUE,DES ROSES,57645,RETONFEY,,,57575,,,,,,,,,,,,,,,,,,,2009-08-31,F,,,,,47.89Z,NAFRev2,N,6.300964,49.139051,0.95,housenumber,2 Rue des Roses 57645 Retonfey,57575_0230_00002,G,2 RUE DES ROSES,
328095930,00041,32809593000041,O,2001-03-01,NN,,4332BB,2015-03-18T01:01:24,true,6,,4,,RUE,DES TISSERANDS,57645,RETONFEY,,,57575,,,,,,,,,,,,,,,,,,,2013-12-31,F,,,,,43.32B,NAFRev2,N,6.307155,49.134323,0.95,housenumber,4 Rue des Tisserands 57645 Retonfey,57575_0240_00004,G,4 RUE DES TISSERANDS,
328939780,00032,32893978000032,O,1988-07-01,NN,,,,true,1,,18,B,RUE,LA TINCHOTTE,57645,RETONFEY,,,57575,,,,,,,,,,,,,,,,,,,2001-09-30,F,,,,,85.1G,NAF1993,N,6.31127,49.13777,0.71,housenumber,18bis La Tinchotte 57645 Retonfey,57575_pu81aa_00018_bis,G,18BIS LA TINCHOTTE,
329558845,00023,32955884500023,O,1986-12-01,NN,,4391BZ,2021-03-23T19:32:18,true,7,ZA,,,RTE,DE COLLIGNY,57645,RETONFEY,,,57575,,,,,,,,,,,,,,,,,,,2012-02-01,F,,,,,43.91B,NAFRev2,O,6.308505,49.134075,0.84,street,Route de Colligny 57645 Retonfey,57575_5zvua7,G,ROUTE DE COLLIGNY,
330029091,00015,33002909100015,O,1984-05-07,NN,,,,true,1,,9,,RUE,DES BLEUETS,57645,RETONFEY,,,57575,,,,,,,,,,,,,,,,,,,1997-11-29,F,,,,,74.1C,NAF1993,N,6.302591,49.140347,0.95,housenumber,9 Rue des Bleuets 57645 Retonfey,57575_0030_00009,G,9 RUE DES BLEUETS,
331372243,00013,33137224300013,O,1985-01-01,NN,,,2019-12-23T10:56:03,false,3,,,,,FAISANDERIE DE VAUDREVILLE,57645,RETONFEY,,,57575,,,,,,,,,,,,,,,,,,,1998-12-25,F,,,,,01.2J,NAF1993,N,6.331605,49.12541,0.5,street,Vaudreville 57645 Retonfey,57575_8o4mlb,G,VAUDREVILLE,
332811223,00020,33281122300020,O,,,,,,true,1,,15,B,RUE,DES FONTAINES,57645,RETONFEY,,,57575,,,,,,,,,,,,,,,,,,,1988-03-31,F,,,,,62.41,NAP,N,6.307259,49.136682,0.87,housenumber,15bis Rue des Fontaines 57645 Retonfey,57575_0120_00015_bis,G,15BIS RUE DES FONTAINES,
332971225,00013,33297122500013,O,,NN,,,,true,1,,35,,RUE,DES FONTAINES,57645,RETONFEY,,,57575,,,,,,,,,,,,,,,,,,,1987-12-01,F,,,,,69.11,NAP,N,6.310318,49.13788,0.96,housenumber,35 Rue des Fontaines 57645 Retonfey,57575_0120_00035,G,35 RUE DES FONTAINES,
333525921,00024,33352592100024,O,1987-06-01,NN,,,2019-02-08T03:51:53,true,7,,4,,RUE,DES FONTAINES,57645,RETONFEY,,,57575,,,,,,,,,,,,,,,,,,,2018-09-30,F,,,,,49.41A,NAFRev2,O,6.305263,49.135621,0.96,housenumber,4 Rue des Fontaines 57645 Retonfey,57575_0120_00004,G,4 RUE DES FONTAINES,
334874484,00010,33487448400010,O,1986-02-21,NN,,,,true,4,,17,,RUE,DES FONTAINES,57645,RETONFEY,,,57575,,,,,,,,,,,,,,,,,,,1992-09-28,F,,,,,52.1B,NAF1993,N,6.307657,49.136878,0.96,housenumber,17 Rue des Fontaines 57645 Retonfey,57575_0120_00017,G,17 RUE DES FONTAINES,
337832596,00023,33783259600023,O,,NN,,,,true,1,,10,,RUE,DES FONTAINES,57645,RETONFEY,,,57575,,,,,,,,,,,,,,,,,,,1989-12-31,F,,,,,67.04,NAP,N,6.306285,49.136,0.96,housenumber,10 Rue des Fontaines 57645 Retonfey,57575_0120_00010,G,10 RUE DES FONTAINES,
337884175,00015,33788417500015,O,,NN,,,,true,1,,10,,RUE,DES FONTAINES,57645,RETONFEY,,,57575,,,,,,,,,,,,,,,,,,,1988-03-01,F,,,,,67.04,NAP,N,6.306285,49.136,0.96,housenumber,10 Rue des Fontaines 57645 Retonfey,57575_0120_00010,G,10 RUE DES FONTAINES,
338195621,00010,33819562100010,O,1986-04-28,NN,,,2008-01-04T21:17:53,true,3,,,,RUE,DE LA SCIE,57645,RETONFEY,,,57575,,,,,,,,,,,,,,,,,,,2008-01-01,A,,,,,68.20A,NAFRev2,N,6.308167,49.136126,0.95,street,Rue de la Scie 57645 Retonfey,57575_0235,G,RUE DE LA SCIE,
339562654,00014,33956265400014,O,1986-10-01,01,2020,,2022-08-29T09:25:42,true,4,,2,,PL,SAINT MARTIN,57645,RETONFEY,,,57575,,,,,,,,,,,,,,,,,,,2008-01-01,A,,,,,94.99Z,NAFRev2,O,6.304355,49.134618,0.85,housenumber,2 Place Saint Martin 57645 Retonfey,57575_0200_00002,G,2 PLACE SAINT MARTIN,
340169234,00010,34016923400010,O,,NN,,,,true,1,,1,,PL,DU CALVAIRE,57645,RETONFEY,,,57575,,,,,,,,,,,,,,,,,,,1995-12-25,F,,,,,52.6G,NAF1993,N,6.308287,49.135995,0.84,housenumber,1 Place du Calvaire 57645 Retonfey,57575_0036_00001,G,1 PLACE DU CALVAIRE,
340947274,00023,34094727400023,O,,,,,,true,1,,50,,RUE,DES FONTAINES,57645,RETONFEY,,,57575,,,,,,,,,,,,,,,,,,,1992-03-31,F,,,,,45.4J,NAF1993,N,6.310495,49.138715,0.96,housenumber,50 Rue des Fontaines 57645 Retonfey,57575_0120_00050,G,50 RUE DES FONTAINES,
341009124,00015,34100912400015,O,,NN,,,,true,1,,6,,RUE,DES BLEUETS,57645,RETONFEY,,,57575,,,,,,,,,,,,,,,,,,,1992-06-01,F,,,,,52.6D,NAF1993,N,6.302265,49.139517,0.95,housenumber,6 Rue des Bleuets 57645 Retonfey,57575_0030_00006,G,6 RUE DES BLEUETS,
341179356,00017,34117935600017,O,1987-05-01,NN,,,2008-01-05T19:33:09,true,3,,,,,ZONE ARTISANALE,57645,RETONFEY,,,57575,,,,,,,,,,,,,,,,,,,2008-01-01,A,,,,,68.20B,NAFRev2,N,6.316695,49.133803,0.95,street,Zone Artisanale 57645 Retonfey,57575_B085,G,ZONE ARTISANALE,
341486421,00017,34148642100017,O,,,,,,true,1,,5,,RUE,DES FONTAINES,57645,RETONFEY,,,57575,,,,,,,,,,,,,,,,,,,1997-12-31,F,,,,,45.4J,NAF1993,N,6.305932,49.135733,0.96,housenumber,5 Rue des Fontaines 57645 Retonfey,57575_0120_00005,G,5 RUE DES FONTAINES,
342575487,00026,34257548700026,O,2004-09-24,,,9602AB,2020-01-02T19:34:44,true,4,,62,,RUE,DE LA TINCHOTTE,57645,RETONFEY,,,57575,,,,,,,,,,,,,,,,,,,2019-12-31,F,,,,,96.02A,NAFRev2,N,6.31303,49.138627,0.67,housenumber,62 La Tinchotte 57645 Retonfey,57575_pu81aa_00062,G,62 LA TINCHOTTE,
343196309,00037,34319630900037,O,1989-08-01,NN,,,2021-08-30T11:14:28,false,4,,10,B,RUE,DES FONTAINES,57645,RETONFEY,,,57575,,,,,,,,,,,,,,,,,,,2021-08-01,F,,,,,86.21Z,NAFRev2,N,6.306313,49.136004,0.87,housenumber,10bis Rue des Fontaines 57645 Retonfey,57575_0120_00010_bis,G,10BIS RUE DES FONTAINES,
344103668,00044,34410366800044,O,1999-11-01,NN,,,2018-08-31T09:23:04,false,6,,5,A,RUE,HAUT DE VEAUX,57645,RETONFEY,,,57575,,,,,,,,,,,,,,,,,,,2018-08-01,F,,,,,85.52Z,NAFRev2,N,6.302975,49.135245,0.95,housenumber,5a Rue Haut de Veaux 57645 Retonfey,57575_0157_00005_a,G,5A RUE HAUT DE VEAUX,
344587126,00014,34458712600014,O,,NN,,,,true,1,,,,,ZONE ARTISANALE,57645,RETONFEY,,,57575,,,,,,,,,,,,,,,,,,,1990-04-30,F,,,,,49.01,NAP,N,6.316695,49.133803,0.95,street,Zone Artisanale 57645 Retonfey,57575_B085,G,ZONE ARTISANALE,
344587274,00012,34458727400012,O,,NN,,,,true,1,,,,,ZONE ARTISANALE,57645,RETONFEY,,,57575,,,,,,,,,,,,,,,,,,,1990-04-30,F,,,,,49.01,NAP,N,6.316695,49.133803,0.95,street,Zone Artisanale 57645 Retonfey,57575_B085,G,ZONE ARTISANALE,
344587373,00012,34458737300012,O,,NN,,,,true,1,,,,,ZONE ARTISANALE,57645,RETONFEY,,,57575,,,,,,,,,,,,,,,,,,,1990-09-30,F,,,,,49.01,NAP,N,6.316695,49.133803,0.95,street,Zone Artisanale 57645 Retonfey,57575_B085,G,ZONE ARTISANALE,
344588975,00021,34458897500021,O,2008-06-02,,,,2010-12-10T20:19:37,true,2,LE PETIT MARAIS,,,,,57645,RETONFEY,,,57575,,,,,,,,,,,,,,,,,,,2010-09-30,F,,,,,47.78C,NAFRev2,N,6.31227,49.145998,0.79,street,Petit Marais 57645 Retonfey,57575_4anz1w,D,PETIT MARAIS,
344742499,00017,34474249900017,O,1988-04-22,NN,,,2008-01-04T22:32:03,true,3,,10,,RUE,DES FONTAINES,57645,RETONFEY,,,57575,,,,,,,,,,,,,,,,,,,2008-01-01,A,,,,,68.20A,NAFRev2,N,6.306285,49.136,0.96,housenumber,10 Rue des Fontaines 57645 Retonfey,57575_0120_00010,G,10 RUE DES FONTAINES,
347885519,00046,34788551900046,O,2000-08-01,NN,,,2008-11-08T00:21:56,false,4,,8,,RUE,DES TISSERANDS,57645,RETONFEY,,,57575,,,,,,,,,,,,,,,,,,,2004-12-31,F,,,,,29.2D,NAFRev1,N,6.306937,49.134088,0.95,housenumber,8 Rue des Tisserands 57645 Retonfey,57575_0240_00008,G,8 RUE DES TISSERANDS,
347909178,00019,34790917800019,O,1988-04-16,NN,,,2008-01-04T22:45:49,true,3,,,,,,57645,RETONFEY,,,57575,,,,,,,,,,,,,,,,,,,2008-01-01,A,,,,,02.40Z,NAFRev2,N,,,0,,,,,,
348410929,00015,34841092900015,O,1988-10-10,,,,,false,4,,,,,ZONE ARTISANALE,57645,RETONFEY,,,57575,,,,,,,,,,,,,,,,,,,1992-12-25,F,,,,,51.1R,NAF1993,N,6.316695,49.133803,0.95,street,Zone Artisanale 57645 Retonfey,57575_B085,G,ZONE ARTISANALE,
348428715,00034,34842871500034,O,2010-07-01,,,,2012-11-09T00:39:34,false,1,Z A,5,,RTE,DE COLLIGNY,57645,RETONFEY,,,57575,,,,,,,,,,,,,,,,,,,2010-07-01,F,,,,,74.90A,NAFRev2,N,6.308932,49.133694,0.85,housenumber,5 Route de Colligny 57645 Retonfey,57575_5zvua7_00005,G,5 ROUTE DE COLLIGNY,
349080580,00013,34908058000013,O,1988-12-19,NN,,,2019-06-05T13:59:26,true,4,,2,,RUE,DES LILAS,57645,RETONFEY,,,57575,,,,,,,,,,,,,,,,,,,2019-04-30,F,,,,,68.20A,NAFRev2,N,6.304046,49.139633,0.95,housenumber,2 Rue des Lilas 57645 Retonfey,57575_0190_00002,G,2 RUE DES LILAS,
350783098,00014,35078309800014,O,1981-01-12,NN,,,2006-11-25T11:06:56,true,3,,14,,RUE,DES JARDINS,57645,RETONFEY,,,57575,,,,,,,,,,,,,,,,,,,2005-06-30,F,,,,,74.2A,NAFRev1,N,6.310607,49.13664,0.95,housenumber,14 Rue des Jardins 57645 Retonfey,57575_0180_00014,G,14 RUE DES JARDINS,
351307897,00055,35130789700055,O,2020-02-25,,,4399CZ,2021-02-23T11:03:55,true,1,,21,,RUE,DE HAUT DE VEAUX,57645,RETONFEY,,,57575,,,,,,,,,,,,,,,,,,,2020-02-25,A,,,,LAURAIN,43.99C,NAFRev2,N,6.301176,49.13351,0.92,housenumber,21 Rue Haut de Veaux 57645 Retonfey,57575_0157_00021,G,21 RUE HAUT DE VEAUX,
352940811,00016,35294081100016,O,1989-12-01,NN,,,2020-03-13T03:37:45,false,4,,,,,FERME DU PETIT MARAIS,57645,RETONFEY,,,57575,,,,,,,,,,,,,,,,,,,2020-02-01,F,,,,,01.11Z,NAFRev2,N,6.31227,49.145998,0.61,street,Petit Marais 57645 Retonfey,57575_4anz1w,G,PETIT MARAIS,
353208770,00019,35320877000019,O,,NN,,,,true,1,,31,,RUE,DES FONTAINES,57645,RETONFEY,,,57575,,,,,,,,,,,,,,,,,,,1994-12-31,F,,,,,70.2A,NAF1993,N,6.309599,49.138123,0.96,housenumber,31 Rue des Fontaines 57645 Retonfey,57575_0120_00031,G,31 RUE DES FONTAINES,
353493000,00015,35349300000015,O,1989-12-18,NN,,,,false,3,MR MATHEIS JEAN,1,,RUE,DES TULIPES,57645,RETONFEY,,,57575,,,,,,,,,,,,,,,,,,,2003-01-02,F,,,,,70.2C,NAFRev1,N,6.304798,49.13902,0.95,housenumber,1 Rue des Tulipes 57645 Retonfey,57575_0245_00001,G,1 RUE DES TULIPES,
364800847,00022,36480084700022,O,1964-07-01,NN,,,2014-07-08T00:59:41,false,5,,,,,ZONE ARTISANALE,57645,RETONFEY,,,57575,,,,,,,,,,,,,,,,,,,2010-06-01,F,,,,,43.22B,NAFRev2,O,6.316695,49.133803,0.95,street,Zone Artisanale 57645 Retonfey,57575_B085,G,ZONE ARTISANALE,
368700308,00027,36870030800027,O,1900-01-01,NN,,,2008-01-04T21:02:34,true,3,,10,,RUE,DES FONTAINES,57645,RETONFEY,,,57575,,,,,,,,,,,,,,,,,,,2008-01-01,A,,,,,68.20B,NAFRev2,N,6.306285,49.136,0.96,housenumber,10 Rue des Fontaines 57645 Retonfey,57575_0120_00010,G,10 RUE DES FONTAINES,
370701146,00018,37070114600018,O,,,,,,true,1,,34,,RUE,HAUTE,57645,RETONFEY,,,57575,,,,,,,,,,,,,,,,,,,1984-12-25,F,,,,,62.46,NAP,N,6.307422,49.136883,0.48,street,R Haute 57645 Retonfey,57575_0160,G,R HAUTE,
378165112,00020,37816511200020,O,1996-05-21,NN,,,2006-10-28T00:19:10,false,3,MR PERNETTA,21,,RUE,DES FONTAINES,57645,RETONFEY,,,57575,,,,,,,,,,,,,,,,,,,2005-01-01,F,,,,,70.2A,NAFRev1,N,6.308223,49.13716,0.96,housenumber,21 Rue des Fontaines 57645 Retonfey,57575_0120_00021,G,21 RUE DES FONTAINES,
378228134,00011,37822813400011,O,,NN,,,,true,1,,,,,FERME DU PETIT MARAIS,57645,RETONFEY,,,57575,,,,,,,,,,,,,,,,,,,1996-12-31,F,,,,,01.1A,NAF1993,N,6.31227,49.145998,0.61,street,Petit Marais 57645 Retonfey,57575_4anz1w,G,PETIT MARAIS,
378756100,00038,37875610000038,O,2004-06-01,,,,2012-10-30T08:20:48,false,3,,4,,PL,SAINT MARTIN,57645,RETONFEY,,,57575,,,,,,,,,,,,,,,,,,,2007-03-07,F,,,,,50.1Z,NAFRev1,N,6.304942,49.134465,0.85,housenumber,4 Place Saint Martin 57645 Retonfey,57575_0200_00004,G,4 PLACE SAINT MARTIN,
379002595,00088,37900259500088,O,2018-11-01,,,,2022-09-16T10:23:40,true,4,,,,,HANGAR LE PETIT MARAIS,57645,RETONFEY,,,57575,,,,,,,,,,,,,,,,,,,2021-12-31,F,,,,CAPSIC,45.11Z,NAFRev2,N,6.31227,49.145998,0.59,street,Petit Marais 57645 Retonfey,57575_4anz1w,G,PETIT MARAIS,
379424609,00020,37942460900020,O,1991-06-01,NN,,,,true,1,,15,,RUE,DES BLEUETS,57645,RETONFEY,,,57575,,,,,,,,,,,,,,,,,,,2000-05-31,F,,,,,67.2Z,NAF1993,N,6.303218,49.140758,0.95,housenumber,15 Rue des Bleuets 57645 Retonfey,57575_0030_00015,G,15 RUE DES BLEUETS,
379785389,00022,37978538900022,O,1992-10-01,11,2020,4313ZZ,2022-08-29T09:06:50,true,4,,3,,,ZONE ARTISANALE,57645,RETONFEY,,,57575,,,,,,,,,,,,,,,,,,,2008-01-01,A,,,,,43.13Z,NAFRev2,O,6.316766,49.133885,0.95,housenumber,3 Zone Artisanale 57645 Retonfey,57575_b085_00003,G,3 ZONE ARTISANALE,