siren,nic,siret,statutDiffusionEtablissement,dateCreationEtablissement,trancheEffectifsEtablissement,anneeEffectifsEtablissement,activitePrincipaleRegistreMetiersEtablissement,dateDernierTraitementEtablissement,etablissementSiege,nombrePeriodesEtablissement,complementAdresseEtablissement,numeroVoieEtablissement,indiceRepetitionEtablissement,typeVoieEtablissement,libelleVoieEtablissement,codePostalEtablissement,libelleCommuneEtablissement,libelleCommuneEtrangerEtablissement,distributionSpecialeEtablissement,codeCommuneEtablissement,codeCedexEtablissement,libelleCedexEtablissement,codePaysEtrangerEtablissement,libellePaysEtrangerEtablissement,complementAdresse2Etablissement,numeroVoie2Etablissement,indiceRepetition2Etablissement,typeVoie2Etablissement,libelleVoie2Etablissement,codePostal2Etablissement,libelleCommune2Etablissement,libelleCommuneEtranger2Etablissement,distributionSpeciale2Etablissement,codeCommune2Etablissement,codeCedex2Etablissement,libelleCedex2Etablissement,codePaysEtranger2Etablissement,libellePaysEtranger2Etablissement,dateDebut,etatAdministratifEtablissement,enseigne1Etablissement,enseigne2Etablissement,enseigne3Etablissement,denominationUsuelleEtablissement,activitePrincipaleEtablissement,nomenclatureActivitePrincipaleEtablissement,caractereEmployeurEtablissement,longitude,latitude,geo_score,geo_type,geo_adresse,geo_id,geo_ligne,geo_l4,geo_l5
315312900,00014,31531290000014,O,1979-01-01,NN,,,,true,1,,,,,LE BOURG,61100,BREEL,,,61058,,,,,,,,,,,,,,,,,,,2001-11-13,F,,,,,45.4C,NAF1993,O,-0.391071,48.812091,0.95,street,Le Bourg Breel 61100 Athis-Val de Rouvre,61058_B062,G,LE BOURG BREEL,
353375058,00016,35337505800016,O,,,,,,true,1,,,,,,61100,BREEL,,,61058,,,,,,,,,,,,,,,,,,,1997-06-24,F,,,,,01.3Z,NAF1993,N,,,0,,,,,,
377140249,00014,37714024900014,O,,,,,,true,1,,,,,LA CHEVALERIE,61100,BREEL,,,61058,,,,,,,,,,,,,,,,,,,1991-12-31,F,,,,,57.02,NAP,N,-0.396502,48.808332,0.67,street,Lieu Dit la Chevalerie 61100 Athis-Val de Rouvre,61007_6n2bd3,G,LIEU DIT LA CHEVALERIE,
377340096,00017,37734009600017,O,1973-01-01,NN,,,,true,1,,,,,LE BOURG,61100,BREEL,,,61058,,,,,,,,,,,,,,,,,,,1999-03-31,F,,,,,55.4B,NAF1993,N,-0.391071,48.812091,0.95,street,Le Bourg Breel 61100 Athis-Val de Rouvre,61058_B062,G,LE BOURG BREEL,
377943675,00027,37794367500027,O,1999-02-22,,,,2022-05-16T10:03:18,false,3,,,,,LE DOUIT DE BREEL,61100,BREEL,,,61058,,,,,,,,,,,,,,,,,,,2000-12-31,F,,,,,55.3B,NAF1993,N,-0.379493,48.816121,0.91,street,Le Douit de Breel 61100 Athis-Val de Rouvre,61058_B174,G,LE DOUIT DE BREEL,
388874240,00038,38887424000038,O,1997-04-01,,,,,true,1,,,,,LE PRESBYTERE,61100,BREEL,,,61058,,,,,,,,,,,,,,,,,,,1998-09-30,F,,,,,45.2V,NAF1993,N,-0.400084,48.756166,0.67,street,Le Presbytere Tourailles 61100 Athis-Val de Rouvre,61489_B152,G,LE PRESBYTERE TOURAILLES,
389915240,00011,38991524000011,O,1992-01-01,,,,,true,1,,,,,LA CHEVALINE,61100,BREEL,,,61058,,,,,,,,,,,,,,,,,,,1999-12-31,F,,,,,01.2A,NAF1993,N,-0.388738,48.8019,0.55,street,Lieu Dit la Cour de Breel 61100 Athis-Val de Rouvre,61058_B162,G,LIEU DIT LA COUR DE BREEL,
413502303,00014,41350230300014,O,1997-06-24,,,,,true,1,,,,,,61100,BREEL,,,61058,,,,,,,,,,,,,,,,,,,1998-10-01,F,,,,,01.3Z,NAF1993,N,,,0,,,,,,
433723087,00014,43372308700014,O,2000-04-01,NN,,,2006-11-25T17:11:11,true,1,,,,,LE BOURG,61100,BREEL,,,61058,,,,,,,,,,,,,,,,,,,2001-11-13,F,,,,,74.1J,NAF1993,N,-0.391071,48.812091,0.95,street,Le Bourg Breel 61100 Athis-Val de Rouvre,61058_B062,G,LE BOURG BREEL,
441132677,00010,44113267700010,O,2002-03-01,NN,,,,true,1,,,,,LE BOURG,61100,BREEL,,,61058,,,,,,,,,,,,,,,,,,,2002-04-12,F,,,,,45.4C,NAF1993,N,-0.391071,48.812091,0.95,street,Le Bourg Breel 61100 Athis-Val de Rouvre,61058_B062,G,LE BOURG BREEL,
780944955,00019,78094495500019,O,,,,,,true,1,,,,,LE BOURG,61100,BREEL,,,61058,,,,,,,,,,,,,,,,,,,1984-12-25,F,,,,,55.71,NAP,N,-0.391071,48.812091,0.95,street,Le Bourg Breel 61100 Athis-Val de Rouvre,61058_B062,G,LE BOURG BREEL,
780944963,00013,78094496300013,O,,NN,,,,true,1,,,,,LE BOURG,61100,BREEL,,,61058,,,,,,,,,,,,,,,,,,,1989-12-25,F,,,,,84.12,NAP,N,-0.391071,48.812091,0.95,street,Le Bourg Breel 61100 Athis-Val de Rouvre,61058_B062,G,LE BOURG BREEL,
