siren,nic,siret,statutDiffusionEtablissement,dateCreationEtablissement,trancheEffectifsEtablissement,anneeEffectifsEtablissement,activitePrincipaleRegistreMetiersEtablissement,dateDernierTraitementEtablissement,etablissementSiege,nombrePeriodesEtablissement,complementAdresseEtablissement,numeroVoieEtablissement,indiceRepetitionEtablissement,typeVoieEtablissement,libelleVoieEtablissement,codePostalEtablissement,libelleCommuneEtablissement,libelleCommuneEtrangerEtablissement,distributionSpecialeEtablissement,codeCommuneEtablissement,codeCedexEtablissement,libelleCedexEtablissement,codePaysEtrangerEtablissement,libellePaysEtrangerEtablissement,complementAdresse2Etablissement,numeroVoie2Etablissement,indiceRepetition2Etablissement,typeVoie2Etablissement,libelleVoie2Etablissement,codePostal2Etablissement,libelleCommune2Etablissement,libelleCommuneEtranger2Etablissement,distributionSpeciale2Etablissement,codeCommune2Etablissement,codeCedex2Etablissement,libelleCedex2Etablissement,codePaysEtranger2Etablissement,libellePaysEtranger2Etablissement,dateDebut,etatAdministratifEtablissement,enseigne1Etablissement,enseigne2Etablissement,enseigne3Etablissement,denominationUsuelleEtablissement,activitePrincipaleEtablissement,nomenclatureActivitePrincipaleEtablissement,caractereEmployeurEtablissement,longitude,latitude,geo_score,geo_type,geo_adresse,geo_id,geo_ligne,geo_l4,geo_l5
216900308,00018,21690030800018,O,1983-03-01,11,2020,,2022-08-29T09:08:32,true,4,,,,,LE BOURG,69690,BRULLIOLES,,,69030,,,,,,,,,,,,,,,,,,,2008-01-01,A,MAIRIE,,,,84.11Z,NAFRev2,O,4.500032,45.761042,0.62,street,Rue du Vieux Bourg 69690 Brullioles,69030_0135,G,RUE DU VIEUX BOURG,
216900308,00026,21690030800026,O,1983-12-21,02,2020,,2022-08-29T09:08:32,false,4,,130,,RUE,DU MONT POTHU,69690,BRULLIOLES,,,69030,,,,,,,,,,,,,,,,,,,2008-10-14,A,ECOLE PRIMAIRE PUB LE PETIT PRINCE,,,,85.20Z,NAFRev2,N,4.499645,45.761906,0.95,housenumber,130 Rue du Mont Pothu 69690 Brullioles,69030_0037_00130,G,130 RUE DU MONT POTHU,
216900308,00034,21690030800034,O,1996-01-01,NN,,,2020-11-09T13:32:04,false,4,,,,LD,LE BOURG,69690,BRULLIOLES,,,69030,,,,,,,,,,,,,,,,,,,2019-12-31,F,SERVICE ASSAINISSEMENT,,,,37.00Z,NAFRev2,N,4.500032,45.761042,0.62,street,Rue du Vieux Bourg 69690 Brullioles,69030_0135,G,RUE DU VIEUX BOURG,
266901826,00013,26690182600013,O,1994-01-01,NN,,,2016-07-23T12:15:55,true,4,,,,,HOTEL DE VILLE,69690,BRULLIOLES,,,69030,,,,,,,,,,,,,,,,,,,2016-01-01,F,CCAS,,,,88.99B,NAFRev2,N,4.49891,45.761261,0.62,street,Venelle de l’Hotel 69690 Brullioles,69030_0027,G,VENELLE DE L HOTEL,
307652792,00028,30765279200028,O,,NN,,,,true,1,,,,,VAUX,69690,BRULLIOLES,,,69030,,,,,,,,,,,,,,,,,,,1998-12-30,F,,,,,60.2E,NAF1993,N,4.488012,45.760688,0.51,street,Chemin des Oiseaux 69690 Brullioles,69030_43abhj,G,CHEMIN DES OISEAUX,
317790657,00017,31779065700017,O,1980-01-01,NN,,,,true,1,,,,PL,AU BOURG,69690,BRULLIOLES,,,69030,,,,,,,,,,,,,,,,,,,1999-06-30,F,,,,,55.4B,NAF1993,N,4.500032,45.761042,0.48,street,Rue du Vieux Bourg 69690 Brullioles,69030_0135,G,RUE DU VIEUX BOURG,
317908465,00014,31790846500014,O,1980-01-01,NN,,,2008-11-07T00:33:34,false,4,,,,,VERS L AIR,69690,BRULLIOLES,,,69030,,,,,,,,,,,,,,,,,,,2001-06-30,F,,,,,02.0B,NAF1993,O,4.483386,45.749037,0.94,locality,Vers l’Air 69690 Brullioles,69030_B052,G,VERS L AIR,
318156825,00016,31815682500016,O,1980-01-01,NN,,,,true,3,,,,,,69690,BRULLIOLES,,,69030,,,,,,,,,,,,,,,,,,,2003-06-30,F,,,,,60.2L,NAFRev1,,,,0,,,,,,
323486811,00017,32348681100017,O,1982-01-11,01,2020,,2022-08-29T09:17:57,true,4,,,,,LA PIERRE NOIRE,69690,BRULLIOLES,,,69030,,,,,,,,,,,,,,,,,,,2013-12-31,A,,,,,28.30Z,NAFRev2,N,4.491154,45.757061,0.94,locality,La Pierre Noire 69690 Brullioles,69030_B038,G,LA PIERRE NOIRE,
326161205,00017,32616120500017,O,1982-09-02,NN,,,2019-03-27T04:38:54,true,3,,,,LD,CHARFETAIN,69690,BRULLIOLES,,,69030,,,,,,,,,,,,,,,,,,,2008-01-01,A,,,,,01.24Z,NAFRev2,N,4.514956,45.755646,0.92,street,Chemin de Charfetain 69690 Brullioles,69030_m8pcww,G,CHEMIN DE CHARFETAIN,
328542477,00018,32854247700018,O,1983-09-12,NN,,,2022-10-08T04:13:19,true,4,,385,,CHE,DE VERS L'AIR,69690,BRULLIOLES,,,69030,,,,,,,,,,,,,,,,,,,2022-03-31,F,,,,,01.41Z,NAFRev2,N,4.485135,45.749295,0.86,housenumber,385 Chemin de Vers l’Air 69690 Brullioles,69030_iviyy3_00385,G,385 CHEMIN DE VERS L AIR,
328637160,00032,32863716000032,O,2003-09-09,NN,,,2014-07-08T00:33:17,true,5,,,,,LE BOURG,69690,BRULLIOLES,,,69030,,,,,,,,,,,,,,,,,,,2009-07-01,F,,,,,10.71C,NAFRev2,O,4.500032,45.761042,0.62,street,Rue du Vieux Bourg 69690 Brullioles,69030_0135,G,RUE DU VIEUX BOURG,
330723206,00042,33072320600042,O,1990-01-01,NN,,,,true,4,,,,,FAVARY,69690,BRULLIOLES,,,69030,,,,,,,,,,,,,,,,,,,1993-08-01,F,,,,,28.7P,NAF1993,N,4.507648,45.766183,0.91,street,Chemin de Favary 69690 Brullioles,69030_fv2sx1,G,CHEMIN DE FAVARY,
330894510,00016,33089451000016,O,1984-08-09,NN,,,2023-01-27T08:43:51,true,4,,,,LD,LE BOURG,69690,BRULLIOLES,,,69030,,,,,,,,,,,,,,,,,,,2022-07-18,F,,,,,68.20B,NAFRev2,N,4.500032,45.761042,0.62,street,Rue du Vieux Bourg 69690 Brullioles,69030_0135,G,RUE DU VIEUX BOURG,
331334144,00028,33133414400028,O,2013-10-01,,,,2021-02-23T10:51:28,true,1,,,,,LA MAZALIERE,69690,BRULLIOLES,,,69030,,,,,,,,,,,,,,,,,,,2013-10-01,A,,,,,85.51Z,NAFRev2,N,4.455802,45.76187,0.85,street,Chemin de la Mazalliere 69690 Brullioles,69030_si6hyh,G,CHEMIN DE LA MAZALLIERE,
331682955,00025,33168295500025,O,2002-04-01,NN,,,2012-11-09T00:28:30,true,4,,,,,LA RIVIERE,69690,BRULLIOLES,,,69030,,,,,,,,,,,,,,,,,,,2007-10-31,F,,,,,93.0N,NAFRev1,N,4.513653,45.755991,0.94,street,La Rivière 69690 Brullioles,69030_7y4dq4,G,LA RIVIERE,
331897470,00026,33189747000026,O,,NN,,,,true,1,,,,LD,LE SOTU,69690,BRULLIOLES,,,69030,,,,,,,,,,,,,,,,,,,1994-12-31,F,,,,,45.4F,NAF1993,N,4.494829,45.761394,0.91,locality,Lotissement le Sotu 69690 Brullioles,69030_A100,G,LOTISSEMENT LE SOTU,
332169333,00017,33216933300017,O,1985-04-01,NN,,4332AA,2016-12-25T03:37:57,true,4,,,,,AU VILLAGE,69690,BRULLIOLES,,,69030,,,,,,,,,,,,,,,,,,,2016-12-31,F,,,,,43.32A,NAFRev2,N,4.502662,45.771068,0.35,street,Chemin de Villecourt 69690 Brullioles,69030_kwlnmi,G,CHEMIN DE VILLECOURT,
333165660,00015,33316566000015,O,1985-01-01,NN,,,2009-04-24T13:26:40,true,4,,,,LD,LE RECORBET,69690,BRULLIOLES,,,69030,,,,,,,,,,,,,,,,,,,2009-01-01,F,,,,,68.20B,NAFRev2,N,4.497178,45.76457,0.71,street,Chemin du Recorbet 69690 Brullioles,69030_hbdwt1,G,CHEMIN DU RECORBET,
333197465,00037,33319746500037,O,2001-01-02,NN,,,2012-01-12T05:49:46,true,5,,,,LD,VILLECOURT,69690,BRULLIOLES,,,69030,,,,,,,,,,,,,,,,,,,2012-01-01,F,,,,,68.31Z,NAFRev2,N,4.500545,45.769574,0.94,street,Villecourt 69690 Brullioles,69030_8rhwbn,G,VILLECOURT,
333213031,00011,33321303100011,O,1985-07-01,,,,2008-11-07T00:52:52,false,4,,,,,LE RECORBET,69690,BRULLIOLES,,,69030,,,,,,,,,,,,,,,,,,,1993-12-25,F,,,,,45.2V,NAF1993,N,4.497178,45.76457,0.71,street,Chemin du Recorbet 69690 Brullioles,69030_hbdwt1,G,CHEMIN DU RECORBET,
333213031,00029,33321303100029,O,1993-07-01,11,2020,4399CZ,2022-08-29T09:23:04,true,4,,,,LD,LA CHAPELLE,69690,BRULLIOLES,,,69030,,,,,,,,,,,,,,,,,,,2008-01-01,A,,,,,43.99C,NAFRev2,O,4.498827,45.761971,0.93,street,Rue de la Chapelle 69690 Brullioles,69030_0010,G,RUE DE LA CHAPELLE,
333382174,00014,33338217400014,O,,,,,,true,1,,,,PL,NEUVE,69690,BRULLIOLES,,,69030,,,,,,,,,,,,,,,,,,,1988-11-01,F,,,,,67.01,NAP,N,4.498657,45.761699,0.73,street,Place Neuve 69690 Brullioles,69030_0038,G,PLACE NEUVE,
338278625,00011,33827862500011,O,,NN,,,,true,1,,,,,VILLECOURT,69690,BRULLIOLES,,,69030,,,,,,,,,,,,,,,,,,,1988-12-19,F,,,,,58.12,NAP,N,4.500545,45.769574,0.94,street,Villecourt 69690 Brullioles,69030_8rhwbn,G,VILLECOURT,
340675040,00026,34067504000026,O,1991-12-19,NN,,,2021-07-29T09:55:46,true,6,,930,,CHE,LA PETITE FORET,69690,BRULLIOLES,,,69030,,,,,,,,,,,,,,,,,,,2021-07-26,F,,,,PASCALE ANTUNES,96.09Z,NAFRev2,N,4.484307,45.752051,0.9,housenumber,930 Chemin de la Petite Foret 69690 Brullioles,69030_4sh82o_00930,G,930 CHEMIN DE LA PETITE FORET,
340743723,00033,34074372300033,O,2001-04-01,NN,,,2008-01-18T10:54:06,false,4,,,,,LE BAS POTHU,69690,BRULLIOLES,,,69030,,,,,,,,,,,,,,,,,,,2008-01-01,F,,,,,71.11Z,NAFRev2,N,4.49725,45.765128,0.74,locality,Bas Pothu 69690 Brullioles,69030_B001,G,BAS POTHU,
342532579,00022,34253257900022,O,1991-04-20,NN,,,2019-07-22T14:32:30,true,4,,,,,LE CHAPOTTON,69690,BRULLIOLES,,,69030,,,,,,,,,,,,,,,,,,,2019-07-16,F,,,,,68.20A,NAFRev2,N,4.500781,45.758897,0.58,street,Chemin du Chapoton 69690 Brullioles,69030_0012,G,CHEMIN DU CHAPOTON,
349011023,00018,34901102300018,O,,NN,,,,true,1,,,,,LE BOURG,69690,BRULLIOLES,,,69030,,,,,,,,,,,,,,,,,,,1990-01-08,F,,,,,67.08,NAP,N,4.500032,45.761042,0.62,street,Rue du Vieux Bourg 69690 Brullioles,69030_0135,G,RUE DU VIEUX BOURG,
350341335,00049,35034133500049,O,2002-05-15,NN,,,2011-04-28T00:40:29,false,3,,,,LD,LA RIVIERE,69690,BRULLIOLES,,,69030,,,,,,,,,,,,,,,,,,,2002-12-25,F,,,,,85.1G,NAF1993,N,4.513653,45.755991,0.94,street,La Rivière 69690 Brullioles,69030_7y4dq4,G,LA RIVIERE,
351112214,00017,35111221400017,O,1989-06-01,NN,,,2008-01-04T23:25:14,true,3,,,,LD,LA FOREZ,69690,BRULLIOLES,,,69030,,,,,,,,,,,,,,,,,,,2008-01-01,A,,,,,01.41Z,NAFRev2,N,4.484357,45.75203,0.61,street,Chemin de la Petite Foret 69690 Brullioles,69030_4sh82o,G,CHEMIN DE LA PETITE FORET,
351386107,00012,35138610700012,O,,NN,,,,true,1,,,,,LE AMPEAU,69690,BRULLIOLES,,,69030,,,,,,,,,,,,,,,,,,,1991-06-10,F,,,,,35.04,NAP,N,4.501666,45.760021,0.57,street,Chemin de Rampeau 69690 Brullioles,69030_0087,G,CHEMIN DE RAMPEAU,
353690316,00016,35369031600016,O,1990-03-15,NN,,,2006-11-25T11:17:28,true,3,PLACE NEUVE,,,,LE BOURG,69690,BRULLIOLES,,,69030,,,,,,,,,,,,,,,,,,,2004-09-30,F,,,,,55.1A,NAFRev1,N,4.500032,45.761042,0.62,street,Rue du Vieux Bourg 69690 Brullioles,69030_0135,G,RUE DU VIEUX BOURG,
353706054,00015,35370605400015,O,1977-03-20,NN,,,2009-10-23T04:46:42,true,4,LE PITAVAL,,,,LE PITAVAL,69690,BRULLIOLES,,,69030,,,,,,,,,,,,,,,,,,,2008-01-01,A,,,,,68.20A,NAFRev2,N,4.472679,45.768964,0.68,street,Chemin du Pitaval 69690 Brullioles,69030_s6caxe,G,CHEMIN DU PITAVAL,
353799232,00015,35379923200015,O,1990-02-01,NN,,,2006-10-28T00:07:10,true,3,,,,LD,LA MAZALIERE,69690,BRULLIOLES,,,69030,,,,,,,,,,,,,,,,,,,2005-03-31,F,,,,,01.2A,NAFRev1,N,4.455802,45.76187,0.85,street,Chemin de la Mazalliere 69690 Brullioles,69030_si6hyh,G,CHEMIN DE LA MAZALLIERE,
378417992,00013,37841799200013,O,1990-06-18,,,,2006-12-15T00:39:44,false,5,ZA RAMPEAU,,,CHE,DE MONTISUEL,69690,BRULLIOLES,,,69030,,,,,,,,,,,,,,,,,,,2006-06-30,F,,,,,70.2C,NAFRev1,N,4.503681,45.759585,0.84,street,Chemin de Montisuel 69690 Brullioles,69030_0036,G,CHEMIN DE MONTISUEL,
381283498,00016,38128349800016,O,1991-01-01,NN,,,2011-01-28T04:49:57,false,4,,,,,LE PITAVAL,69690,BRULLIOLES,,,69030,,,,,,,,,,,,,,,,,,,2010-04-01,F,,,,,10.51A,NAFRev2,N,4.472679,45.768964,0.68,street,Chemin du Pitaval 69690 Brullioles,69030_s6caxe,G,CHEMIN DU PITAVAL,
381652122,00031,38165212200031,O,2012-01-01,,,,2017-05-18T08:28:36,true,2,,,,,LA PLAINE,69690,BRULLIOLES,,,69030,,,,,,,,,,,,,,,,,,,2013-05-01,A,,,,,68.20B,NAFRev2,N,4.484546,45.756733,0.91,street,Chemin de la Plaine 69690 Brullioles,69030_zxihgy,G,CHEMIN DE LA PLAINE,
384257879,00013,38425787900013,O,1992-01-01,NN,,,2020-10-20T03:50:16,true,4,,,,,LA MAZELLIERE,69690,BRULLIOLES,,,69030,,,,,,,,,,,,,,,,,,,2020-09-30,F,,,,,01.41Z,NAFRev2,N,4.455802,45.76187,0.73,street,Chemin de la Mazalliere 69690 Brullioles,69030_si6hyh,G,CHEMIN DE LA MAZALLIERE,
384311536,00013,38431153600013,O,1992-01-02,02,2020,,2022-08-29T09:11:19,true,5,,,,,VAUX,69690,BRULLIOLES,,,69030,,,,,,,,,,,,,,,,,,,2010-01-27,A,PRO METALLERIE BRULLIOLOISE,,,,47.59B,NAFRev2,O,4.488012,45.760688,0.51,street,Chemin des Oiseaux 69690 Brullioles,69030_43abhj,G,CHEMIN DES OISEAUX,
384725966,00020,38472596600020,O,1998-11-05,NN,,,2019-06-24T13:14:05,true,5,Z.A. RAMPEAU,,,LD,MONTISUEL,69690,BRULLIOLES,,,69030,,,,,,,,,,,,,,,,,,,2017-12-31,F,,,,,45.11Z,NAFRev2,O,4.503681,45.759585,0.92,street,Chemin de Montisuel 69690 Brullioles,69030_0036,G,CHEMIN DE MONTISUEL,
384963005,00010,38496300500010,O,1992-01-01,NN,,,,true,1,,,,LD,LA BEAUVERDIERE,69690,BRULLIOLES,,,69030,,,,,,,,,,,,,,,,,,,2002-03-31,F,,,,,01.2A,NAF1993,N,4.475302,45.776077,0.92,street,Chemin de la Beauverdiere 69690 Brullioles,69030_m3lhq6,G,CHEMIN DE LA BEAUVERDIERE,
388404162,00017,38840416200017,O,1992-07-20,NN,,1013AZ,2015-03-17T00:37:30,true,6,,,,,ZA RAMPEAU,69690,BRULLIOLES,,,69030,,,,,,,,,,,,,,,,,,,2013-09-30,F,,,,,10.13A,NAFRev2,N,4.501666,45.760021,0.68,street,Chemin de Rampeau 69690 Brullioles,69030_0087,G,CHEMIN DE RAMPEAU,
388505356,00021,38850535600021,O,2010-07-05,,,,2012-11-09T00:51:00,true,2,,,,,LIEU DIT LA COTE,69690,BRULLIOLES,,,69030,,,,,,,,,,,,,,,,,,,2011-08-01,F,,,,,85.59A,NAFRev2,N,4.489992,45.748652,0.91,street,Chemin de la Cote 69690 Brullioles,69030_v4afan,G,CHEMIN DE LA COTE,
389983651,00016,38998365100016,O,1975-04-01,NN,,,2011-01-09T04:48:16,true,4,,,,LD,VILLECOURT,69690,BRULLIOLES,,,69030,,,,,,,,,,,,,,,,,,,2010-12-31,F,,,,,01.41Z,NAFRev2,N,4.500545,45.769574,0.94,street,Villecourt 69690 Brullioles,69030_8rhwbn,G,VILLECOURT,
389984220,00019,38998422000019,O,1979-01-01,NN,,,2008-12-12T20:20:25,true,4,,,,LD,LA PLAINE,69690,BRULLIOLES,,,69030,,,,,,,,,,,,,,,,,,,2008-12-31,F,,,,,01.41Z,NAFRev2,N,4.484546,45.756733,0.91,street,Chemin de la Plaine 69690 Brullioles,69030_zxihgy,G,CHEMIN DE LA PLAINE,
389984709,00011,38998470900011,O,1984-01-01,NN,,,2008-01-04T23:33:01,true,6,,,,LD,MONTIZUEL,69690,BRULLIOLES,,,69030,,,,,,,,,,,,,,,,,,,2008-01-01,A,,,,,68.20B,NAFRev2,N,4.503681,45.759585,0.65,street,Chemin de Montisuel 69690 Brullioles,69030_0036,G,CHEMIN DE MONTISUEL,
389984808,00011,38998480800011,O,1985-01-01,NN,,,2012-01-17T06:20:51,true,4,,,,LD,LE FAYARD,69690,BRULLIOLES,,,69030,,,,,,,,,,,,,,,,,,,2011-12-01,F,,,,,01.41Z,NAFRev2,N,4.50044,45.7748,0.83,locality,Le Grand Fayard 69690 Brullioles,69030_B026,G,LE GRAND FAYARD,
390235406,00019,39023540600019,O,1971-12-01,NN,,,2007-01-18T09:32:35,true,3,,,,LD,LA FORET,69690,BRULLIOLES,,,69030,,,,,,,,,,,,,,,,,,,1998-12-25,F,,,,,01.2A,NAF1993,N,4.484357,45.75203,0.81,street,Chemin de la Petite Foret 69690 Brullioles,69030_4sh82o,G,CHEMIN DE LA PETITE FORET,
390415750,00012,39041575000012,O,1993-03-10,NN,,,,false,3,,,,,VILLECOURT,69690,BRULLIOLES,,,69030,,,,,,,,,,,,,,,,,,,1996-01-29,F,,,,,70.2A,NAF1993,N,4.500545,45.769574,0.94,street,Villecourt 69690 Brullioles,69030_8rhwbn,G,VILLECOURT,
391075215,00015,39107521500015,O,1978-01-01,NN,,,,true,1,,,,LD,VILLECOURT,69690,BRULLIOLES,,,69030,,,,,,,,,,,,,,,,,,,2000-12-31,F,,,,,01.1A,NAF1993,N,4.500545,45.769574,0.94,street,Villecourt 69690 Brullioles,69030_8rhwbn,G,VILLECOURT,
391077781,00014,39107778100014,O,1981-01-01,NN,,,,true,4,,,,LD,MALHERBES,69690,BRULLIOLES,,,69030,,,,,,,,,,,,,,,,,,,2000-03-31,F,,,,,01.1A,NAF1993,N,4.498947,45.764371,0.92,street,Chemin de Malherbes 69690 Brullioles,69030_n9j3y8,G,CHEMIN DE MALHERBES,
392463493,00057,39246349300057,O,2019-08-15,,,4932ZB,2021-08-04T08:44:58,false,2,,30,,RUE,DU CHEF DE GARE,69690,BRULLIOLES,,,69030,,,,,,,,,,,,,,,,,,,2021-06-01,F,,,,TRANSPORT T3C,49.32Z,NAFRev2,N,4.499091,45.761351,0.94,housenumber,30 Rue du Chef de Gare 69690 Brullioles,69030_0011_00030,G,30 RUE DU CHEF DE GARE,
392632873,00031,39263287300031,O,2010-03-01,NN,,,2014-07-08T01:21:08,false,5,,,,RUE,DE LA CHAPELLE,69690,BRULLIOLES,,,69030,,,,,,,,,,,,,,,,,,,2013-06-01,F,TAXI JEFF TAXI BRULLIOLOIS,,,ACCES COLIS,49.32Z,NAFRev2,O,4.498827,45.761971,0.95,street,Rue de la Chapelle 69690 Brullioles,69030_0010,G,RUE DE LA CHAPELLE,
393121645,00013,39312164500013,O,1993-11-01,NN,,,2012-05-07T02:37:04,true,4,,,,LD,LA FORET,69690,BRULLIOLES,,,69030,,,,,,,,,,,,,,,,,,,2012-04-01,F,,,,,01.41Z,NAFRev2,N,4.484357,45.75203,0.81,street,Chemin de la Petite Foret 69690 Brullioles,69030_4sh82o,G,CHEMIN DE LA PETITE FORET,
393341417,00011,39334141700011,O,1993-10-04,00,2020,,2022-08-29T09:17:14,true,4,,,,,MAIRIE DE BRULLIOLES,69690,BRULLIOLES,,,69030,,,,,,,,,,,,,,,,,,,2008-01-01,A,,,,,94.99Z,NAFRev2,O,4.49944,45.761247,0.68,street,Place de l’Eglise 69690 Brullioles,69030_0015,G,PLACE DE L EGLISE,
393804075,00017,39380407500017,O,1982-09-01,NN,,,2008-01-12T15:39:54,true,3,,,,,LE PITIVAL,69690,BRULLIOLES,,,69030,,,,,,,,,,,,,,,,,,,2007-12-31,F,,,,,01.1A,NAFRev1,N,4.49436,45.760382,0.35,street,Lotissement le Panoramique 69690 Brullioles,69030_A060,G,LOTISSEMENT LE PANORAMIQUE,
394044861,00026,39404486100026,O,1997-08-01,NN,,,2006-12-15T00:52:40,false,4,,,,,,69690,BRULLIOLES,,,69030,,,,,,,,,,,,,,,,,,,2001-12-31,F,,,,,01.2C,NAF1993,N,,,0,,,,,,
399842905,00016,39984290500016,O,1995-01-01,NN,,4333ZZ,2021-10-27T08:26:15,true,5,,,,LD,LE SOTU,69690,BRULLIOLES,,,69030,,,,,,,,,,,,,,,,,,,2019-01-31,F,,,,,43.33Z,NAFRev2,O,4.494829,45.761394,0.91,locality,Lotissement le Sotu 69690 Brullioles,69030_A100,G,LOTISSEMENT LE SOTU,
400722435,00015,40072243500015,O,1995-04-05,NN,,,,true,4,,,,,CHARFETAIN,69690,BRULLIOLES,,,69030,,,,,,,,,,,,,,,,,,,2002-08-13,F,,,,,74.8K,NAF1993,O,4.514956,45.755646,0.92,street,Chemin de Charfetain 69690 Brullioles,69030_m8pcww,G,CHEMIN DE CHARFETAIN,
401173992,00017,40117399200017,O,1995-04-13,NN,,,,true,1,,,,,LIEU DU BOURG,69690,BRULLIOLES,,,69030,,,,,,,,,,,,,,,,,,,2000-06-30,F,,,,,52.1B,NAF1993,N,4.500032,45.761042,0.61,street,Rue du Vieux Bourg 69690 Brullioles,69030_0135,G,RUE DU VIEUX BOURG,
402922066,00012,40292206600012,O,1995-11-01,NN,,,,true,4,,,,,AU BOURG,69690,BRULLIOLES,,,69030,,,,,,,,,,,,,,,,,,,2002-12-16,F,,,,,55.1C,NAF1993,N,4.500032,45.761042,0.62,street,Rue du Vieux Bourg 69690 Brullioles,69030_0135,G,RUE DU VIEUX BOURG,
404112401,00017,40411240100017,O,1996-02-27,NN,,,2021-09-07T10:19:44,true,6,,930,,CHE,LA PETITE FORET,69690,BRULLIOLES,,,69030,,,,,,,,,,,,,,,,,,,2021-09-01,A,,,,JEAN CHARLES ANTUNES,90.02Z,NAFRev2,N,4.484307,45.752051,0.9,housenumber,930 Chemin de la Petite Foret 69690 Brullioles,69030_4sh82o_00930,G,930 CHEMIN DE LA PETITE FORET,
404882854,00015,40488285400015,O,1965-01-01,NN,,,2008-01-04T20:47:13,true,3,RECORBET,,,,,69690,BRULLIOLES,,,69030,,,,,,,,,,,,,,,,,,,2008-01-01,A,,,,,01.24Z,NAFRev2,N,4.497178,45.76457,0.92,street,Chemin du Recorbet 69690 Brullioles,69030_hbdwt1,D,CHEMIN DU RECORBET,
404882862,00018,40488286200018,O,1980-12-31,NN,,,,true,1,,,,,,69690,BRULLIOLES,,,69030,,,,,,,,,,,,,,,,,,,1999-12-31,F,,,,,01.1A,NAF1993,N,,,0,,,,,,
404882870,00011,40488287000011,O,1980-12-31,NN,,,2007-04-26T06:59:55,true,3,MILLY,,,,,69690,BRULLIOLES,,,69030,,,,,,,,,,,,,,,,,,,2007-02-28,F,,,,,01.1A,NAFRev1,N,4.520661,45.767016,0.92,street,Chemin de Milly 69690 Brullioles,69030_3xkyi0,D,CHEMIN DE MILLY,
404882888,00013,40488288800013,O,1981-11-01,NN,,,2010-04-13T05:36:49,true,4,CHAMPELUS,,,,,69690,BRULLIOLES,,,69030,,,,,,,,,,,,,,,,,,,2008-12-31,F,,,,,01.41Z,NAFRev2,N,4.505872,45.759211,0.94,street,Champelus 69690 Brullioles,69030_1a849q,D,CHAMPELUS,
404882896,00016,40488289600016,O,1986-06-29,NN,,,2006-10-28T03:25:02,true,3,LE RECORBET,,,,,69690,BRULLIOLES,,,69030,,,,,,,,,,,,,,,,,,,2005-03-31,F,,,,,01.1A,NAFRev1,N,4.497178,45.76457,0.71,street,Chemin du Recorbet 69690 Brullioles,69030_hbdwt1,D,CHEMIN DU RECORBET,
404882904,00018,40488290400018,O,1992-09-01,NN,,,,true,1,,,,,,69690,BRULLIOLES,,,69030,,,,,,,,,,,,,,,,,,,1999-12-31,F,,,,,01.1A,NAF1993,N,,,0,,,,,,
404882912,00011,40488291200011,O,1988-11-01,NN,,,2008-01-04T20:47:13,true,3,VAUX,,,,,69690,BRULLIOLES,,,69030,,,,,,,,,,,,,,,,,,,2008-01-01,A,,,,,01.42Z,NAFRev2,N,4.488012,45.760688,0.51,street,Chemin des Oiseaux 69690 Brullioles,69030_43abhj,D,CHEMIN DES OISEAUX,
404882920,00014,40488292000014,O,1986-01-01,NN,,,2011-02-02T13:25:55,false,4,LE PITAVAL,,,,,69690,BRULLIOLES,,,69030,,,,,,,,,,,,,,,,,,,1997-12-31,F,,,,,01.3Z,NAF1993,N,4.472679,45.768964,0.68,street,Chemin du Pitaval 69690 Brullioles,69030_s6caxe,D,CHEMIN DU PITAVAL,
404917098,00018,40491709800018,O,1996-04-09,NN,,,2011-07-06T06:24:21,true,4,,,,LD,LA RENAUDIERE,69690,BRULLIOLES,,,69030,,,,,,,,,,,,,,,,,,,2008-01-01,A,,,,,43.12A,NAFRev2,O,4.466899,45.764217,0.92,street,Chemin de la Renaudiere 69690 Brullioles,69030_0mkvf8,G,CHEMIN DE LA RENAUDIERE,
407767409,00029,40776740900029,O,2004-07-19,,,,2008-01-04T20:59:29,false,3,,,,,LE BOURG,69690,BRULLIOLES,,,69030,,,,,,,,,,,,,,,,,,,2008-01-01,A,HALTE GARDERIE PARENTALE LUTINS DU POTHU,,,,88.91A,NAFRev2,N,4.500032,45.761042,0.62,street,Rue du Vieux Bourg 69690 Brullioles,69030_0135,G,RUE DU VIEUX BOURG,
408377729,00012,40837772900012,O,,NN,,,,true,1,,,,,VILLECOURT,69690,BRULLIOLES,,,69030,,,,,,,,,,,,,,,,,,,1997-11-30,F,,,,,01.1F,NAF1993,N,4.500545,45.769574,0.94,street,Villecourt 69690 Brullioles,69030_8rhwbn,G,VILLECOURT,
408377737,00015,40837773700015,O,1980-12-31,NN,,,2006-10-28T03:33:38,true,3,,,,,VAUX,69690,BRULLIOLES,,,69030,,,,,,,,,,,,,,,,,,,2006-04-05,F,,,,,01.1A,NAFRev1,N,4.488012,45.760688,0.51,street,Chemin des Oiseaux 69690 Brullioles,69030_43abhj,G,CHEMIN DES OISEAUX,
408377745,00018,40837774500018,O,1983-11-11,NN,,,,true,3,,,,,LE RECORBET,69690,BRULLIOLES,,,69030,,,,,,,,,,,,,,,,,,,1998-12-31,F,,,,,01.1F,NAF1993,N,4.497178,45.76457,0.71,street,Chemin du Recorbet 69690 Brullioles,69030_hbdwt1,G,CHEMIN DU RECORBET,
408377752,00014,40837775200014,O,1995-01-01,NN,,,2006-10-28T03:33:38,true,3,,,,LD,LA BOZONNIERE,69690,BRULLIOLES,,,69030,,,,,,,,,,,,,,,,,,,2004-09-30,F,,,,,01.1F,NAFRev1,N,4.495252,45.755504,0.73,street,Impasse de la Bosonnière 69690 Brullioles,69030_qn862o,G,IMPASSE DE LA BOSONNIERE,
409910908,00022,40991090800022,O,2004-06-12,,,,2008-07-17T10:42:35,false,4,LIEUDIT LE BOURG,,,,,69690,BRULLIOLES,,,69030,,,,,,,,,,,,,,,,,,,2008-07-01,F,,,,,47.11B,NAFRev2,N,4.500032,45.761042,0.41,street,Rue du Vieux Bourg 69690 Brullioles,69030_0135,D,RUE DU VIEUX BOURG,
410633903,00019,41063390300019,O,1997-01-20,,,,2008-11-08T01:23:40,false,3,BAT B N 8,,,LD,LES LAVANDIERES,69690,BRULLIOLES,,,69030,,,,,,,,,,,,,,,,,,,2000-10-28,F,,,,,93.0D,NAF1993,N,4.495841,45.76179,0.92,locality,Residence les Lavandieres 69690 Brullioles,69030_A050,G,RESIDENCE LES LAVANDIERES,
410633903,00027,41063390300027,O,2000-10-28,NN,,9602AB,2015-03-17T00:49:17,true,3,,,,LD,LA RIVIERE,69690,BRULLIOLES,,,69030,,,,,,,,,,,,,,,,,,,2008-01-01,A,,,,,96.02A,NAFRev2,N,4.513653,45.755991,0.94,street,La Rivière 69690 Brullioles,69030_7y4dq4,G,LA RIVIERE,
410637664,00013,41063766400013,O,1997-01-20,,,,2008-11-08T01:23:41,false,3,BAT B N8,,,LD,LES LAVANDIERES,69690,BRULLIOLES,,,69030,,,,,,,,,,,,,,,,,,,2000-10-28,F,,,,,93.0D,NAF1993,N,4.495841,45.76179,0.92,locality,Residence les Lavandieres 69690 Brullioles,69030_A050,G,RESIDENCE LES LAVANDIERES,
410637664,00021,41063766400021,O,2000-10-28,NN,,9602AB,2015-03-17T00:49:17,true,3,,,,LD,LA RIVIERE,69690,BRULLIOLES,,,69030,,,,,,,,,,,,,,,,,,,2008-01-01,A,,,,,96.02A,NAFRev2,N,4.513653,45.755991,0.94,street,La Rivière 69690 Brullioles,69030_7y4dq4,G,LA RIVIERE,
410637763,00013,41063776300013,O,1997-01-20,,,,,false,3,BAT B N 8,,,LD,LES LAVANDIERES,69690,BRULLIOLES,,,69030,,,,,,,,,,,,,,,,,,,2000-10-28,F,,,,,93.0D,NAF1993,N,4.495841,45.76179,0.92,locality,Residence les Lavandieres 69690 Brullioles,69030_A050,G,RESIDENCE LES LAVANDIERES,
410637763,00021,41063776300021,O,2000-10-28,NN,,,2008-12-03T06:14:37,true,4,,,,LD,LA RIVIERE,69690,BRULLIOLES,,,69030,,,,,,,,,,,,,,,,,,,2008-10-31,F,,,,,96.02A,NAFRev2,N,4.513653,45.755991,0.94,street,La Rivière 69690 Brullioles,69030_7y4dq4,G,LA RIVIERE,
412223075,00018,41222307500018,O,1996-01-01,NN,,,2020-10-01T08:38:10,true,5,,,,,LE POTHU,69690,BRULLIOLES,,,69030,,,,,,,,,,,,,,,,,,,2020-08-31,F,,,,,47.89Z,NAFRev2,N,4.499228,45.761892,0.62,street,Rue du Mont Pothu 69690 Brullioles,69030_0037,G,RUE DU MONT POTHU,
412252546,00020,41225254600020,O,1999-07-01,NN,,,2008-01-04T22:13:00,true,3,,,,,LE BOURG,69690,BRULLIOLES,,,69030,,,,,,,,,,,,,,,,,,,2008-01-01,A,,,,,56.30Z,NAFRev2,N,4.500032,45.761042,0.62,street,Rue du Vieux Bourg 69690 Brullioles,69030_0135,G,RUE DU VIEUX BOURG,