siren,nic,siret,statutDiffusionEtablissement,dateCreationEtablissement,trancheEffectifsEtablissement,anneeEffectifsEtablissement,activitePrincipaleRegistreMetiersEtablissement,dateDernierTraitementEtablissement,etablissementSiege,nombrePeriodesEtablissement,complementAdresseEtablissement,numeroVoieEtablissement,indiceRepetitionEtablissement,typeVoieEtablissement,libelleVoieEtablissement,codePostalEtablissement,libelleCommuneEtablissement,libelleCommuneEtrangerEtablissement,distributionSpecialeEtablissement,codeCommuneEtablissement,codeCedexEtablissement,libelleCedexEtablissement,codePaysEtrangerEtablissement,libellePaysEtrangerEtablissement,complementAdresse2Etablissement,numeroVoie2Etablissement,indiceRepetition2Etablissement,typeVoie2Etablissement,libelleVoie2Etablissement,codePostal2Etablissement,libelleCommune2Etablissement,libelleCommuneEtranger2Etablissement,distributionSpeciale2Etablissement,codeCommune2Etablissement,codeCedex2Etablissement,libelleCedex2Etablissement,codePaysEtranger2Etablissement,libellePaysEtranger2Etablissement,dateDebut,etatAdministratifEtablissement,enseigne1Etablissement,enseigne2Etablissement,enseigne3Etablissement,denominationUsuelleEtablissement,activitePrincipaleEtablissement,nomenclatureActivitePrincipaleEtablissement,caractereEmployeurEtablissement,longitude,latitude,geo_score,geo_type,geo_adresse,geo_id,geo_ligne,geo_l4,geo_l5
210200937,00014,21020093700014,O,1983-03-01,01,2020,,2022-08-29T09:05:39,true,4,,2,,RUE,LOUIS FRAIX,02270,BOIS-LES-PARGNY,,,02096,,,,,,,,,,,,,,,,,,,2008-01-01,A,MAIRIE,,,,84.11Z,NAFRev2,O,3.650591,49.731262,0.94,housenumber,2 Rue Louis Fraix 02270 Bois-lès-Pargny,02096_0019_00002,G,2 RUE LOUIS FRAIX,
210200937,00022,21020093700022,O,1983-12-21,NN,,,2019-11-14T14:00:12,false,4,,4,,RUE,LOUIS FRAIX,02270,BOIS-LES-PARGNY,,,02096,,,,,,,,,,,,,,,,,,,2008-01-01,F,ECOLE PRIMAIRE PUBLIQUE,,,,85.20Z,NAFRev2,N,3.650925,49.731491,0.94,housenumber,4 Rue Louis Fraix 02270 Bois-lès-Pargny,02096_0019_00004,G,4 RUE LOUIS FRAIX,
260200951,00010,26020095100010,O,1983-03-01,NN,,,2019-11-14T14:00:12,true,4,MAIRIE,2,,RUE,LOUIS FRAIX,02270,BOIS-LES-PARGNY,,,02096,,,,,,,,,,,,,,,,,,,2016-01-01,F,CCAS,,,,88.99B,NAFRev2,N,3.650591,49.731262,0.94,housenumber,2 Rue Louis Fraix 02270 Bois-lès-Pargny,02096_0019_00002,G,2 RUE LOUIS FRAIX,
260209556,00018,26020955600018,O,1992-01-01,NN,,,2019-11-14T14:00:12,true,3,MAIRIE,2,,RUE,LOUIS FRAIX,02270,BOIS-LES-PARGNY,,,02096,,,,,,,,,,,,,,,,,,,2008-01-01,A,CDE,,,,88.99B,NAFRev2,N,3.650591,49.731262,0.94,housenumber,2 Rue Louis Fraix 02270 Bois-lès-Pargny,02096_0019_00002,G,2 RUE LOUIS FRAIX,
290201680,00011,29020168000011,O,1988-02-15,NN,,,2019-11-14T14:00:12,true,4,MAIRIE,2,,RUE,LOUIS FRAIX,02270,BOIS-LES-PARGNY,,,02096,,,,,,,,,,,,,,,,,,,1997-12-25,F,,,,,70.1C,NAF1993,N,3.650591,49.731262,0.94,housenumber,2 Rue Louis Fraix 02270 Bois-lès-Pargny,02096_0019_00002,G,2 RUE LOUIS FRAIX,
301629036,00015,30162903600015,O,,,,,2019-11-14T14:00:12,true,1,,,,,,02270,BOIS-LES-PARGNY,,,02096,,,,,,,,,,,,,,,,,,,1984-12-25,F,,,,,,,N,,,0,,,,,,
313127201,00017,31312720100017,O,,,,,2019-11-14T14:00:12,true,1,,,,,,02270,BOIS-LES-PARGNY,,,02096,,,,,,,,,,,,,,,,,,,1992-12-05,F,,,,,01.1A,NAF1993,N,,,0,,,,,,
313468324,00014,31346832400014,O,1978-01-01,,,,2019-11-14T14:00:12,true,3,,,,RUE,DE SONS,02270,BOIS-LES-PARGNY,,,02096,,,,,,,,,,,,,,,,,,,2008-01-01,A,,,,,01.11Z,NAFRev2,N,3.651345,49.729866,0.61,locality,Sous la Rue de Liège 02270 Bois-lès-Pargny,02096_B067,G,SOUS LA RUE DE LIEGE,
313645699,00015,31364569900015,O,,,,,2019-11-14T14:00:12,true,1,,,,,CHATEAU DE BOIS LES PARGNY,02270,BOIS-LES-PARGNY,,,02096,,,,,,,,,,,,,,,,,,,2000-07-28,F,,,,,01.00,NAP,N,3.651864,49.730246,0.66,street,Rue de Liège 02270 Bois-lès-Pargny,02096_0016,G,RUE DE LIEGE,
329904643,00015,32990464300015,O,,NN,,,2019-11-14T14:00:12,true,1,,,,RUE,DU PRE,02270,BOIS-LES-PARGNY,,,02096,,,,,,,,,,,,,,,,,,,,F,,,,,55.73,NAP,N,3.646131,49.730876,0.94,street,Rue du Pré 02270 Bois-lès-Pargny,02096_0030,G,RUE DU PRE,
330132259,00012,33013225900012,O,,NN,,,2019-11-14T14:00:12,true,1,,,,RUE,DE SONS,02270,BOIS-LES-PARGNY,,,02096,,,,,,,,,,,,,,,,,,,1990-02-20,F,,,,,69.12,NAP,N,3.651345,49.729866,0.61,locality,Sous la Rue de Liège 02270 Bois-lès-Pargny,02096_B067,G,SOUS LA RUE DE LIEGE,
335110128,00014,33511012800014,O,1986-01-01,NN,,,2019-11-14T14:00:12,true,5,,,,,,02270,BOIS-LES-PARGNY,,,02096,,,,,,,,,,,,,,,,,,,2009-12-17,F,,,,,56.10A,NAFRev2,O,,,0,,,,,,
342927712,00014,34292771200014,O,1987-10-27,NN,,,2022-07-01T03:47:29,true,3,,,,,,02270,BOIS-LES-PARGNY,,,02096,,,,,,,,,,,,,,,,,,,2008-01-01,A,,,,,68.20B,NAFRev2,N,,,0,,,,,,
353768146,00014,35376814600014,O,1989-01-03,,,,2019-11-14T14:00:12,true,1,,,,,,02270,BOIS-LES-PARGNY,,,02096,,,,,,,,,,,,,,,,,,,1998-05-31,F,,,,,01.1A,NAF1993,N,,,0,,,,,,
380334847,00023,38033484700023,O,1992-06-01,01,2020,4391BZ,2022-08-29T09:07:24,true,5,,12,,RUE,LOUIS FRAIX,02270,BOIS-LES-PARGNY,,,02096,,,,,,,,,,,,,,,,,,,2022-04-30,F,,,,,43.91B,NAFRev2,O,3.65188,49.732205,0.94,housenumber,12 Rue Louis Fraix 02270 Bois-lès-Pargny,02096_0019_00012,G,12 RUE LOUIS FRAIX,
382325827,00014,38232582700014,O,1991-07-01,NN,,,2019-11-14T14:00:12,true,3,,12,,RUE,DU CALVAIRE,02270,BOIS-LES-PARGNY,,,02096,,,,,,,,,,,,,,,,,,,1991-12-25,F,,,,,86.06,NAP,N,3.652803,49.727741,0.94,housenumber,12 Rue du Calvaire 02270 Bois-lès-Pargny,02096_0006_00012,G,12 RUE DU CALVAIRE,
383206224,00016,38320622400016,O,1991-10-10,00,2020,,2022-08-29T09:10:15,true,5,,10,,RUE,LOUIS FRAIX,02270,BOIS-LES-PARGNY,,,02096,,,,,,,,,,,,,,,,,,,2010-12-31,A,,,,,01.11Z,NAFRev2,O,3.651555,49.731925,0.94,housenumber,10 Rue Louis Fraix 02270 Bois-lès-Pargny,02096_0019_00010,G,10 RUE LOUIS FRAIX,
391085867,00029,39108586700029,O,1994-02-14,NN,,,2021-10-20T03:36:15,true,3,,12,,RUE,LOUIS FRAIX,02270,BOIS-LES-PARGNY,,,02096,,,,,,,,,,,,,,,,,,,2008-01-01,A,,,,,68.20B,NAFRev2,N,3.65188,49.732205,0.94,housenumber,12 Rue Louis Fraix 02270 Bois-lès-Pargny,02096_0019_00012,G,12 RUE LOUIS FRAIX,
391790714,00078,39179071400078,O,2015-04-01,NN,,4399CZ,2021-12-04T04:05:06,true,3,,13,,RUE,DE LIEGE,02270,BOIS-LES-PARGNY,,,02096,,,,,,,,,,,,,,,,,,,2021-12-31,F,314-116 BATIMENT,,,,43.99C,NAFRev2,N,3.653056,49.72973,0.94,housenumber,13 Rue de Liège 02270 Bois-lès-Pargny,02096_0016_00013,G,13 RUE DE LIEGE,
395248545,00018,39524854500018,O,1994-05-16,00,2020,,2022-08-29T09:18:47,true,3,,1,,RUE,DE LIEGE,02270,BOIS-LES-PARGNY,,,02096,,,,,,,,,,,,,,,,,,,2008-01-01,A,,,,,01.11Z,NAFRev2,N,3.649133,49.731387,0.94,housenumber,1 Rue de Liège 02270 Bois-lès-Pargny,02096_0016_00001,G,1 RUE DE LIEGE,
404098618,00014,40409861800014,O,1996-01-01,NN,,,2019-11-14T14:00:12,true,3,,1,,RUE,DE LIEGE,02270,BOIS-LES-PARGNY,,,02096,,,,,,,,,,,,,,,,,,,2008-01-01,A,,,,,68.20B,NAFRev2,N,3.649133,49.731387,0.94,housenumber,1 Rue de Liège 02270 Bois-lès-Pargny,02096_0016_00001,G,1 RUE DE LIEGE,
408866986,00016,40886698600016,O,1964-11-11,NN,,,2019-11-14T14:00:12,true,4,,,,,,02270,BOIS-LES-PARGNY,,,02096,,,,,,,,,,,,,,,,,,,2006-12-31,F,,,,,01.1A,NAFRev1,N,,,0,,,,,,
419409222,00017,41940922200017,O,1998-06-01,NN,,,2019-11-14T14:00:12,true,3,,2,,RUE,DU PRE,02270,BOIS-LES-PARGNY,,,02096,,,,,,,,,,,,,,,,,,,2008-01-01,A,,,,,01.11Z,NAFRev2,N,3.64849,49.731847,0.94,housenumber,2 Rue du Pré 02270 Bois-lès-Pargny,02096_0030_00002,G,2 RUE DU PRE,
440623882,00014,44062388200014,O,2002-01-02,NN,,,2019-11-14T14:00:12,true,3,,2,,RUE,DU PRE,02270,BOIS-LES-PARGNY,,,02096,,,,,,,,,,,,,,,,,,,2008-01-01,A,,,,,46.19B,NAFRev2,N,3.64849,49.731847,0.94,housenumber,2 Rue du Pré 02270 Bois-lès-Pargny,02096_0030_00002,G,2 RUE DU PRE,
478332406,00048,47833240600048,O,2019-12-06,,,,2020-01-04T03:40:21,false,1,,25,,RUE,LOUIS FRAIX,02270,BOIS-LES-PARGNY,,,02096,,,,,,,,,,,,,,,,,,,2019-12-06,A,,,,,68.20A,NAFRev2,N,3.653192,49.733356,0.94,housenumber,25 Rue Louis Fraix 02270 Bois-lès-Pargny,02096_0019_00025,G,25 RUE LOUIS FRAIX,
479118002,00019,47911800200019,O,2004-11-11,NN,,,2019-11-14T14:00:12,false,3,,3,,RUE,LOUIS FRAIX,02270,BOIS-LES-PARGNY,,,02096,,,,,,,,,,,,,,,,,,,2005-08-30,F,,,,,85.1G,NAFRev1,N,3.650688,49.731683,0.94,housenumber,3 Rue Louis Fraix 02270 Bois-lès-Pargny,02096_0019_00003,G,3 RUE LOUIS FRAIX,
480438407,00011,48043840700011,O,2004-12-25,,,,2019-11-14T14:00:12,true,2,,6,,RUE,MARCEL CARLIER,02270,BOIS-LES-PARGNY,,,02096,,,,,,,,,,,,,,,,,,,2008-01-01,A,,,,,01.11Z,NAFRev2,N,3.646711,49.730122,0.94,housenumber,6 Rue Marcel Carlier 02270 Bois-lès-Pargny,02096_0020_00006,G,6 RUE MARCEL CARLIER,
489695650,00015,48969565000015,O,2006-05-15,,,4334ZC,2019-11-14T14:00:12,false,3,,12,,RUE,DU CALVAIRE,02270,BOIS-LES-PARGNY,,,02096,,,,,,,,,,,,,,,,,,,2012-09-10,F,,,,,43.34Z,NAFRev2,N,3.652803,49.727741,0.94,housenumber,12 Rue du Calvaire 02270 Bois-lès-Pargny,02096_0006_00012,G,12 RUE DU CALVAIRE,
493955215,00014,49395521500014,O,2007-02-01,,,,2019-11-14T14:00:12,false,3,,1,,RUE,DE LIEGE,02270,BOIS-LES-PARGNY,,,02096,,,,,,,,,,,,,,,,,,,2011-08-11,F,,,,,86.90F,NAFRev2,N,3.649133,49.731387,0.94,housenumber,1 Rue de Liège 02270 Bois-lès-Pargny,02096_0016_00001,G,1 RUE DE LIEGE,
501336838,00013,50133683800013,O,2008-01-02,NN,,,2019-11-14T14:00:12,false,3,,14,,RUE,DU PRE,02270,BOIS-LES-PARGNY,,,02096,,,,,,,,,,,,,,,,,,,2011-03-01,F,,,,,43.21A,NAFRev2,O,3.646394,49.73099,0.94,housenumber,14 Rue du Pré 02270 Bois-lès-Pargny,02096_0030_00014,G,14 RUE DU PRE,
512708553,00023,51270855300023,O,2010-12-10,NN,,,2021-10-27T08:19:39,true,3,,18,,RUE,DE LIEGE,02270,BOIS-LES-PARGNY,,,02096,,,,,,,,,,,,,,,,,,,2019-12-09,F,,,,,82.99Z,NAFRev2,O,3.652469,49.729822,0.94,housenumber,18 Rue de Liège 02270 Bois-lès-Pargny,02096_0016_00018,G,18 RUE DE LIEGE,
519055990,00013,51905599000013,O,2010-01-23,,,,2019-11-14T14:00:12,true,1,,2,,RUE,DE LIEGE,02270,BOIS-LES-PARGNY,,,02096,,,,,,,,,,,,,,,,,,,2010-01-23,A,CELEN RENOV,,,,43.99D,NAFRev2,N,3.650266,49.730905,0.94,housenumber,2 Rue de Liège 02270 Bois-lès-Pargny,02096_0016_00002,G,2 RUE DE LIEGE,
521988261,00017,52198826100017,O,2010-04-26,,,8121ZZ,2022-03-18T19:35:27,true,5,,24,,RUE,DE LIEGE,02270,BOIS-LES-PARGNY,,,02096,,,,,,,,,,,,,,,,,,,2022-04-01,A,,,,,81.21Z,NAFRev2,N,3.653461,49.729587,0.94,housenumber,24 Rue de Liège 02270 Bois-lès-Pargny,02096_0016_00024,G,24 RUE DE LIEGE,
525192134,00019,52519213400019,O,2010-08-05,,,,2022-07-28T15:51:03,false,2,,14,,RUE,DU PRE,02270,BOIS-LES-PARGNY,,,02096,,,,,,,,,,,,,,,,,,,2022-06-13,F,,,,,68.20B,NAFRev2,N,3.646394,49.73099,0.94,housenumber,14 Rue du Pré 02270 Bois-lès-Pargny,02096_0030_00014,G,14 RUE DU PRE,
529404212,00035,52940421200035,O,2012-10-16,,,,2021-09-15T10:09:40,true,3,,11,,RUE,DE LIEGE,02270,BOIS-LES-PARGNY,,,02096,,,,,,,,,,,,,,,,,,,2021-08-06,A,,,,,96.09Z,NAFRev2,N,3.652223,49.729963,0.94,housenumber,11 Rue de Liège 02270 Bois-lès-Pargny,02096_0016_00011,G,11 RUE DE LIEGE,
537490187,00011,53749018700011,O,2011-04-20,,,,2019-11-14T14:00:12,true,1,,6,,RUE,LOUIS FRAIX,02270,BOIS-LES-PARGNY,,,02096,,,,,,,,,,,,,,,,,,,2011-04-20,A,,,,,46.18Z,NAFRev2,N,3.650944,49.731507,0.94,housenumber,6 Rue Louis Fraix 02270 Bois-lès-Pargny,02096_0019_00006,G,6 RUE LOUIS FRAIX,
601670292,00015,60167029200015,O,,NN,,,2019-11-14T14:00:12,true,1,,,,,,02270,BOIS-LES-PARGNY,,,02096,,,,,,,,,,,,,,,,,,,1987-05-13,F,,,,,01.80,NAP,N,,,0,,,,,,
681670915,00013,68167091500013,O,,,,,2019-11-14T14:00:12,true,1,,,,RUE,DU PRE,02270,BOIS-LES-PARGNY,,,02096,,,,,,,,,,,,,,,,,,,,F,,,,,67.07,NAP,N,3.646131,49.730876,0.94,street,Rue du Pré 02270 Bois-lès-Pargny,02096_0030,G,RUE DU PRE,
797728292,00013,79772829200013,O,2012-04-30,,,,2019-11-14T14:00:12,true,1,,5,,,RUE DE LIEGE,02270,BOIS-LES-PARGNY,,,02096,,,,,,,,,,,,,,,,,,,2012-04-30,A,,,,,47.99A,NAFRev2,N,3.651336,49.730341,0.94,housenumber,5 Rue de Liège 02270 Bois-lès-Pargny,02096_0016_00005,G,5 RUE DE LIEGE,
802934810,00010,80293481000010,O,2014-06-12,,,,2019-11-14T14:00:12,true,1,,2,,RUE,DU PRE,02270,BOIS-LES-PARGNY,,,02096,,,,,,,,,,,,,,,,,,,2014-06-12,A,,,,,70.10Z,NAFRev2,N,3.64849,49.731847,0.94,housenumber,2 Rue du Pré 02270 Bois-lès-Pargny,02096_0030_00002,G,2 RUE DU PRE,
802946491,00015,80294649100015,O,2014-06-14,,,,2019-11-14T14:00:12,true,1,,10,,RUE,LOUIS FRAIX,02270,BOIS-LES-PARGNY,,,02096,,,,,,,,,,,,,,,,,,,2014-06-14,A,,,,,70.10Z,NAFRev2,N,3.651555,49.731925,0.94,housenumber,10 Rue Louis Fraix 02270 Bois-lès-Pargny,02096_0019_00010,G,10 RUE LOUIS FRAIX,
808807523,00010,80880752300010,O,2015-01-01,,,,2019-11-14T14:00:12,true,1,,15,,RUE,MARCEL CARLIER,02270,BOIS-LES-PARGNY,,,02096,,,,,,,,,,,,,,,,,,,2015-01-01,A,,,,,95.11Z,NAFRev2,N,3.647188,49.730268,0.94,housenumber,15 Rue Marcel Carlier 02270 Bois-lès-Pargny,02096_0020_00015,G,15 RUE MARCEL CARLIER,
808880975,00020,80888097500020,O,2018-11-16,,,9003AP,2020-02-04T04:10:31,true,4,,8,,RUE,GEORGES LANDA,02270,BOIS-LES-PARGNY,,,02096,,,,,,,,,,,,,,,,,,,2020-01-31,F,COLETTE ET CHARLIE,,,LEJUSTE CHARLOTTE,90.03A,NAFRev2,N,3.64885,49.732592,0.94,housenumber,8 Rue Georges Landa 02270 Bois-lès-Pargny,02096_0013_00008,G,8 RUE GEORGES LANDA,
831219647,00011,83121964700011,O,2017-08-01,,,,2022-09-04T03:37:29,true,2,,9,,RUE,MARCEL CARLIER,02270,BOIS-LES-PARGNY,,,02096,,,,,,,,,,,,,,,,,,,2018-05-17,F,,,,,64.19Z,NAFRev2,N,3.648082,49.731008,0.94,housenumber,9 Rue Marcel Carlier 02270 Bois-lès-Pargny,02096_0020_00009,G,9 RUE MARCEL CARLIER,
833031495,00017,83303149500017,O,2017-12-01,,,,2022-10-21T04:10:51,false,2,,1,,RUE,MARCEL CARLIER,02270,BOIS-LES-PARGNY,,,02096,,,,,,,,,,,,,,,,,,,2022-03-01,F,,,,,86.90D,NAFRev2,N,3.649066,49.731199,0.94,housenumber,1 Rue Marcel Carlier 02270 Bois-lès-Pargny,02096_0020_00001,G,1 RUE MARCEL CARLIER,
841400690,00019,84140069000019,O,2018-08-01,,,9602AB,2019-11-14T14:00:12,true,1,,1,,RUE,DU CALVAIRE,02270,BOIS-LES-PARGNY,,,02096,,,,,,,,,,,,,,,,,,,2018-08-01,A,,,,M'COIFFER A DOMICILE,96.02A,NAFRev2,N,3.653683,49.729269,0.94,housenumber,1 Rue du Calvaire 02270 Bois-lès-Pargny,02096_0006_00001,G,1 RUE DU CALVAIRE,
851929406,00037,85192940600037,O,2022-10-01,,,,2022-10-28T10:21:02,false,1,PDL 2 PARCELLE ZL 12,,,,LA FONTAINE A FOURNEAUX,02270,BOIS-LES-PARGNY,,,02096,,,,,,,,,,,,,,,,,,,2022-10-01,A,PARC EOLIEN DES QUATRE JALLOIS 2,,,,35.11Z,NAFRev2,N,,,0,,,,,,
880230610,00011,88023061000011,O,2020-01-01,,,1392ZC,2022-04-02T13:25:13,true,2,,8,,RUE,GEORGES LANDA,02270,BOIS-LES-PARGNY,,,02096,,,,,,,,,,,,,,,,,,,2020-03-01,A,,,,,13.92Z,NAFRev2,N,3.64885,49.732592,0.94,housenumber,8 Rue Georges Landa 02270 Bois-lès-Pargny,02096_0013_00008,G,8 RUE GEORGES LANDA,
889584751,00016,88958475100016,O,2020-10-05,,,,2020-10-15T17:39:40,true,1,,7,,RLE,DE CRECY,02270,BOIS-LES-PARGNY,,,02096,,,,,,,,,,,,,,,,,,,2020-10-05,A,,,,,47.91B,NAFRev2,N,3.650776,49.729575,0.8,housenumber,7 Ruelle de Crecy sur Serre 02270 Bois-lès-Pargny,02096_dqn777_00007,G,7 RUELLE DE CRECY SUR SERRE,
890225485,00014,89022548500014,O,2020-10-21,,,,2020-10-22T04:04:31,true,1,,13,,RUE,DE LIEGE,02270,BOIS-LES-PARGNY,,,02096,,,,,,,,,,,,,,,,,,,2020-10-21,A,,,,,96.09Z,NAFRev2,N,3.653056,49.72973,0.94,housenumber,13 Rue de Liège 02270 Bois-lès-Pargny,02096_0016_00013,G,13 RUE DE LIEGE,
903887669,00013,90388766900013,O,2021-09-21,,,,2022-10-08T03:48:51,true,2,,11,,RUE,DE LIEGE,02270,BOIS-LES-PARGNY,,,02096,,,,,,,,,,,,,,,,,,,2022-06-30,F,,,,,62.01Z,NAFRev2,N,3.652223,49.729963,0.94,housenumber,11 Rue de Liège 02270 Bois-lès-Pargny,02096_0016_00011,G,11 RUE DE LIEGE,
911813442,00017,91181344200017,O,2022-03-22,,,,2022-03-29T04:21:08,true,1,,12,,RUE,LOUIS FRAIX,02270,BOIS-LES-PARGNY,,,02096,,,,,,,,,,,,,,,,,,,2022-03-22,A,,,,,68.20A,NAFRev2,N,3.65188,49.732205,0.94,housenumber,12 Rue Louis Fraix 02270 Bois-lès-Pargny,02096_0019_00012,G,12 RUE LOUIS FRAIX,
912211620,00014,91221162000014,O,2022-04-05,,,4391BZ,2022-06-17T08:36:36,true,2,,12,,RUE,LOUIS FRAIX,02270,BOIS-LES-PARGNY,,,02096,,,,,,,,,,,,,,,,,,,2022-05-01,A,,,,,43.91B,NAFRev2,O,3.65188,49.732205,0.94,housenumber,12 Rue Louis Fraix 02270 Bois-lès-Pargny,02096_0019_00012,G,12 RUE LOUIS FRAIX,
913636296,00018,91363629600018,O,2022-05-17,,,,2022-05-18T10:35:20,true,1,,7,,RLE,DE CRECY SUR SERRE,02270,BOIS-LES-PARGNY,,,02096,,,,,,,,,,,,,,,,,,,2022-05-17,A,,,,,47.91A,NAFRev2,N,3.650776,49.729575,0.86,housenumber,7 Ruelle de Crecy sur Serre 02270 Bois-lès-Pargny,02096_dqn777_00007,G,7 RUELLE DE CRECY SUR SERRE,
920573482,00014,92057348200014,O,2022-11-01,,,,2023-02-22T08:38:59,true,2,,12,,RUE,LOUIS FRAIX,02270,BOIS-LES-PARGNY,,,02096,,,,,,,,,,,,,,,,,,,2023-02-20,A,,,,,46.73A,NAFRev2,O,3.65188,49.732205,0.94,housenumber,12 Rue Louis Fraix 02270 Bois-lès-Pargny,02096_0019_00012,G,12 RUE LOUIS FRAIX,
920757606,00016,92075760600016,O,2022-05-05,,,,2022-10-25T11:05:00,true,1,,5,,RLE,DE CRECY,02270,BOIS-LES-PARGNY,,,02096,,,,,,,,,,,,,,,,,,,2022-05-05,A,,,,,35.11Z,NAFRev2,N,3.651022,49.729733,0.8,housenumber,5 Ruelle de Crecy sur Serre 02270 Bois-lès-Pargny,02096_dqn777_00005,G,5 RUELLE DE CRECY SUR SERRE,
