siren,nic,siret,statutDiffusionEtablissement,dateCreationEtablissement,trancheEffectifsEtablissement,anneeEffectifsEtablissement,activitePrincipaleRegistreMetiersEtablissement,dateDernierTraitementEtablissement,etablissementSiege,nombrePeriodesEtablissement,complementAdresseEtablissement,numeroVoieEtablissement,indiceRepetitionEtablissement,typeVoieEtablissement,libelleVoieEtablissement,codePostalEtablissement,libelleCommuneEtablissement,libelleCommuneEtrangerEtablissement,distributionSpecialeEtablissement,codeCommuneEtablissement,codeCedexEtablissement,libelleCedexEtablissement,codePaysEtrangerEtablissement,libellePaysEtrangerEtablissement,complementAdresse2Etablissement,numeroVoie2Etablissement,indiceRepetition2Etablissement,typeVoie2Etablissement,libelleVoie2Etablissement,codePostal2Etablissement,libelleCommune2Etablissement,libelleCommuneEtranger2Etablissement,distributionSpeciale2Etablissement,codeCommune2Etablissement,codeCedex2Etablissement,libelleCedex2Etablissement,codePaysEtranger2Etablissement,libellePaysEtranger2Etablissement,dateDebut,etatAdministratifEtablissement,enseigne1Etablissement,enseigne2Etablissement,enseigne3Etablissement,denominationUsuelleEtablissement,activitePrincipaleEtablissement,nomenclatureActivitePrincipaleEtablissement,caractereEmployeurEtablissement,longitude,latitude,geo_score,geo_type,geo_adresse,geo_id,geo_ligne,geo_l4,geo_l5
210205811,00016,21020581100016,O,1983-03-01,03,2020,,2022-08-29T09:05:41,true,4,,,,RUE,DU CHATEAU,02240,PLEINE-SELVE,,,02605,,,,,,,,,,,,,,,,,,,2014-01-27,A,MAIRIE,,,,84.11Z,NAFRev2,O,3.528163,49.792592,0.94,street,Rue du Chateau 02240 Pleine-Selve,02605_0013,G,RUE DU CHATEAU,
260205927,00015,26020592700015,O,1983-03-01,NN,,,2019-11-14T14:00:13,true,4,MAIRIE,,,,,02240,PLEINE-SELVE,,,02605,,,,,,,,,,,,,,,,,,,2016-01-01,F,CCAS,,,,88.99B,NAFRev2,N,,,0,,,,,,
304996838,00021,30499683800021,O,,,,,2019-11-14T14:00:13,true,1,,6,,RUE,DU BATTI,02240,PLEINE-SELVE,,,02605,,,,,,,,,,,,,,,,,,,1988-12-31,F,,,,,55.60,NAP,N,3.529975,49.792696,0.57,housenumber,6 Rue des Batis 02240 Pleine-Selve,02605_0005_00006,G,6 RUE DES BATIS,
312112030,00019,31211203000019,O,,NN,,,2019-11-14T14:00:13,true,1,,,,RUE,DU CHATEAU,02240,PLEINE-SELVE,,,02605,,,,,,,,,,,,,,,,,,,1994-02-21,F,,,,,67.07,NAP,N,3.528163,49.792592,0.94,street,Rue du Chateau 02240 Pleine-Selve,02605_0013,G,RUE DU CHATEAU,
313064503,00037,31306450300037,O,,NN,,,2019-11-14T14:00:13,true,1,,,,RUE,DU CHATEAU,02240,PLEINE-SELVE,,,02605,,,,,,,,,,,,,,,,,,,,F,,,,,55.72,NAP,N,3.528163,49.792592,0.94,street,Rue du Chateau 02240 Pleine-Selve,02605_0013,G,RUE DU CHATEAU,
313183444,00014,31318344400014,O,,,,,2019-11-14T14:00:13,true,1,,,,,FERME DE PARPE LA COUR,02240,PLEINE-SELVE,,,02605,,,,,,,,,,,,,,,,,,,1990-04-01,F,,,,,01.3Z,NAF1993,N,3.523984,49.790267,0.75,street,Rue de Parpe-la-Cour 02240 Pleine-Selve,02605_0045,G,RUE DE PARPE LA COUR,
319844361,00026,31984436100026,O,1999-01-01,NN,,,2019-11-14T14:00:13,true,1,,14,,RUE,PARPE LA COUR,02240,PLEINE-SELVE,,,02605,,,,,,,,,,,,,,,,,,,2001-06-30,F,,,,,93.0N,NAF1993,N,3.520617,49.788685,0.93,housenumber,14 Rue de Parpe-la-Cour 02240 Pleine-Selve,02605_0045_00014,G,14 RUE DE PARPE LA COUR,
325173508,00012,32517350800012,O,1982-07-01,NN,,4391BZ,2019-11-14T14:00:13,true,5,,,,RUE,DU CHATEAU,02240,PLEINE-SELVE,,,02605,,,,,,,,,,,,,,,,,,,2016-11-25,F,,,,,43.91B,NAFRev2,N,3.528163,49.792592,0.94,street,Rue du Chateau 02240 Pleine-Selve,02605_0013,G,RUE DU CHATEAU,
330287830,00013,33028783000013,O,,NN,,,2019-11-14T14:00:13,true,1,,,,RUE,DU CHATEAU,02240,PLEINE-SELVE,,,02605,,,,,,,,,,,,,,,,,,,1992-09-30,F,,,,,55.4B,NAF1993,N,3.528163,49.792592,0.94,street,Rue du Chateau 02240 Pleine-Selve,02605_0013,G,RUE DU CHATEAU,
333364891,00015,33336489100015,O,,,,,2019-11-14T14:00:13,true,1,,,,,,02240,PLEINE-SELVE,,,02605,,,,,,,,,,,,,,,,,,,1990-04-01,F,,,,,01.1A,NAF1993,N,,,0,,,,,,
378384044,00020,37838404400020,O,1995-07-01,NN,,,2019-11-14T14:00:13,true,3,,14,,RUE,PARPE LA COUR,02240,PLEINE-SELVE,,,02605,,,,,,,,,,,,,,,,,,,2008-01-01,A,,,,,01.11Z,NAFRev2,N,3.520617,49.788685,0.93,housenumber,14 Rue de Parpe-la-Cour 02240 Pleine-Selve,02605_0045_00014,G,14 RUE DE PARPE LA COUR,
378441745,00015,37844174500015,O,1990-05-01,NN,,,2019-11-14T14:00:13,true,3,,12,,RUE,DES BATIS,02240,PLEINE-SELVE,,,02605,,,,,,,,,,,,,,,,,,,2008-01-01,A,,,,,01.11Z,NAFRev2,N,3.531082,49.792397,0.94,housenumber,12 Rue des Batis 02240 Pleine-Selve,02605_0005_00012,G,12 RUE DES BATIS,
380563189,00014,38056318900014,O,1990-04-01,01,2020,,2022-08-29T09:07:41,true,4,,,,,FERME DE PARPE LA COUR,02240,PLEINE-SELVE,,,02605,,,,,,,,,,,,,,,,,,,2012-12-31,A,,,,,01.11Z,NAFRev2,O,3.523984,49.790267,0.75,street,Rue de Parpe-la-Cour 02240 Pleine-Selve,02605_0045,G,RUE DE PARPE LA COUR,
390126662,00019,39012666200019,O,1993-01-01,NN,,4399CZ,2020-01-14T03:56:40,true,6,,,,,,02240,PLEINE-SELVE,,,02605,,,,,,,,,,,,,,,,,,,2019-12-31,F,,,,,43.99C,NAFRev2,N,,,0,,,,,,
390427656,00025,39042765600025,O,1994-11-01,NN,,,2019-11-14T14:00:13,false,4,,5,,RUE,DU CHATEAU,02240,PLEINE-SELVE,,,02605,,,,,,,,,,,,,,,,,,,2001-10-25,F,,,,,85.1C,NAF1993,N,3.527827,49.791792,0.94,housenumber,5 Rue du Chateau 02240 Pleine-Selve,02605_0013_00005,G,5 RUE DU CHATEAU,
394347090,00018,39434709000018,O,1994-04-02,NN,,,2019-11-14T14:00:13,true,3,,,,RUE,DU CHATEAU,02240,PLEINE-SELVE,,,02605,,,,,,,,,,,,,,,,,,,1996-12-25,F,,,,,55.4B,NAF1993,O,3.528163,49.792592,0.94,street,Rue du Chateau 02240 Pleine-Selve,02605_0013,G,RUE DU CHATEAU,
408874071,00017,40887407100017,O,1957-11-11,NN,,,2019-11-14T14:00:13,true,3,,1,,RUE,PARPE LA COUR,02240,PLEINE-SELVE,,,02605,,,,,,,,,,,,,,,,,,,2008-01-01,A,,,,,01.11Z,NAFRev2,N,3.523647,49.790224,0.93,housenumber,1 Rue de Parpe-la-Cour 02240 Pleine-Selve,02605_0045_00001,G,1 RUE DE PARPE LA COUR,
408874170,00017,40887417000017,O,,NN,,,2019-11-14T14:00:13,true,1,,,,,,02240,PLEINE-SELVE,,,02605,,,,,,,,,,,,,,,,,,,1996-12-30,F,,,,,01.1A,NAF1993,N,,,0,,,,,,
408874188,00019,40887418800019,O,1973-10-01,NN,,,2019-11-14T14:00:13,true,1,,,,,,02240,PLEINE-SELVE,,,02605,,,,,,,,,,,,,,,,,,,1998-03-31,F,,,,,01.1A,NAF1993,N,,,0,,,,,,
409855053,00016,40985505300016,O,1995-07-22,NN,,,2019-11-14T14:00:13,true,1,,14,,RUE,DE PARPE LE COUR,02240,PLEINE-SELVE,,,02605,,,,,,,,,,,,,,,,,,,2002-10-14,F,,,,,70.2B,NAF1993,N,3.520617,49.788685,0.83,housenumber,14 Rue de Parpe-la-Cour 02240 Pleine-Selve,02605_0045_00014,G,14 RUE DE PARPE LA COUR,
410944946,00012,41094494600012,O,1997-01-01,NN,,,2019-11-14T14:00:13,true,3,,,,RUE,FREDERIC DURAIN,02240,PLEINE-SELVE,,,02605,,,,,,,,,,,,,,,,,,,2008-01-01,A,,,,,01.11Z,NAFRev2,N,3.526698,49.793423,0.94,street,Rue Frédéric Durain 02240 Pleine-Selve,02605_0020,G,RUE FREDERIC DURAIN,
417771987,00019,41777198700019,O,1998-02-01,NN,,,2022-07-02T04:03:39,true,4,MR RICHEZ JEAN PIERRE,11,,RUE,DES BATIES,02240,PLEINE-SELVE,,,02605,,,,,,,,,,,,,,,,,,,2014-01-19,A,,,,,01.11Z,NAFRev2,O,3.531002,49.792311,0.84,housenumber,11 Rue des Batis 02240 Pleine-Selve,02605_0005_00011,G,11 RUE DES BATIS,
419863675,00015,41986367500015,O,1998-04-01,NN,,,2022-08-16T11:00:40,true,3,,11,,RUE,DES BATIES,02240,PLEINE-SELVE,,,02605,,,,,,,,,,,,,,,,,,,2008-01-01,A,,,,,01.11Z,NAFRev2,N,3.531002,49.792311,0.84,housenumber,11 Rue des Batis 02240 Pleine-Selve,02605_0005_00011,G,11 RUE DES BATIS,
419863675,00023,41986367500023,O,2021-09-10,,,,2021-09-28T08:57:50,false,1,,10,,RUE,DES BATIES,02240,PLEINE-SELVE,,,02605,,,,,,,,,,,,,,,,,,,2021-09-10,A,,,,,35.11Z,NAFRev2,N,3.530589,49.792518,0.84,housenumber,10 Rue des Batis 02240 Pleine-Selve,02605_0005_00010,G,10 RUE DES BATIS,
424271062,00012,42427106200012,O,1999-07-01,NN,,,2019-11-14T14:00:13,true,3,,15,,RUE,DES BATIS,02240,PLEINE-SELVE,,,02605,,,,,,,,,,,,,,,,,,,2004-12-02,F,,,,,01.1A,NAFRev1,N,3.531834,49.792075,0.94,housenumber,15 Rue des Batis 02240 Pleine-Selve,02605_0005_00015,G,15 RUE DES BATIS,
438186611,00010,43818661100010,O,2001-07-02,NN,,,2019-11-14T14:00:13,true,4,,19,,RUE,DU CHATEAU,02240,PLEINE-SELVE,,,02605,,,,,,,,,,,,,,,,,,,2005-02-04,F,,,,,45.2V,NAFRev1,N,3.529027,49.793078,0.94,housenumber,19 Rue du Chateau 02240 Pleine-Selve,02605_0013_00019,G,19 RUE DU CHATEAU,
441178274,00011,44117827400011,O,2002-02-24,NN,,,2019-11-14T14:00:13,true,3,,8,,RUE,GRAND'COUR,02240,PLEINE-SELVE,,,02605,,,,,,,,,,,,,,,,,,,2008-01-01,A,,,,,68.20B,NAFRev2,N,3.525316,49.790468,0.94,housenumber,8 Rue Grand Cour 02240 Pleine-Selve,02605_b030_00008,G,8 RUE GRAND COUR,
442090163,00175,44209016300175,O,2016-11-25,,,,2019-11-14T14:00:13,false,1,WPD SAS PARC DE PLEINE SELVE LD,,,,LE BUISSON L ALLEMAND,02240,PLEINE-SELVE,,,02605,,,,,,,,,,,,,,,,,,,2016-11-25,A,,,,,35.11Z,NAFRev2,N,3.523984,49.790267,0.39,street,Rue de Parpe-la-Cour 02240 Pleine-Selve,02605_0045,D,RUE DE PARPE LA COUR,
450228788,00011,45022878800011,O,2001-09-15,NN,,,2019-11-14T14:00:13,true,7,,1,,RUE,DES BATIES,02240,PLEINE-SELVE,,,02605,,,,,,,,,,,,,,,,,,,2011-06-30,A,,,,,90.01Z,NAFRev2,N,3.529104,49.79295,0.83,housenumber,1 Rue des Batis 02240 Pleine-Selve,02605_0005_00001,G,1 RUE DES BATIS,
481091338,00022,48109133800022,O,2006-05-15,NN,,,2019-11-14T14:00:13,true,2,,19,,RUE,DU CHATEAU,02240,PLEINE-SELVE,,,02605,,,,,,,,,,,,,,,,,,,2007-03-16,F,,,,,45.2V,NAFRev1,N,3.529027,49.793078,0.94,housenumber,19 Rue du Chateau 02240 Pleine-Selve,02605_0013_00019,G,19 RUE DU CHATEAU,
484599220,00049,48459922000049,O,2010-03-31,,,,2020-11-25T03:36:28,false,2,,4,,RUE,FREDERIC DURAIN,02240,PLEINE-SELVE,,,02605,,,,,,,,,,,,,,,,,,,2020-10-31,F,,,,,01.11Z,NAFRev2,N,3.526671,49.793259,0.94,housenumber,4 Rue Frédéric Durain 02240 Pleine-Selve,02605_0020_00004,G,4 RUE FREDERIC DURAIN,
488793209,00013,48879320900013,O,2006-03-01,NN,,,2019-11-14T14:00:13,true,2,,8,,RUE,DES BATIES,02240,PLEINE-SELVE,,,02605,,,,,,,,,,,,,,,,,,,2006-10-06,F,,,,,45.2V,NAFRev1,N,3.530141,49.792642,0.83,housenumber,8 Rue des Batis 02240 Pleine-Selve,02605_0005_00008,G,8 RUE DES BATIS,
492689468,00014,49268946800014,O,2006-11-21,NN,,4391BZ,2023-02-27T08:38:57,true,6,,3,T,RUE,DU CHATEAU,02240,PLEINE-SELVE,,,02605,,,,,,,,,,,,,,,,,,,2023-01-31,A,,,,,43.91B,NAFRev2,N,3.52776,49.791754,0.84,housenumber,3ter Rue du Chateau 02240 Pleine-Selve,02605_0013_00003_ter,G,3TER RUE DU CHATEAU,
499675825,00016,49967582500016,O,2007-09-01,,,9602AA,2022-09-30T04:24:43,true,3,,23,,RUE,DES BATIES,02240,PLEINE-SELVE,,,02605,,,,,,,,,,,,,,,,,,,2022-08-29,F,CL'HAIRS COIFFURE,,,,96.02A,NAFRev2,N,3.533253,49.791658,0.84,housenumber,23 Rue des Batis 02240 Pleine-Selve,02605_0005_00023,G,23 RUE DES BATIS,
501902407,00011,50190240700011,O,2007-10-18,,,,2019-11-14T14:00:13,true,1,,14,,RUE,PARPE LA COUR,02240,PLEINE-SELVE,,,02605,,,,,,,,,,,,,,,,,,,2007-10-18,A,,,,,68.20A,NAFRev2,N,3.520617,49.788685,0.93,housenumber,14 Rue de Parpe-la-Cour 02240 Pleine-Selve,02605_0045_00014,G,14 RUE DE PARPE LA COUR,
502091929,00013,50209192900013,O,2008-01-02,,,,2019-11-14T14:00:13,true,2,,8,B,RUE,DU CHATEAU,02240,PLEINE-SELVE,,,02605,,,,,,,,,,,,,,,,,,,2011-02-28,F,,,,,46.34Z,NAFRev2,N,3.527185,49.792098,0.84,housenumber,8bis Rue du Chateau 02240 Pleine-Selve,02605_0013_00008_bis,G,8BIS RUE DU CHATEAU,
504544123,00012,50454412300012,O,2008-05-07,01,2020,,2022-08-29T09:08:26,true,2,,11,,RUE,DES BATIES,02240,PLEINE-SELVE,,,02605,,,,,,,,,,,,,,,,,,,2015-01-11,A,,,,,74.90B,NAFRev2,O,3.531002,49.792311,0.84,housenumber,11 Rue des Batis 02240 Pleine-Selve,02605_0005_00011,G,11 RUE DES BATIS,
515366490,00016,51536649000016,O,2009-10-11,,,,2019-11-14T14:00:13,true,2,,1,,RUE,DES BATIES,02240,PLEINE-SELVE,,,02605,,,,,,,,,,,,,,,,,,,2012-10-25,F,,,,,96.02B,NAFRev2,N,3.529104,49.79295,0.83,housenumber,1 Rue des Batis 02240 Pleine-Selve,02605_0005_00001,G,1 RUE DES BATIS,
530685064,00012,53068506400012,O,2011-02-17,,,,2021-02-23T15:49:14,true,1,,1,,RUE,DES BATIES,02240,PLEINE-SELVE,,,02605,,,,,,,,,,,,,,,,,,,2011-02-17,A,,,,,93.29Z,NAFRev2,N,3.529104,49.79295,0.83,housenumber,1 Rue des Batis 02240 Pleine-Selve,02605_0005_00001,G,1 RUE DES BATIS,
533279345,00011,53327934500011,O,2011-06-24,,,,2019-11-14T14:00:13,true,1,,5,,RUE,DU CHATEAU,02240,PLEINE-SELVE,,,02605,,,,,,,,,,,,,,,,,,,2011-06-24,A,,,,,68.20B,NAFRev2,N,3.527827,49.791792,0.94,housenumber,5 Rue du Chateau 02240 Pleine-Selve,02605_0013_00005,G,5 RUE DU CHATEAU,
537715963,00014,53771596300014,O,2011-11-07,,,4332AB,2021-08-07T08:43:39,false,2,,8,,RUE,DU CHATEAU,02240,PLEINE-SELVE,,,02605,,,,,,,,,,,,,,,,,,,2021-07-16,F,,,,ETS VIEIRA FERMETURES,43.32A,NAFRev2,N,3.527259,49.792005,0.94,housenumber,8 Rue du Chateau 02240 Pleine-Selve,02605_0013_00008,G,8 RUE DU CHATEAU,
753637362,00017,75363736200017,O,2011-06-08,,,,2019-11-14T14:00:13,true,2,,1,,RUE,DU CHATEAU,02240,PLEINE-SELVE,,,02605,,,,,,,,,,,,,,,,,,,2016-05-25,F,,,,,93.19Z,NAFRev2,N,3.527346,49.791247,0.94,housenumber,1 Rue du Chateau 02240 Pleine-Selve,02605_0013_00001,G,1 RUE DU CHATEAU,
780206934,00017,78020693400017,O,,,,,2019-11-14T14:00:13,true,1,,,,,,02240,PLEINE-SELVE,,,02605,,,,,,,,,,,,,,,,,,,1992-12-31,F,,,,,45.2V,NAF1993,N,,,0,,,,,,
780206942,00010,78020694200010,O,,,,,2019-11-14T14:00:13,true,1,,,,,,02240,PLEINE-SELVE,,,02605,,,,,,,,,,,,,,,,,,,1984-12-25,F,,,,,67.04,NAP,N,,,0,,,,,,
790026199,00022,79002619900022,O,2013-05-07,,,4322AZ,2019-11-14T14:00:13,false,2,,5,,RUE,DE L'ANNEAU,02240,PLEINE-SELVE,,,02605,,,,,,,,,,,,,,,,,,,2013-12-05,F,,,,PLOMBERIE SERVICE,43.22A,NAFRev2,N,3.527435,49.790796,0.94,housenumber,5 Rue de l’Anneau 02240 Pleine-Selve,02605_dkk7wl_00005,G,5 RUE DE L ANNEAU,
800179913,00036,80017991300036,O,2017-04-20,,,3109BA,2019-11-14T14:00:13,true,2,,3,,RUE,DE LANNEAU,02240,PLEINE-SELVE,,,02605,,,,,,,,,,,,,,,,,,,2017-11-01,F,,,,PATE VINCENT,31.09B,NAFRev2,N,3.52845,49.790535,0.82,street,La Rue de Lanneau 02240 Pleine-Selve,02605_B027,G,LA RUE DE LANNEAU,
809212509,00016,80921250900016,O,2015-01-01,,,,2022-07-02T04:03:40,true,2,,11,,RUE,DES BATIS,02240,PLEINE-SELVE,,,02605,,,,,,,,,,,,,,,,,,,2022-04-30,F,,,,,01.11Z,NAFRev2,N,3.531002,49.792311,0.94,housenumber,11 Rue des Batis 02240 Pleine-Selve,02605_0005_00011,G,11 RUE DES BATIS,
823011267,00015,82301126700015,O,2016-10-06,,,,2019-11-14T14:00:13,true,1,,3,,RUE,DE PARPE LA COUR,02240,PLEINE-SELVE,,,02605,,,,,,,,,,,,,,,,,,,2016-10-06,A,,,,,68.20B,NAFRev2,N,3.523199,49.789855,0.94,housenumber,3 Rue de Parpe-la-Cour 02240 Pleine-Selve,02605_0045_00003,G,3 RUE DE PARPE LA COUR,
842054371,00013,84205437100013,O,2018-07-27,,,,2019-11-14T14:00:13,true,1,,12,,RUE,DES BATIS,02240,PLEINE-SELVE,,,02605,,,,,,,,,,,,,,,,,,,2018-07-27,A,,,,,01.61Z,NAFRev2,N,3.531082,49.792397,0.94,housenumber,12 Rue des Batis 02240 Pleine-Selve,02605_0005_00012,G,12 RUE DES BATIS,
848003695,00014,84800369500014,O,2019-02-01,,,,2020-10-14T08:35:46,true,3,,8,,RUE,DE PARPE LA COUR,02240,PLEINE-SELVE,,,02605,,,,,,,,,,,,,,,,,,,2020-10-08,A,,,,,47.99A,NAFRev2,N,3.524122,49.79022,0.94,housenumber,8 Rue de Parpe-la-Cour 02240 Pleine-Selve,02605_0045_00008,G,8 RUE DE PARPE LA COUR,
853148450,00010,85314845000010,O,2019-07-27,,,,2019-11-14T14:00:13,true,1,,3,,RUE,DE LANNEAU,02240,PLEINE-SELVE,,,02605,,,,,,,,,,,,,,,,,,,2019-07-27,A,,,,,47.99A,NAFRev2,N,3.52845,49.790535,0.82,street,La Rue de Lanneau 02240 Pleine-Selve,02605_B027,G,LA RUE DE LANNEAU,
887873826,00010,88787382600010,O,2020-08-04,,,4312AZ,2020-10-10T04:08:32,true,1,,14,,RUE,DES BATIES,02240,PLEINE-SELVE,,,02605,,,,,,,,,,,,,,,,,,,2020-08-04,A,,,,,81.30Z,NAFRev2,N,3.531265,49.792336,0.84,housenumber,14 Rue des Batis 02240 Pleine-Selve,02605_0005_00014,G,14 RUE DES BATIS,
888633484,00017,88863348400017,O,2020-08-27,,,,2022-01-14T08:48:51,true,3,,1,,RUE,DES BATIES,02240,PLEINE-SELVE,,,02605,,,,,,,,,,,,,,,,,,,2021-08-07,A,,,,KISS MUSIC PROD,90.01Z,NAFRev2,O,3.529104,49.79295,0.83,housenumber,1 Rue des Batis 02240 Pleine-Selve,02605_0005_00001,G,1 RUE DES BATIS,
892641952,00015,89264195200015,O,2021-01-02,,,1392ZC,2021-01-07T08:52:13,true,1,,1,B,RUE,DE PARPE LA COUR,02240,PLEINE-SELVE,,,02605,,,,,,,,,,,,,,,,,,,2021-01-02,A,,,,KREADIZA,13.92Z,NAFRev2,N,3.524278,49.790453,0.86,housenumber,1bis Rue de Parpe-la-Cour 02240 Pleine-Selve,02605_0045_00001_bis,G,1BIS RUE DE PARPE LA COUR,
897407508,00018,89740750800018,O,2021-04-01,,,,2021-03-23T04:57:19,true,1,,5,,RUE,DU CHATEAU,02240,PLEINE-SELVE,,,02605,,,,,,,,,,,,,,,,,,,2021-04-01,A,,,,,55.20Z,NAFRev2,N,3.527827,49.791792,0.94,housenumber,5 Rue du Chateau 02240 Pleine-Selve,02605_0013_00005,G,5 RUE DU CHATEAU,
898059720,00018,89805972000018,O,2021-04-09,,,9609ZP,2021-04-10T08:37:06,true,1,,19,,RUE,DU CHATEAU,02240,PLEINE-SELVE,,,02605,,,,,,,,,,,,,,,,,,,2021-04-09,A,ECOLE CANINE POUR TOUS,,,,96.09Z,NAFRev2,N,3.529027,49.793078,0.94,housenumber,19 Rue du Chateau 02240 Pleine-Selve,02605_0013_00019,G,19 RUE DU CHATEAU,
902940691,00014,90294069100014,O,2021-08-26,,,,2021-09-09T03:33:44,true,1,,12,,RUE,DE PARPE-LA-COUR,02240,PLEINE-SELVE,,,02605,,,,,,,,,,,,,,,,,,,2021-08-26,A,,,,,68.20B,NAFRev2,N,3.521359,49.788895,0.94,housenumber,12 Rue de Parpe-la-Cour 02240 Pleine-Selve,02605_0045_00012,G,12 RUE DE PARPE LA COUR,
904542305,00019,90454230500019,O,2021-11-01,,,,2021-10-26T03:43:26,true,1,,7,,RUE,DU CHATEAU,02240,PLEINE-SELVE,,,02605,,,,,,,,,,,,,,,,,,,2021-11-01,A,,,,,46.19B,NAFRev2,N,3.527615,49.792103,0.94,housenumber,7 Rue du Chateau 02240 Pleine-Selve,02605_0013_00007,G,7 RUE DU CHATEAU,
910271287,00013,91027128700013,O,2022-01-28,,,,2022-12-02T13:56:12,true,1,,9,,RUE,DU CHATEAU,02240,PLEINE-SELVE,,,02605,,,,,,,,,,,,,,,,,,,2022-01-28,A,,,,,47.99A,NAFRev2,N,3.527703,49.792201,0.94,housenumber,9 Rue du Chateau 02240 Pleine-Selve,02605_0013_00009,G,9 RUE DU CHATEAU,
918042839,00012,91804283900012,O,2022-09-01,,,,2022-10-18T03:41:41,true,1,,10,,,RUE FREDERIC DURAIN,02240,PLEINE-SELVE,,,02605,,,,,,,,,,,,,,,,,,,2022-09-01,A,,,,,86.90D,NAFRev2,N,3.526539,49.793672,0.94,housenumber,10 Rue Frédéric Durain 02240 Pleine-Selve,02605_0020_00010,G,10 RUE FREDERIC DURAIN,
