siren,nic,siret,statutDiffusionEtablissement,dateCreationEtablissement,trancheEffectifsEtablissement,anneeEffectifsEtablissement,activitePrincipaleRegistreMetiersEtablissement,dateDernierTraitementEtablissement,etablissementSiege,nombrePeriodesEtablissement,complementAdresseEtablissement,numeroVoieEtablissement,indiceRepetitionEtablissement,typeVoieEtablissement,libelleVoieEtablissement,codePostalEtablissement,libelleCommuneEtablissement,libelleCommuneEtrangerEtablissement,distributionSpecialeEtablissement,codeCommuneEtablissement,codeCedexEtablissement,libelleCedexEtablissement,codePaysEtrangerEtablissement,libellePaysEtrangerEtablissement,complementAdresse2Etablissement,numeroVoie2Etablissement,indiceRepetition2Etablissement,typeVoie2Etablissement,libelleVoie2Etablissement,codePostal2Etablissement,libelleCommune2Etablissement,libelleCommuneEtranger2Etablissement,distributionSpeciale2Etablissement,codeCommune2Etablissement,codeCedex2Etablissement,libelleCedex2Etablissement,codePaysEtranger2Etablissement,libellePaysEtranger2Etablissement,dateDebut,etatAdministratifEtablissement,enseigne1Etablissement,enseigne2Etablissement,enseigne3Etablissement,denominationUsuelleEtablissement,activitePrincipaleEtablissement,nomenclatureActivitePrincipaleEtablissement,caractereEmployeurEtablissement,longitude,latitude,geo_score,geo_type,geo_adresse,geo_id,geo_ligne,geo_l4,geo_l5
210207932,00018,21020793200018,O,1983-03-01,12,2020,,2022-08-29T09:05:42,true,4,,,,RUE,GASTON TRIOUX,02300,VIRY-NOUREUIL,,,02820,,,,,,,,,,,,,,,,,,,2008-01-01,A,MAIRIE,,,,84.11Z,NAFRev2,O,3.247248,49.630618,0.96,street,Rue Gaston Trioux 02300 Viry-Noureuil,02820_0220,G,RUE GASTON TRIOUX,
210207932,00026,21020793200026,O,1983-12-21,NN,,,2019-11-14T14:00:14,false,3,,14,,RUE,GAMBETTA,02300,VIRY-NOUREUIL,,,02820,,,,,,,,,,,,,,,,,,,2008-01-01,A,ECOLE PRIMAIRE PUBLIQUE DE NOUREUIL,,,,85.20Z,NAFRev2,N,3.245903,49.644168,0.96,housenumber,14 Rue Gambetta 02300 Viry-Noureuil,02820_0200_00014,G,14 RUE GAMBETTA,
210207932,00034,21020793200034,O,1983-12-21,02,2020,,2022-08-29T09:05:42,false,3,,16,,RUE,GASTON TRIOUX,02300,VIRY-NOUREUIL,,,02820,,,,,,,,,,,,,,,,,,,2008-01-01,A,ECOLE PRIMAIRE DU CENTRE,,,,85.20Z,NAFRev2,N,3.245219,49.630416,0.96,housenumber,16 Rue Gaston Trioux 02300 Viry-Noureuil,02820_0220_00016,G,16 RUE GASTON TRIOUX,
210207932,00042,21020793200042,O,1995-12-25,NN,,,2019-11-14T14:00:14,false,2,MAIRIE,,,RUE,GASTON TRIOUX,02300,VIRY-NOUREUIL,,,02820,,,,,,,,,,,,,,,,,,,2008-01-01,A,SERVICE D'EAU,,,,36.00Z,NAFRev2,N,3.247248,49.630618,0.96,street,Rue Gaston Trioux 02300 Viry-Noureuil,02820_0220,G,RUE GASTON TRIOUX,
260208038,00018,26020803800018,O,1983-03-01,NN,,,2019-11-14T14:00:14,true,4,MAIRIE,,,RUE,GASTON TRIOUX,02300,VIRY-NOUREUIL,,,02820,,,,,,,,,,,,,,,,,,,2011-12-12,A,,,,,88.99B,NAFRev2,N,3.247248,49.630618,0.96,street,Rue Gaston Trioux 02300 Viry-Noureuil,02820_0220,G,RUE GASTON TRIOUX,
260209481,00019,26020948100019,O,1992-01-01,NN,,,2019-11-14T14:00:14,true,3,MAIRIE,,,RUE,GASTON TRIOUX,02300,VIRY-NOUREUIL,,,02820,,,,,,,,,,,,,,,,,,,2008-01-01,A,CDE,,,,88.99B,NAFRev2,N,3.247248,49.630618,0.96,street,Rue Gaston Trioux 02300 Viry-Noureuil,02820_0220,G,RUE GASTON TRIOUX,
270201163,00010,27020116300010,O,,,,,2019-11-14T14:00:14,true,1,,,,,,02300,VIRY-NOUREUIL,,,02820,,,,,,,,,,,,,,,,,,,1995-12-25,F,,,,,41.0Z,NAF1993,N,,,0,,,,,,
290200252,00010,29020025200010,O,,,,,2019-11-14T14:00:14,true,1,,,,,,02300,VIRY-NOUREUIL,,,02820,,,,,,,,,,,,,,,,,,,,F,,,,,90.12,NAP,N,,,0,,,,,,
302344718,00077,30234471800077,O,2000-05-14,NN,,,2019-11-14T14:00:14,false,4,ZAC LES TERRAGES,,,,,02300,VIRY-NOUREUIL,,,02820,,,,,,,,,,,,,,,,,,,2003-09-23,F,,,,,50.1Z,NAFRev1,O,3.251778,49.640946,0.94,street,ZAC les Terrages 02300 Viry-Noureuil,02820_A010,D,ZAC LES TERRAGES,
302736418,00013,30273641800013,O,1900-01-01,NN,,,2019-11-14T14:00:14,true,3,,,,,,02300,VIRY-NOUREUIL,,,02820,,,,,,,,,,,,,,,,,,,1996-12-25,F,,,,,01.1A,NAF1993,N,,,0,,,,,,
304805021,00017,30480502100017,O,1976-01-01,NN,,,2019-11-14T14:00:14,true,4,,14,,RUE,GENERAL DE GAULLE,02300,VIRY-NOUREUIL,,,02820,,,,,,,,,,,,,,,,,,,2009-05-01,F,,,,,56.30Z,NAFRev2,N,3.241631,49.633451,0.64,housenumber,14 Rue Charles de Gaulle 02300 Viry-Noureuil,02820_0035_00014,G,14 RUE CHARLES DE GAULLE,
307423558,00039,30742355800039,O,,,,,2019-11-14T14:00:14,true,1,,,,,,02300,VIRY-NOUREUIL,,,02820,,,,,,,,,,,,,,,,,,,1989-09-30,F,,,,,15.08,NAP,N,,,0,,,,,,
308449024,06466,30844902406466,O,1988-10-29,NN,,,2019-11-14T14:00:14,false,4,,,,LD,LES RINCETTES,02300,VIRY-NOUREUIL,,,02820,,,,,,,,,,,,,,,,,,,1998-03-02,F,HALLE AUX CHAUSSURES,,,,52.4E,NAF1993,N,3.259633,49.643428,0.94,street,Les Rincettes 02300 Viry-Noureuil,02820_37dx58,G,LES RINCETTES,
309206084,00019,30920608400019,O,1977-01-01,03,2020,,2022-08-29T09:13:02,false,5,,3,,RUE,CHARLES DE GAULLE,02300,VIRY-NOUREUIL,,,02820,,,,,,,,,,,,,,,,,,,2016-01-01,A,,,,,49.41B,NAFRev2,O,3.242804,49.631159,0.96,housenumber,3 Rue Charles de Gaulle 02300 Viry-Noureuil,02820_0035_00003,G,3 RUE CHARLES DE GAULLE,
309206084,00027,30920608400027,O,2001-09-01,03,2020,,2022-08-29T09:13:02,true,4,,,,,ZAC LES TERRAGES,02300,VIRY-NOUREUIL,,,02820,,,,,,,,,,,,,,,,,,,2008-01-01,A,,,,,43.12B,NAFRev2,O,3.251778,49.640946,0.94,street,ZAC les Terrages 02300 Viry-Noureuil,02820_A010,G,ZAC LES TERRAGES,
310160270,00099,31016027000099,O,2008-10-31,NN,,,2019-11-14T14:00:14,false,4,,,,,LES FONDS DE CAUROIS,02300,VIRY-NOUREUIL,,,02820,,,,,,,,,,,,,,,,,,,2017-07-26,F,ALKERN VIRY NOUREUIL,,,,23.61Z,NAFRev2,N,3.263513,49.624265,0.8,street,Le Fond des Caurois 02300 Viry-Noureuil,02820_B050,G,LE FOND DES CAUROIS,
310657093,00020,31065709300020,O,1986-05-18,NN,,,2019-11-14T14:00:14,true,5,,31,,RUE,GASTON TRIOUX,02300,VIRY-NOUREUIL,,,02820,,,,,,,,,,,,,,,,,,,2015-01-19,A,,,,,86.21Z,NAFRev2,N,3.246631,49.630656,0.96,housenumber,31 Rue Gaston Trioux 02300 Viry-Noureuil,02820_0220_00031,G,31 RUE GASTON TRIOUX,
310771456,00046,31077145600046,O,1986-06-24,NN,,,2019-11-14T14:00:14,false,4,GAL MARC DU MAGASIN CARREF,,,RTE,NATIONALE 38,02300,VIRY-NOUREUIL,,,02820,,,,,,,,,,,,,,,,,,,2004-04-01,F,,,,,52.4F,NAFRev1,O,,,0,,,,,,
310771456,00061,31077145600061,O,2010-05-27,NN,,9523ZZ,2019-11-14T14:00:14,true,1,VIRY SERVICE,,,,CENTRE COMMERCIAL AUCHAN,02300,VIRY-NOUREUIL,,,02820,,,,,,,,,,,,,,,,,,,2010-05-27,A,,,,,95.23Z,NAFRev2,N,2.9781186,50.4131763,0.8,poi.mall,Centre Commercial Auchan Noyelles (Galerie marchande) Noyelles-Godault,https://osm.org/node/3779537300,G,,
311586168,00016,31158616800016,O,1900-01-01,,,,2019-11-14T14:00:14,true,3,,,,RUE,N 38,02300,VIRY-NOUREUIL,,,02820,,,,,,,,,,,,,,,,,,,1996-12-25,F,,,,,01.1C,NAF1993,N,3.259184,49.643184,0.33,street,N 32 02300 Viry-Noureuil,02820_0489,G,N 32,
311812663,00012,31181266300012,O,,,,,2019-11-14T14:00:14,true,1,,17,,RUE,GASTON TRIOUX,02300,VIRY-NOUREUIL,,,02820,,,,,,,,,,,,,,,,,,,1984-12-25,F,,,,,67.08,NAP,N,3.244836,49.630821,0.96,housenumber,17 Rue Gaston Trioux 02300 Viry-Noureuil,02820_0220_00017,G,17 RUE GASTON TRIOUX,
312632441,00019,31263244100019,O,,NN,,,2019-11-14T14:00:14,true,1,,38,,RUE,NATIONALE,02300,VIRY-NOUREUIL,,,02820,,,,,,,,,,,,,,,,,,,,F,,,,,81.21,NAP,N,3.243207,49.637649,0.47,housenumber,38 Rue Charles de Gaulle 02300 Viry-Noureuil,02820_0035_00038,G,38 RUE CHARLES DE GAULLE,
312682875,00017,31268287500017,O,,NN,,,2019-11-14T14:00:14,true,1,,8,,RUE,POTEL,02300,VIRY-NOUREUIL,,,02820,,,,,,,,,,,,,,,,,,,,F,,,,,81.11,NAP,N,3.243651,49.629064,0.95,housenumber,8 Rue Potel 02300 Viry-Noureuil,02820_0580_00008,G,8 RUE POTEL,
313404139,00013,31340413900013,O,,NN,,,2019-11-14T14:00:14,true,1,,45,,RUE,GASTON TRIOUX,02300,VIRY-NOUREUIL,,,02820,,,,,,,,,,,,,,,,,,,1992-02-29,F,,,,,01.1A,NAF1993,N,3.248719,49.630584,0.96,housenumber,45 Rue Gaston Trioux 02300 Viry-Noureuil,02820_0220_00045,G,45 RUE GASTON TRIOUX,
313404154,00012,31340415400012,O,1978-01-01,,,,2019-11-14T14:00:14,true,4,,,,HAM,DE ROUEZ,02300,VIRY-NOUREUIL,,,02820,,,,,,,,,,,,,,,,,,,2008-01-01,F,,,,,01.11Z,NAFRev2,N,3.224978,49.654075,0.66,street,Rouez 02300 Viry-Noureuil,02820_s31jer,G,ROUEZ,
313512782,00019,31351278200019,O,,,,,2019-11-14T14:00:14,true,1,,1,,RUE,PASTEUR,02300,VIRY-NOUREUIL,,,02820,,,,,,,,,,,,,,,,,,,1989-01-01,F,,,,,01.1A,NAF1993,N,3.245458,49.644483,0.96,housenumber,1 Rue Pasteur 02300 Viry-Noureuil,02820_0520_00001,G,1 RUE PASTEUR,
313852071,00049,31385207100049,O,2001-07-01,NN,,,2019-11-14T14:00:14,false,4,,8,,RUE,JULES FERRY,02300,VIRY-NOUREUIL,,,02820,,,,,,,,,,,,,,,,,,,2017-04-01,F,,,,,47.89Z,NAFRev2,N,3.243732,49.633296,0.96,housenumber,8 Rue Jules Ferry 02300 Viry-Noureuil,02820_0340_00008,G,8 RUE JULES FERRY,
314248113,00040,31424811300040,O,2001-08-01,NN,,,2019-11-14T14:00:14,true,3,,12,,RUE,DE NOYON,02300,VIRY-NOUREUIL,,,02820,,,,,,,,,,,,,,,,,,,2005-05-11,F,,,,,45.4J,NAFRev1,O,3.236864,49.628549,0.95,housenumber,12 Rue de Noyon 02300 Viry-Noureuil,02820_0500_00012,G,12 RUE DE NOYON,
314349333,00026,31434933300026,O,,,,,2019-11-14T14:00:14,true,1,,,,RTE,NATIONALE 32,02300,VIRY-NOUREUIL,,,02820,,,,,,,,,,,,,,,,,,,1992-06-16,F,,,,,52.4C,NAF1993,N,,,0,,,,,,
314357237,00010,31435723700010,O,1900-01-01,,,,2019-11-14T14:00:14,false,4,,11,T,RUE,CHATELAINE,02300,VIRY-NOUREUIL,,,02820,,,,,,,,,,,,,,,,,,,1992-12-25,F,,,,,52.2C,NAF1993,N,3.238519,49.632282,0.96,housenumber,11t Rue Châtelaine 02300 Viry-Noureuil,02820_0040_00011_t,G,11T RUE CHATELAINE,
314626649,00011,31462664900011,O,1978-01-01,NN,,,2019-11-14T14:00:14,false,4,,16,,RUE,CHATELAINE,02300,VIRY-NOUREUIL,,,02820,,,,,,,,,,,,,,,,,,,2011-12-31,F,,,,,32.99Z,NAFRev2,N,3.238206,49.63304,0.96,housenumber,16 Rue Châtelaine 02300 Viry-Noureuil,02820_0040_00016,G,16 RUE CHATELAINE,
314626649,00029,31462664900029,O,1975-03-01,NN,,,2021-02-23T10:40:45,true,3,,16,,RUE,CHATELAINE,02300,VIRY-NOUREUIL,,,02820,,,,,,,,,,,,,,,,,,,2008-01-01,A,,,,,01.11Z,NAFRev2,N,3.238206,49.63304,0.96,housenumber,16 Rue Châtelaine 02300 Viry-Noureuil,02820_0040_00016,G,16 RUE CHATELAINE,
315126342,00056,31512634200056,O,1983-11-01,NN,,,2019-11-14T14:00:14,false,5,,,,,CENTRE COMM CARREFOUR,02300,VIRY-NOUREUIL,,,02820,,,,,,,,,,,,,,,,,,,2009-06-30,F,,,,,47.71Z,NAFRev2,O,3.8419382,43.6495818,0.81,poi.mall,Galerie Marchande Carrefour Saint-Clément-de-Rivière,https://osm.org/way/192476303,G,,
315177626,00019,31517762600019,O,1979-01-01,NN,,,2019-11-14T14:00:14,true,4,,,,,,02300,VIRY-NOUREUIL,,,02820,,,,,,,,,,,,,,,,,,,2008-01-01,F,,,,,68.20B,NAFRev2,N,,,0,,,,,,
315322206,00014,31532220600014,O,,,,,2019-11-14T14:00:14,true,1,,1,B,CHE,LATERAL,02300,VIRY-NOUREUIL,,,02820,,,,,,,,,,,,,,,,,,,1985-12-25,F,,,,,67.07,NAP,N,3.24954,49.6266,0.7,housenumber,1bis Rue du Chemin Latéral 02300 Viry-Noureuil,02820_0045_00001_bis,G,1BIS RUE DU CHEMIN LATERAL,
315332551,00011,31533255100011,O,1979-01-01,NN,,,2019-11-14T14:00:14,true,3,,2,,RUE,VICTOR HUGO,02300,VIRY-NOUREUIL,,,02820,,,,,,,,,,,,,,,,,,,2008-01-01,A,,,,,66.19A,NAFRev2,N,3.243278,49.631161,0.96,housenumber,2 Rue Victor Hugo 02300 Viry-Noureuil,02820_0620_00002,G,2 RUE VICTOR HUGO,
315473272,00039,31547327200039,O,,,,,2019-11-14T14:00:14,true,1,,,,,BRASSERIE V 2000,02300,VIRY-NOUREUIL,,,02820,,,,,,,,,,,,,,,,,,,1984-12-25,F,,,,,67.01,NAP,N,2.0335729,49.0470272,0.73,poi.bar,Brasserie 2000 (Bar) Cergy,https://osm.org/node/1786718206,G,,
315766584,00033,31576658400033,O,1991-03-20,,,,2019-11-14T14:00:14,false,4,,,,,CENTRE COMMERCIAL CARREFOU,02300,VIRY-NOUREUIL,,,02820,,,,,,,,,,,,,,,,,,,1995-12-18,F,PIZZA INN SIGNOR PP,,,,55.3A,NAF1993,N,7.0460375,48.7180305,0.54,poi.mall,(Galerie marchande) Sarrebourg,https://osm.org/way/97622006,G,,
316623016,00011,31662301600011,O,,NN,,,2019-11-14T14:00:14,true,1,,8,,RUE,GASTON TRIOUX,02300,VIRY-NOUREUIL,,,02820,,,,,,,,,,,,,,,,,,,2003-02-12,F,,,,,78.02,NAP,N,3.243776,49.630665,0.96,housenumber,8 Rue Gaston Trioux 02300 Viry-Noureuil,02820_0220_00008,G,8 RUE GASTON TRIOUX,
316848662,00037,31684866200037,O,2014-05-01,,,,2020-01-24T09:04:38,false,2,,,,,ZONE INDUSTRIELLE CHEMIN LATERAL,02300,VIRY-NOUREUIL,,,02820,,,,,,,,,,,,,,,,,,,2019-12-31,F,ENTREPRISE PIERMANT,,,ENTREPRISE PIERMANT,37.00Z,NAFRev2,N,,,0,,,,,,
317542769,00011,31754276900011,O,,,,,2019-11-14T14:00:14,true,1,,3,,RUE,GASTON TRIOUX,02300,VIRY-NOUREUIL,,,02820,,,,,,,,,,,,,,,,,,,1984-12-25,F,,,,,73.06,NAP,N,3.243924,49.630997,0.96,housenumber,3 Rue Gaston Trioux 02300 Viry-Noureuil,02820_0220_00003,G,3 RUE GASTON TRIOUX,
319090908,00041,31909090800041,O,2014-03-01,,,9524ZZ,2019-11-14T14:00:14,true,2,,11,,RUE,VICTOR HUGO,02300,VIRY-NOUREUIL,,,02820,,,,,,,,,,,,,,,,,,,2017-10-31,F,,,,,95.24Z,NAFRev2,N,3.243572,49.631807,0.96,housenumber,11 Rue Victor Hugo 02300 Viry-Noureuil,02820_0620_00011,G,11 RUE VICTOR HUGO,
319137295,00014,31913729500014,O,1980-05-28,NN,,,2019-11-14T14:00:14,true,3,,,,RUE,N 38,02300,VIRY-NOUREUIL,,,02820,,,,,,,,,,,,,,,,,,,1992-12-31,F,,,,,52.4N,NAF1993,N,3.259184,49.643184,0.33,street,N 32 02300 Viry-Noureuil,02820_0489,G,N 32,
319517579,00029,31951757900029,O,1992-06-01,NN,,,2019-11-14T14:00:14,false,3,,4,,RUE,GASTON TRIOUX,02300,VIRY-NOUREUIL,,,02820,,,,,,,,,,,,,,,,,,,2001-08-29,F,,,,,15.8C,NAF1993,,3.24356,49.630917,0.96,housenumber,4 Rue Gaston Trioux 02300 Viry-Noureuil,02820_0220_00004,G,4 RUE GASTON TRIOUX,
320103567,00022,32010356700022,O,,,,,2019-11-14T14:00:14,true,1,,36,,RUE,CHARLES DE GAULLE,02300,VIRY-NOUREUIL,,,02820,,,,,,,,,,,,,,,,,,,1992-01-25,F,,,,,28.3C,NAF1993,N,3.243035,49.637456,0.96,housenumber,36 Rue Charles de Gaulle 02300 Viry-Noureuil,02820_0035_00036,G,36 RUE CHARLES DE GAULLE,
320954712,00032,32095471200032,O,1989-09-30,NN,,,2019-11-14T14:00:14,false,5,,,,LD,LE FOND DES CAUROIS,02300,VIRY-NOUREUIL,,,02820,,,,,,,,,,,,,,,,,,,2008-09-30,F,,,,,23.61Z,NAFRev2,N,3.263513,49.624265,0.94,street,Le Fond des Caurois 02300 Viry-Noureuil,02820_B050,G,LE FOND DES CAUROIS,
321228017,00018,32122801700018,O,,NN,,,2019-11-14T14:00:14,true,1,,6,,RUE,GASTON TRIOUX,02300,VIRY-NOUREUIL,,,02820,,,,,,,,,,,,,,,,,,,1988-07-31,F,,,,,67.04,NAP,N,3.243742,49.630883,0.96,housenumber,6 Rue Gaston Trioux 02300 Viry-Noureuil,02820_0220_00006,G,6 RUE GASTON TRIOUX,
321605925,00015,32160592500015,O,1981-05-09,NN,,,2019-11-14T14:00:14,true,4,,,,RTE,NATIONALE 38,02300,VIRY-NOUREUIL,,,02820,,,,,,,,,,,,,,,,,,,1992-12-31,F,,,,,52.4C,NAF1993,N,,,0,,,,,,
322079039,00010,32207903900010,O,,,,,2019-11-14T14:00:14,true,1,,1,,PAS,DU MOULIN,02300,VIRY-NOUREUIL,,,02820,,,,,,,,,,,,,,,,,,,1984-12-25,F,,,,,64.11,NAP,N,3.238228,49.629509,0.83,housenumber,1 Passage du Moulin 02300 Viry-Noureuil,02820_0480_00001,G,1 PASSAGE DU MOULIN,
322836677,00011,32283667700011,O,1981-10-01,NN,,,2019-11-14T14:00:14,false,4,,,,RUE,CHATELAINE,02300,VIRY-NOUREUIL,,,02820,,,,,,,,,,,,,,,,,,,2009-07-31,F,,,,,68.20B,NAFRev2,N,3.23868,49.632172,0.96,street,Rue Châtelaine 02300 Viry-Noureuil,02820_0040,G,RUE CHATELAINE,
323180406,00239,32318040600239,O,1992-01-01,NN,,,2019-11-14T14:00:14,false,3,CENTRE COMMERCIAL MAMMOUTH,,,RTE,NATIONALE 38,02300,VIRY-NOUREUIL,,,02820,,,,,,,,,,,,,,,,,,,1995-12-25,F,GESTION DU PERSONNEL,,,,74.1J,NAF1993,O,,,0,,,,,,
323363630,00019,32336363000019,O,,,,,2019-11-14T14:00:14,true,1,,17,,RUE,GASTON TRIOUX,02300,VIRY-NOUREUIL,,,02820,,,,,,,,,,,,,,,,,,,1984-12-25,F,,,,,67.01,NAP,N,3.244836,49.630821,0.96,housenumber,17 Rue Gaston Trioux 02300 Viry-Noureuil,02820_0220_00017,G,17 RUE GASTON TRIOUX,
323763722,00010,32376372200010,O,1981-07-01,NN,,,2019-11-14T14:00:14,true,3,,,,RUE,LUFBERY ZI,02300,VIRY-NOUREUIL,,,02820,,,,,,,,,,,,,,,,,,,1991-04-18,F,,,,,24.08,NAP,N,,,0,,,,,,
324008846,00028,32400884600028,O,,,,,2019-11-14T14:00:14,true,1,,14,B,RUE,CHATELAINE,02300,VIRY-NOUREUIL,,,02820,,,,,,,,,,,,,,,,,,,1985-12-25,F,,,,,00.10,NAP,N,3.238246,49.632928,0.86,housenumber,14bis Rue Châtelaine 02300 Viry-Noureuil,02820_0040_00014_bis,G,14BIS RUE CHATELAINE,
324008879,00011,32400887900011,O,,,,,2019-11-14T14:00:14,true,1,,14,B,RUE,CHATELAINE,02300,VIRY-NOUREUIL,,,02820,,,,,,,,,,,,,,,,,,,1985-12-25,F,,,,,00.10,NAP,N,3.238246,49.632928,0.86,housenumber,14bis Rue Châtelaine 02300 Viry-Noureuil,02820_0040_00014_bis,G,14BIS RUE CHATELAINE,
324377142,00017,32437714200017,O,,NN,,,2019-11-14T14:00:14,true,1,,14,B,RUE,CHATELAINE,02300,VIRY-NOUREUIL,,,02820,,,,,,,,,,,,,,,,,,,1984-12-31,F,,,,,52.6E,NAF1993,N,3.238246,49.632928,0.86,housenumber,14bis Rue Châtelaine 02300 Viry-Noureuil,02820_0040_00014_bis,G,14BIS RUE CHATELAINE,
325220838,00016,32522083800016,O,1981-12-12,NN,,,2019-11-14T14:00:14,false,3,,3,,RUE,CHATELAINE,02300,VIRY-NOUREUIL,,,02820,,,,,,,,,,,,,,,,,,,2008-01-01,A,,,,,68.20B,NAFRev2,N,3.23938,49.631079,0.96,housenumber,3 Rue Châtelaine 02300 Viry-Noureuil,02820_0040_00003,G,3 RUE CHATELAINE,
325379865,00026,32537986500026,O,,,,,2019-11-14T14:00:14,true,1,,,,,CENTRE COMM CARREFOUR,02300,VIRY-NOUREUIL,,,02820,,,,,,,,,,,,,,,,,,,,F,,,,,62.46,NAP,N,3.8419382,43.6495818,0.81,poi.mall,Galerie Marchande Carrefour Saint-Clément-de-Rivière,https://osm.org/way/192476303,G,,
325983062,00028,32598306200028,O,1984-01-02,NN,,,2019-11-14T14:00:14,true,6,,4,,RUE,VICTOR HUGO,02300,VIRY-NOUREUIL,,,02820,,,,,,,,,,,,,,,,,,,2012-09-30,F,,,,,45.11Z,NAFRev2,O,3.243512,49.63151,0.96,housenumber,4 Rue Victor Hugo 02300 Viry-Noureuil,02820_0620_00004,G,4 RUE VICTOR HUGO,
326461563,00024,32646156300024,O,1996-03-01,NN,,,2019-11-14T14:00:14,true,3,,5,,RUE,DE LA LIBERTE,02300,VIRY-NOUREUIL,,,02820,,,,,,,,,,,,,,,,,,,2008-01-01,A,,,,,68.20B,NAFRev2,N,3.250539,49.626359,0.95,housenumber,5 Rue de la Liberté 02300 Viry-Noureuil,02820_0360_00005,G,5 RUE DE LA LIBERTE,
328610563,00012,32861056300012,O,1983-11-01,NN,,,2019-11-14T14:00:14,false,4,,9,,RUE,JEAN JAURES,02300,VIRY-NOUREUIL,,,02820,,,,,,,,,,,,,,,,,,,1997-06-01,F,,,,,60.2N,NAF1993,O,3.24262,49.630246,0.95,housenumber,9 Rue Jean Jaurès 02300 Viry-Noureuil,02820_0320_00009,G,9 RUE JEAN JAURES,
329188650,00025,32918865000025,O,1985-05-01,NN,,,2019-11-14T14:00:14,false,4,,40,,RUE,GASTON TRIOUX,02300,VIRY-NOUREUIL,,,02820,,,,,,,,,,,,,,,,,,,2000-03-28,F,,,,,85.1G,NAF1993,N,3.248508,49.630454,0.96,housenumber,40 Rue Gaston Trioux 02300 Viry-Noureuil,02820_0220_00040,G,40 RUE GASTON TRIOUX,
329188650,00033,32918865000033,O,2000-03-28,NN,,,2019-11-14T14:00:14,true,3,,33,,RUE,GASTON TRIOUX,02300,VIRY-NOUREUIL,,,02820,,,,,,,,,,,,,,,,,,,2008-01-01,A,,,,,86.90D,NAFRev2,N,3.246778,49.630651,0.96,housenumber,33 Rue Gaston Trioux 02300 Viry-Noureuil,02820_0220_00033,G,33 RUE GASTON TRIOUX,
329465140,00021,32946514000021,O,1995-09-02,NN,,,2019-11-14T14:00:14,false,3,,40,,RUE,GASTON TRIOUX,02300,VIRY-NOUREUIL,,,02820,,,,,,,,,,,,,,,,,,,1996-02-01,F,VINS ET ACCESSOIRES,,,,52.6G,NAF1993,N,3.248508,49.630454,0.96,housenumber,40 Rue Gaston Trioux 02300 Viry-Noureuil,02820_0220_00040,G,40 RUE GASTON TRIOUX,
329554661,00010,32955466100010,O,,NN,,,2019-11-14T14:00:14,true,1,,,,,GAL MARC CENT COM MAMMOUTH,02300,VIRY-NOUREUIL,,,02820,,,,,,,,,,,,,,,,,,,1994-06-23,F,,,,,93.0D,NAF1993,O,,,0,,,,,,
329924096,00046,32992409600046,O,1987-01-01,NN,,,2019-11-14T14:00:14,false,3,,,,,LIEU DIT RTE NATIONALE,02300,VIRY-NOUREUIL,,,02820,,,,,,,,,,,,,,,,,,,1994-12-25,F,ALUMINIUM DE FRANCE,,,,45.4C,NAF1993,N,1.2279812,49.230352,0.77,poi,Route Nationale (Pont) Saint-Pierre-du-Vauvray,https://osm.org/way/95838375,G,,
330073693,00013,33007369300013,O,,NN,,,2019-11-14T14:00:14,true,1,,2,,RUE,PRES DE MESNE,02300,VIRY-NOUREUIL,,,02820,,,,,,,,,,,,,,,,,,,1988-12-19,F,,,,,55.73,NAP,N,3.243412,49.628106,0.71,housenumber,2 Rue du Pres Mesne 02300 Viry-Noureuil,02820_0524_00002,G,2 RUE DU PRES MESNE,
330267691,06671,33026769106671,O,2020-07-15,02,2020,,2022-08-29T09:21:24,false,1,,,,RUE,VICTOR HUGO,02300,VIRY-NOUREUIL,,,02820,,,,,,,,,,,,,,,,,,,2020-07-15,A,CHAUSSEA,,,CHAUSSEA,47.72A,NAFRev2,O,3.245551,49.633198,0.96,street,Rue Victor Hugo 02300 Viry-Noureuil,02820_0620,G,RUE VICTOR HUGO,
330861527,00019,33086152700019,O,1984-06-12,NN,,,2019-11-14T14:00:14,true,1,,,,,CHEMIN LATERAL,02300,VIRY-NOUREUIL,,,02820,,,,,,,,,,,,,,,,,,,2001-03-30,F,,,,,51.5F,NAF1993,N,3.249433,49.626532,0.93,street,Rue du Chemin Latéral 02300 Viry-Noureuil,02820_0045,G,RUE DU CHEMIN LATERAL,
330966581,00010,33096658100010,O,1984-11-05,NN,,,2019-11-14T14:00:14,true,5,,2,,RUE,VICTOR HUGO,02300,VIRY-NOUREUIL,,,02820,,,,,,,,,,,,,,,,,,,2014-09-01,F,,,,,47.73Z,NAFRev2,O,3.243278,49.631161,0.96,housenumber,2 Rue Victor Hugo 02300 Viry-Noureuil,02820_0620_00002,G,2 RUE VICTOR HUGO,
331978502,00028,33197850200028,O,2005-03-02,,,,2021-02-23T10:51:54,true,2,,28,B,RUE,VICTOR HUGO,02300,VIRY-NOUREUIL,,,02820,,,,,,,,,,,,,,,,,,,2008-01-01,A,,,,,41.10D,NAFRev2,N,3.246567,49.633918,0.87,housenumber,28bis Rue Victor Hugo 02300 Viry-Noureuil,02820_0620_00028_bis,G,28BIS RUE VICTOR HUGO,
332620566,00023,33262056600023,O,,NN,,,2019-11-14T14:00:14,true,1,,,,,CENTRE COMMERCIAL CARREFOU,02300,VIRY-NOUREUIL,,,02820,,,,,,,,,,,,,,,,,,,1990-01-25,F,,,,,63.05,NAP,N,7.0460375,48.7180305,0.54,poi.mall,(Galerie marchande) Sarrebourg,https://osm.org/way/97622006,G,,
332929421,00029,33292942100029,O,1992-06-16,NN,,,2019-11-14T14:00:14,true,1,,,,RTE,NATIONALE 32,02300,VIRY-NOUREUIL,,,02820,,,,,,,,,,,,,,,,,,,1999-09-03,F,,,,,52.4C,NAF1993,O,,,0,,,,,,
332951623,00013,33295162300013,O,1900-01-01,,,,2019-11-14T14:00:14,false,3,,17,,RUE,GASTON TRIOUX,02300,VIRY-NOUREUIL,,,02820,,,,,,,,,,,,,,,,,,,1987-12-25,F,,,,,67.01,NAP,N,3.244836,49.630821,0.96,housenumber,17 Rue Gaston Trioux 02300 Viry-Noureuil,02820_0220_00017,G,17 RUE GASTON TRIOUX,
333323137,00013,33332313700013,O,,NN,,,2019-11-14T14:00:14,true,1,,5,,RUE,DU FORT MUTIN,02300,VIRY-NOUREUIL,,,02820,,,,,,,,,,,,,,,,,,,1993-06-15,F,,,,,52.6E,NAF1993,N,3.243977,49.644534,0.95,housenumber,5 Rue du Fort-Mutin 02300 Viry-Noureuil,02820_0180_00005,G,5 RUE DU FORT MUTIN,
333535755,00016,33353575500016,O,,NN,,,2019-11-14T14:00:14,true,1,,80,,RUE,RACINE,02300,VIRY-NOUREUIL,,,02820,,,,,,,,,,,,,,,,,,,,F,,,,,60.09,NAP,N,3.251616,49.629364,0.77,street,Rue Racine 02300 Viry-Noureuil,02820_0600,G,RUE RACINE,
334379997,00029,33437999700029,O,1986-08-01,NN,,,2019-11-14T14:00:14,true,4,CEN COMMERCIAL RN 32,,,,,02300,VIRY-NOUREUIL,,,02820,,,,,,,,,,,,,,,,,,,1993-12-25,F,,,,,65.01,NAP,N,,,0,,,,,,
334652518,00013,33465251800013,O,,NN,,,2019-11-14T14:00:14,true,1,,38,,RTE,NATIONALE LD LES RINCETTES,02300,VIRY-NOUREUIL,,,02820,,,,,,,,,,,,,,,,,,,,F,,,,,63.02,NAP,N,3.259633,49.643428,0.46,street,Les Rincettes 02300 Viry-Noureuil,02820_37dx58,G,LES RINCETTES,
334852449,00027,33485244900027,O,1989-04-25,NN,,,2019-11-14T14:00:14,false,7,,3,,RUE,ALEXANDRE DUMAS,02300,VIRY-NOUREUIL,,,02820,,,,,,,,,,,,,,,,,,,2008-02-12,F,,,,,49.32Z,NAFRev2,N,3.249147,49.628248,0.95,housenumber,3 Rue Alexandre Dumas 02300 Viry-Noureuil,02820_0010_00003,G,3 RUE ALEXANDRE DUMAS,
335580304,00194,33558030400194,O,2000-10-30,,,,2019-11-14T14:00:14,false,1,,,,RUE,DU MARAIS,02300,VIRY-NOUREUIL,,,02820,,,,,,,,,,,,,,,,,,,2000-10-30,F,,,,,,,,3.249763,49.628975,0.56,street,Rue du 8 Mai 1945 02300 Viry-Noureuil,02820_0660,G,RUE DU 8 MAI 1945,
337920029,00010,33792002900010,O,,NN,,,2019-11-14T14:00:14,true,1,,18,,RUE,GAMBETTA,02300,VIRY-NOUREUIL,,,02820,,,,,,,,,,,,,,,,,,,1995-03-22,F,,,,,45.2J,NAF1993,O,3.246425,49.645294,0.96,housenumber,18 Rue Gambetta 02300 Viry-Noureuil,02820_0200_00018,G,18 RUE GAMBETTA,
337931604,00033,33793160400033,O,1995-07-01,NN,,,2019-11-14T14:00:14,true,3,,15,,RUE,GASTON TRIOUX,02300,VIRY-NOUREUIL,,,02820,,,,,,,,,,,,,,,,,,,2008-01-01,A,,,,,46.18Z,NAFRev2,N,3.244625,49.630871,0.96,housenumber,15 Rue Gaston Trioux 02300 Viry-Noureuil,02820_0220_00015,G,15 RUE GASTON TRIOUX,
337931604,00041,33793160400041,O,2017-11-16,,,,2021-02-23T10:54:38,false,1,,1,,RUE,MICHELET,02300,VIRY-NOUREUIL,,,02820,,,,,,,,,,,,,,,,,,,2017-11-16,A,,,,,46.34Z,NAFRev2,N,3.241889,49.635054,0.95,housenumber,1 Rue Michelet 02300 Viry-Noureuil,02820_0460_00001,G,1 RUE MICHELET,