siren,nic,siret,statutDiffusionEtablissement,dateCreationEtablissement,trancheEffectifsEtablissement,anneeEffectifsEtablissement,activitePrincipaleRegistreMetiersEtablissement,dateDernierTraitementEtablissement,etablissementSiege,nombrePeriodesEtablissement,complementAdresseEtablissement,numeroVoieEtablissement,indiceRepetitionEtablissement,typeVoieEtablissement,libelleVoieEtablissement,codePostalEtablissement,libelleCommuneEtablissement,libelleCommuneEtrangerEtablissement,distributionSpecialeEtablissement,codeCommuneEtablissement,codeCedexEtablissement,libelleCedexEtablissement,codePaysEtrangerEtablissement,libellePaysEtrangerEtablissement,complementAdresse2Etablissement,numeroVoie2Etablissement,indiceRepetition2Etablissement,typeVoie2Etablissement,libelleVoie2Etablissement,codePostal2Etablissement,libelleCommune2Etablissement,libelleCommuneEtranger2Etablissement,distributionSpeciale2Etablissement,codeCommune2Etablissement,codeCedex2Etablissement,libelleCedex2Etablissement,codePaysEtranger2Etablissement,libellePaysEtranger2Etablissement,dateDebut,etatAdministratifEtablissement,enseigne1Etablissement,enseigne2Etablissement,enseigne3Etablissement,denominationUsuelleEtablissement,activitePrincipaleEtablissement,nomenclatureActivitePrincipaleEtablissement,caractereEmployeurEtablissement,longitude,latitude,geo_score,geo_type,geo_adresse,geo_id,geo_ligne,geo_l4,geo_l5
005740477,00012,00574047700012,O,,,,,2019-11-14T14:00:14,true,1,,,,,,04200,NOYERS-SUR-JABRON,,,04139,,,,,,,,,,,,,,,,,,,1984-12-25,F,,,,,38.40,NAP,N,,,0,,,,,,
006043533,00014,00604353300014,O,,NN,,,2019-11-14T14:00:14,true,1,,,,,,04200,NOYERS-SUR-JABRON,,,04139,,,,,,,,,,,,,,,,,,,1984-12-25,F,,,,,62.11,NAP,N,,,0,,,,,,
006541379,00019,00654137900019,O,,,,,2019-11-14T14:00:14,true,1,,,,DOM,ST NAZAIRE,04200,NOYERS-SUR-JABRON,,,04139,,,,,,,,,,,,,,,,,,,1984-12-25,F,,,,,67.09,NAP,N,,,0,,,,,,
007240047,00014,00724004700014,O,,NN,,,2019-11-14T14:00:14,true,1,,,,,,04200,NOYERS-SUR-JABRON,,,04139,,,,,,,,,,,,,,,,,,,1991-05-17,F,,,,,02.20,NAP,N,,,0,,,,,,
007240054,00010,00724005400010,O,,,,,2019-11-14T14:00:14,true,1,,,,,,04200,NOYERS-SUR-JABRON,,,04139,,,,,,,,,,,,,,,,,,,1985-12-25,F,,,,,81.21,NAP,N,,,0,,,,,,
007350168,00014,00735016800014,O,1973-01-01,02,2020,,2023-02-16T03:38:25,true,5,,,,,,04200,NOYERS-SUR-JABRON,,BP 40,04139,,,,,,,,,,,,,,,,,,,2013-08-19,A,,,,,02.20Z,NAFRev2,O,,,0,,,,,,
007360019,00017,00736001900017,O,,NN,,,2020-09-01T11:36:28,true,1,,,,,,04200,NOYERS-SUR-JABRON,,,04139,,,,,,,,,,,,,,,,,,,,F,,,,,55.12,NAP,N,,,0,,,,,,
210401394,00015,21040139400015,O,1983-03-01,03,2020,,2022-08-29T09:05:45,true,4,HOTEL DE VILLE,,,,,04200,NOYERS-SUR-JABRON,,,04139,,,,,,,,,,,,,,,,,,,2008-01-01,A,MAIRIE,,,,84.11Z,NAFRev2,O,5.825403,44.170094,0.39,street,Le Village 04200 Noyers-sur-Jabron,04139_dponem,D,LE VILLAGE,
210401394,00023,21040139400023,O,1983-12-21,01,2020,,2022-08-29T09:05:45,false,3,,,,,,04200,NOYERS-SUR-JABRON,,,04139,,,,,,,,,,,,,,,,,,,2008-01-01,A,ECOLE PRIMAIRE PUBLIQUE,,,,85.20Z,NAFRev2,N,,,0,,,,,,
210401394,00031,21040139400031,O,1997-01-01,NN,,,2019-11-14T14:00:14,false,3,MAIRIE,,,,,04200,NOYERS-SUR-JABRON,,,04139,,,,,,,,,,,,,,,,,,,2008-01-01,A,SCE EAU ET ASSAINISSEMENT,,,,36.00Z,NAFRev2,N,5.81581,44.16474,0.5,locality,Serre de Marie 04200 Noyers-sur-Jabron,04139_B107,D,SERRE DE MARIE,
210401394,00049,21040139400049,O,2000-01-01,NN,,,2019-11-14T14:00:14,false,3,HOTEL DE VILLE,,,,,04200,NOYERS-SUR-JABRON,,,04139,,,,,,,,,,,,,,,,,,,2008-01-01,A,LOCATION IMMEUBLES D'HABITATION,,,,42.99Z,NAFRev2,N,5.825403,44.170094,0.39,street,Le Village 04200 Noyers-sur-Jabron,04139_dponem,D,LE VILLAGE,
240400481,00034,24040048100034,O,2005-02-07,NN,,,2019-11-14T14:00:14,true,3,MAIRIE,,,PL,DE LA MAIRIE,04200,NOYERS-SUR-JABRON,,,04139,,,,,,,,,,,,,,,,,,,2017-01-01,F,,,,,84.11Z,NAFRev2,O,5.820107,44.170048,0.37,locality,L’Adrech de la Prise 04200 Noyers-sur-Jabron,04139_B002,G,L ADRECH DE LA PRISE,
250400447,00018,25040044700018,O,1983-03-01,NN,,,2019-11-14T14:00:14,true,1,,,,,HOTEL DE VILLE,04200,NOYERS-SUR-JABRON,,,04139,,,,,,,,,,,,,,,,,,,1998-11-23,F,,,,,75.1C,NAF1993,N,5.825403,44.170094,0.39,street,Le Village 04200 Noyers-sur-Jabron,04139_dponem,G,LE VILLAGE,
250400462,00033,25040046200033,O,1997-05-05,NN,,,2019-11-14T14:00:14,true,4,,,,,MAIRIE,04200,NOYERS-SUR-JABRON,,,04139,,,,,,,,,,,,,,,,,,,2013-12-31,F,,,,,84.13Z,NAFRev2,N,3.0709671,50.6304695,0.92,poi.townhall,Hôtel de Ville Lille,https://osm.org/way/40917078,G,,
260401336,00011,26040133600011,O,1983-03-01,NN,,,2019-11-14T14:00:14,true,4,,,,,HOTEL DE VILLE,04200,NOYERS-SUR-JABRON,,,04139,,,,,,,,,,,,,,,,,,,2016-01-01,F,CCAS,,,,88.99B,NAFRev2,N,5.825403,44.170094,0.39,street,Le Village 04200 Noyers-sur-Jabron,04139_dponem,G,LE VILLAGE,
260402953,00012,26040295300012,O,1984-12-04,NN,,,2019-11-14T14:00:14,true,4,,,,,,04200,NOYERS-SUR-JABRON,,,04139,,,,,,,,,,,,,,,,,,,2001-12-25,F,CDE,,,,85.3K,NAF1993,N,,,0,,,,,,
290401108,00011,29040110800011,O,1983-08-10,NN,,,2021-09-01T14:57:11,true,4,MAIRIE,,,,LE VILLAGE,04200,NOYERS-SUR-JABRON,,,04139,,,,,,,,,,,,,,,,,,,2013-08-26,F,,,,,42.99Z,NAFRev2,N,5.825403,44.170094,0.94,street,Le Village 04200 Noyers-sur-Jabron,04139_dponem,G,LE VILLAGE,
290401777,00013,29040177700013,O,,,,,2019-11-14T14:00:14,true,1,,,,,,04200,NOYERS-SUR-JABRON,,,04139,,,,,,,,,,,,,,,,,,,1991-12-04,F,,,,,90.12,NAP,N,,,0,,,,,,
290401785,00016,29040178500016,O,1986-01-10,NN,,,2019-11-14T14:00:14,true,3,,,,,MAIRIE,04200,NOYERS-SUR-JABRON,,,04139,,,,,,,,,,,,,,,,,,,2008-01-01,A,,,,,42.99Z,NAFRev2,N,3.0709671,50.6304695,0.92,poi.townhall,Hôtel de Ville Lille,https://osm.org/way/40917078,G,,
301693446,00017,30169344600017,O,,NN,,,2019-11-14T14:00:14,true,1,,,,,,04200,NOYERS-SUR-JABRON,,,04139,,,,,,,,,,,,,,,,,,,,F,,,,,55.10,NAP,N,,,0,,,,,,
307427112,00015,30742711200015,O,,,,,2019-11-14T14:00:14,true,1,,,,,,04200,NOYERS-SUR-JABRON,,,04139,,,,,,,,,,,,,,,,,,,1984-12-25,F,,,,,00.98,NAP,N,,,0,,,,,,
309424158,00033,30942415800033,O,1997-04-19,NN,,,2019-11-14T14:00:14,true,1,,,,RUE,PRINCIPALE,04200,NOYERS-SUR-JABRON,,,04139,,,,,,,,,,,,,,,,,,,2002-03-31,F,,,,,74.1J,NAF1993,N,2.061661,50.820766,0.9,poi,Rue Principale (Pont) Zouafques,https://osm.org/way/111379934,G,,
310615877,00035,31061587700035,O,1990-01-01,NN,,,2019-11-14T14:00:14,false,2,,,,,LES GORGONNIERS,04200,NOYERS-SUR-JABRON,,,04139,,,,,,,,,,,,,,,,,,,1991-06-30,F,,,,,,,,5.841801,44.169402,0.73,street,Gorgonniers 04200 Noyers-sur-Jabron,04139_sru2kq,G,GORGONNIERS,
310615877,00043,31061587700043,O,2010-06-01,,,4399CZ,2019-11-14T14:00:14,true,2,CHEMIN DE CHENEBOTTE,,,,LA BELASSIERE,04200,NOYERS-SUR-JABRON,,,04139,,,,,,,,,,,,,,,,,,,2014-07-31,F,,,,,43.99C,NAFRev2,O,5.824569,44.169673,0.61,street,Chemin de Chenebotte 04200 Noyers-sur-Jabron,04139_0001,D,CHEMIN DE CHENEBOTTE,
310882006,00011,31088200600011,O,1998-06-09,NN,,,2021-02-23T10:38:55,true,4,,,,,LE MOULIN,04200,NOYERS-SUR-JABRON,,,04139,,,,,,,,,,,,,,,,,,,2008-01-01,A,,,,,01.24Z,NAFRev2,N,7.3894429,48.4987726,0.9,poi.track,Chemin Le Moulin Mollkirch,https://osm.org/way/212059516,G,,
317289130,00013,31728913000013,O,,NN,,,2019-11-14T14:00:14,true,1,,,,,,04200,NOYERS-SUR-JABRON,,,04139,,,,,,,,,,,,,,,,,,,,F,,,,,97.23,NAP,N,,,0,,,,,,
319863411,00017,31986341100017,O,1980-09-10,NN,,,2021-02-10T19:34:56,true,4,,,,,MAS DES BARTAVELLES,04200,NOYERS-SUR-JABRON,,,04139,,,,,,,,,,,,,,,,,,,2008-01-01,A,,,,,01.11Z,NAFRev2,N,6.5919663,43.1877918,0.72,poi.track,Chemin des Bartavelles La Croix-Valmer,https://osm.org/way/271029717,G,,
321714016,00011,32171401600011,O,,NN,,,2019-11-14T14:00:14,true,1,,,,,,04200,NOYERS-SUR-JABRON,,,04139,,,,,,,,,,,,,,,,,,,1992-09-17,F,,,,,74.2C,NAF1993,N,,,0,,,,,,
322591413,00016,32259141300016,O,,NN,,,2019-11-14T14:00:14,true,1,,,,,LES PEYROURIES,04200,NOYERS-SUR-JABRON,,,04139,,,,,,,,,,,,,,,,,,,,F,,,,,55.60,NAP,N,5.84814,44.169783,0.94,street,Les Peyrouries 04200 Noyers-sur-Jabron,04139_jyn1xv,G,LES PEYROURIES,
323125500,00013,32312550000013,O,1981-10-08,NN,,,2019-11-14T14:00:14,true,3,,,,DOM,DE LA GRANDE BASTIDE,04200,NOYERS-SUR-JABRON,,,04139,,,,,,,,,,,,,,,,,,,2008-01-01,A,,,,,01.11Z,NAFRev2,N,6.0577108,43.1773352,0.75,poi.track,Chemin de la Grande Bastide Solliès-Pont,https://osm.org/way/111539543,G,,
323269068,00017,32326906800017,O,,NN,,,2019-11-14T14:00:14,true,1,,,,,,04200,NOYERS-SUR-JABRON,,,04139,,,,,,,,,,,,,,,,,,,,F,,,,,62.46,NAP,N,,,0,,,,,,
323577411,00016,32357741100016,O,,NN,,,2019-11-14T14:00:14,true,1,,,,,,04200,NOYERS-SUR-JABRON,,,04139,,,,,,,,,,,,,,,,,,,1985-12-31,F,,,,,52.1B,NAF1993,N,,,0,,,,,,
324093574,00030,32409357400030,O,2012-11-01,,,,2021-02-23T10:47:14,true,4,,1,,CHE,DE CHENEBOTTE,04200,NOYERS-SUR-JABRON,,,04139,,,,,,,,,,,,,,,,,,,2018-05-05,A,CHEZ EVELYNE,,,,56.10A,NAFRev2,N,5.824436,44.1693,0.84,housenumber,1 Chemin de Chenebotte 04200 Noyers-sur-Jabron,04139_0001_00001,G,1 CHEMIN DE CHENEBOTTE,
326671690,00013,32667169000013,O,1982-10-01,NN,,,2019-11-14T14:00:14,true,4,,,,,QUARTIER BAZARIQUE,04200,NOYERS-SUR-JABRON,,,04139,,,,,,,,,,,,,,,,,,,2009-06-11,F,,,,,02.20Z,NAFRev2,N,,,0,,,,,,
326804796,00018,32680479600018,O,1900-01-01,NN,,,2019-11-14T14:00:14,false,3,,,,,L ESCAPADE,04200,NOYERS-SUR-JABRON,,,04139,,,,,,,,,,,,,,,,,,,1985-12-25,F,,,,,66.04,NAP,N,-1.386863,47.9125725,0.9,poi.bar,L'Escapade (Bar) Retiers,https://osm.org/way/123731305,G,,
327443206,00021,32744320600021,O,2002-04-01,NN,,,2019-11-14T14:00:14,false,4,,,,RUE,PRINCIPALE,04200,NOYERS-SUR-JABRON,,,04139,,,,,,,,,,,,,,,,,,,2005-05-15,F,,,,,55.4B,NAFRev1,N,2.061661,50.820766,0.9,poi,Rue Principale (Pont) Zouafques,https://osm.org/way/111379934,G,,
328224423,00017,32822442300017,O,1900-01-01,,,,2019-11-14T14:00:14,true,4,LE VILLAGE,,,,LA GENILOTTE,04200,NOYERS-SUR-JABRON,,,04139,,,,,,,,,,,,,,,,,,,2013-12-31,F,,,,,43.32A,NAFRev2,N,5.824114,44.170069,0.31,street,Parpin et Chenebotte 04200 Noyers-sur-Jabron,04139_B076,G,PARPIN ET CHENEBOTTE,
328267596,00018,32826759600018,O,,,,,2019-11-14T14:00:14,true,1,,,,,LE DURBAN,04200,NOYERS-SUR-JABRON,,,04139,,,,,,,,,,,,,,,,,,,1984-12-25,F,,,,,64.49,NAP,N,5.834833,44.160976,0.46,locality,Saint Lazare le Pre du Pre 04200 Noyers-sur-Jabron,04139_B101,G,SAINT LAZARE LE PRE DU PRE,
328402979,00012,32840297900012,O,1983-09-12,NN,,,2019-11-14T14:00:14,false,4,,,,,LES PEYROURIERS,04200,NOYERS-SUR-JABRON,,,04139,,,,,,,,,,,,,,,,,,,1993-02-15,F,,,,,85.1C,NAF1993,N,5.84814,44.169783,0.86,street,Les Peyrouries 04200 Noyers-sur-Jabron,04139_jyn1xv,G,LES PEYROURIES,
328509120,00015,32850912000015,O,,,,,2019-11-14T14:00:14,true,1,,,,,QUARTIER LES LATILS,04200,NOYERS-SUR-JABRON,,,04139,,,,,,,,,,,,,,,,,,,1985-12-25,F,,,,,55.73,NAP,N,,,0,,,,,,
328705744,00048,32870574400048,O,2021-01-08,,,,2022-12-05T11:12:48,false,1,,,,,CHAMP DE CACHET,04200,NOYERS-SUR-JABRON,,,04139,,,,,,,,,,,,,,,,,,,2021-01-08,A,LOUTHEA,,,,01.13Z,NAFRev2,N,5.795145,44.168894,0.59,locality,Champ de Baguet 04200 Noyers-sur-Jabron,04139_B016,G,CHAMP DE BAGUET,
328705744,00055,32870574400055,O,2022-12-01,,,,2022-12-21T12:03:01,true,1,,,,,CHAMP DE CACHET,04200,NOYERS-SUR-JABRON,,,04139,,,,,,,,,,,,,,,,,,,2022-12-01,A,,,,,47.89Z,NAFRev2,N,5.795145,44.168894,0.59,locality,Champ de Baguet 04200 Noyers-sur-Jabron,04139_B016,G,CHAMP DE BAGUET,
330249129,00041,33024912900041,O,2013-06-24,00,2020,1071CB,2022-08-29T09:21:22,true,3,,,,RUE,DU VILLAGE,04200,NOYERS-SUR-JABRON,,,04139,,,,,,,,,,,,,,,,,,,2020-11-13,F,BOULANGERIE LE COEUR DU BON PAIN,,,BOULANGERIE LE COEUR DU BON PAIN,10.71C,NAFRev2,N,5.825403,44.170094,0.53,street,Le Village 04200 Noyers-sur-Jabron,04139_dponem,G,LE VILLAGE,
332759117,00010,33275911700010,O,1984-12-13,NN,,,2019-11-14T14:00:14,true,3,,,,,HOTEL DE VILLE,04200,NOYERS-SUR-JABRON,,,04139,,,,,,,,,,,,,,,,,,,2002-12-31,F,,,,,71.3A,NAF1993,N,5.825403,44.170094,0.39,street,Le Village 04200 Noyers-sur-Jabron,04139_dponem,G,LE VILLAGE,
334876026,00017,33487602600017,O,,,,,2019-11-14T14:00:14,true,1,,,,RUE,PRINCIPALE,04200,NOYERS-SUR-JABRON,,,04139,,,,,,,,,,,,,,,,,,,,F,,,,,38.40,NAP,N,2.061661,50.820766,0.9,poi,Rue Principale (Pont) Zouafques,https://osm.org/way/111379934,G,,
338857055,00010,33885705500010,O,1986-09-16,NN,,,2019-11-14T14:00:14,true,1,,,,,CHANTEPERDRIX,04200,NOYERS-SUR-JABRON,,,04139,,,,,,,,,,,,,,,,,,,2001-09-30,F,,,,,45.1A,NAF1993,N,5.817393,44.168679,0.81,locality,Chante Perdrix 04200 Noyers-sur-Jabron,04139_B018,G,CHANTE PERDRIX,
339532897,00016,33953289700016,O,,NN,,,2019-11-14T14:00:14,true,1,,,,,,04200,NOYERS-SUR-JABRON,,,04139,,,,,,,,,,,,,,,,,,,1987-03-30,F,,,,,62.46,NAP,N,,,0,,,,,,
340394246,00011,34039424600011,O,,NN,,,2019-11-14T14:00:14,true,1,,,,,LE BESSAN,04200,NOYERS-SUR-JABRON,,,04139,,,,,,,,,,,,,,,,,,,1987-08-21,F,,,,,84.12,NAP,N,5.839534,44.172337,0.47,locality,Le Plan des Berauds 04200 Noyers-sur-Jabron,04139_B086,G,LE PLAN DES BERAUDS,
340819598,00012,34081959800012,O,,NN,,,2019-11-14T14:00:14,true,1,,,,,,04200,NOYERS-SUR-JABRON,,,04139,,,,,,,,,,,,,,,,,,,1987-04-17,F,,,,,64.11,NAP,N,,,0,,,,,,
341483964,00019,34148396400019,O,,,,,2019-11-14T14:00:14,true,1,,,,RUE,PRINCIPALE,04200,NOYERS-SUR-JABRON,,,04139,,,,,,,,,,,,,,,,,,,1993-08-05,F,,,,,15.8C,NAF1993,N,2.061661,50.820766,0.9,poi,Rue Principale (Pont) Zouafques,https://osm.org/way/111379934,G,,
341719920,00017,34171992000017,O,1985-01-01,NN,,,2019-11-14T14:00:14,false,3,,,,,,04200,NOYERS-SUR-JABRON,,,04139,,,,,,,,,,,,,,,,,,,2005-12-31,F,,,,,70.2C,NAFRev1,N,,,0,,,,,,
343667242,00014,34366724200014,O,,NN,,,2019-11-14T14:00:14,true,1,,,,,ST TROPHE,04200,NOYERS-SUR-JABRON,,,04139,,,,,,,,,,,,,,,,,,,1991-06-29,F,,,,,60.10,NAP,N,5.836174,44.160785,0.73,locality,Le Plan de Saint Trophe 04200 Noyers-sur-Jabron,04139_B084,G,LE PLAN DE SAINT TROPHE,
344734264,00049,34473426400049,O,2009-02-01,,,,2019-11-14T14:00:14,false,2,,,,,LE VILLAGE,04200,NOYERS-SUR-JABRON,,,04139,,,,,,,,,,,,,,,,,,,2009-07-31,F,,,,,73.11Z,NAFRev2,N,5.825403,44.170094,0.94,street,Le Village 04200 Noyers-sur-Jabron,04139_dponem,G,LE VILLAGE,
347388365,00046,34738836500046,O,2017-12-17,,,,2020-10-20T04:11:02,true,2,LE MOULIN,,,LD,LE CHATEAU,04200,NOYERS-SUR-JABRON,,,04139,,,,,,,,,,,,,,,,,,,2020-10-15,F,,,,,47.82Z,NAFRev2,N,5.845771,44.156536,0.35,locality,Le Jas de Castagne 04200 Noyers-sur-Jabron,04139_B064,G,LE JAS DE CASTAGNE,
350098851,00016,35009885100016,O,1989-04-02,,,,2019-11-14T14:00:14,true,1,,,,RUE,PRINCIPALE,04200,NOYERS-SUR-JABRON,,,04139,,,,,,,,,,,,,,,,,,,1999-12-15,F,,,,,36.1J,NAF1993,N,2.061661,50.820766,0.9,poi,Rue Principale (Pont) Zouafques,https://osm.org/way/111379934,G,,
351049242,00016,35104924200016,O,,NN,,,2019-11-14T14:00:14,true,1,,,,,,04200,NOYERS-SUR-JABRON,,,04139,,,,,,,,,,,,,,,,,,,1994-03-15,F,,,,,55.3A,NAF1993,N,,,0,,,,,,
351945779,00012,35194577900012,O,,,,,2019-11-14T14:00:14,true,1,,,,,LA RIBIERE,04200,NOYERS-SUR-JABRON,,,04139,,,,,,,,,,,,,,,,,,,1997-06-25,F,,,,,01.2A,NAF1993,N,6.6581542,43.9712556,0.89,poi.camp_site,Camping La Ribière Annot,https://osm.org/way/184447596,G,,
352000517,00016,35200051700016,O,1989-08-30,NN,,,2019-11-14T14:00:14,true,4,,,,,LA GROTTE,04200,NOYERS-SUR-JABRON,,,04139,,,,,,,,,,,,,,,,,,,2003-02-17,F,,,,,01.1A,NAFRev1,N,5.824114,44.170069,0.37,street,Parpin et Chenebotte 04200 Noyers-sur-Jabron,04139_B076,G,PARPIN ET CHENEBOTTE,
353024656,00012,35302465600012,O,1990-01-01,,,,2019-11-14T14:00:14,false,3,,,,RUE,PRINCIPALE,04200,NOYERS-SUR-JABRON,,,04139,,,,,,,,,,,,,,,,,,,1992-09-30,F,,,,,15.8C,NAF1993,,2.061661,50.820766,0.9,poi,Rue Principale (Pont) Zouafques,https://osm.org/way/111379934,G,,
356000935,01852,35600093501852,O,1991-01-01,NN,,,2019-11-14T14:00:14,false,4,,,,,AN PRESBYTERE,04200,NOYERS-SUR-JABRON,,,04139,,,,,,,,,,,,,,,,,,,2009-03-18,F,BUREAU DE POSTE,,,,53.10Z,NAFRev2,O,-0.18279,47.5949696,0.76,poi.parking,Parking du Presbytère Baugé-en-Anjou,https://osm.org/way/220915843,G,,
379265820,00017,37926582000017,O,,,,,2019-11-14T14:00:14,true,1,,,,,ECOLE DU COUVENT,04200,NOYERS-SUR-JABRON,,,04139,,,,,,,,,,,,,,,,,,,1990-12-31,F,,,,,95.23,NAP,N,6.2030555,45.638519,0.83,poi.parking,Parking du Couvent École,https://osm.org/way/74928572,G,,
380129866,47254,38012986647254,O,2011-01-01,,,,2019-11-14T14:00:14,false,1,,,,QUA,LE VILLAGE,04200,NOYERS-SUR-JABRON,,,04139,,,,,,,,,,,,,,,,,,,2011-01-01,A,,,,,61.10Z,NAFRev2,N,5.825403,44.170094,0.71,street,Le Village 04200 Noyers-sur-Jabron,04139_dponem,G,LE VILLAGE,
380595421,00013,38059542100013,O,,NN,,,2019-11-14T14:00:14,true,1,,,,,PERIVOYE,04200,NOYERS-SUR-JABRON,,,04139,,,,,,,,,,,,,,,,,,,1994-12-31,F,,,,,01.1A,NAF1993,N,,,0,,,,,,
382304418,00017,38230441800017,O,1991-06-01,NN,,,2019-11-14T14:00:14,true,4,,,,,QUARTIER ST TROPHEE,04200,NOYERS-SUR-JABRON,,,04139,,,,,,,,,,,,,,,,,,,2007-12-05,F,,,,,45.2V,NAFRev1,O,,,0,,,,,,
389780446,00016,38978044600016,O,1992-10-01,NN,,,2019-11-14T14:00:14,true,4,,,,RUE,PRINCIPALE,04200,NOYERS-SUR-JABRON,,,04139,,,,,,,,,,,,,,,,,,,2003-07-16,F,,,,,15.8C,NAFRev1,O,2.061661,50.820766,0.9,poi,Rue Principale (Pont) Zouafques,https://osm.org/way/111379934,G,,
390927531,00025,39092753100025,O,2005-05-01,,,,2021-02-23T11:16:48,true,2,,,,,LE COUVENT,04200,NOYERS-SUR-JABRON,,,04139,,,,,,,,,,,,,,,,,,,2008-01-01,A,,,,,01.28Z,NAFRev2,N,5.834833,44.160976,0.34,locality,Saint Lazare le Pre du Pre 04200 Noyers-sur-Jabron,04139_B101,G,SAINT LAZARE LE PRE DU PRE,
393118161,00024,39311816100024,O,2010-01-01,,,,2019-11-14T14:00:14,true,2,VILLA MAGNOLIA,,,,LE VILLAGE,04200,NOYERS-SUR-JABRON,,,04139,,,,,,,,,,,,,,,,,,,2012-11-10,F,,,,,47.89Z,NAFRev2,N,5.825403,44.170094,0.94,street,Le Village 04200 Noyers-sur-Jabron,04139_dponem,G,LE VILLAGE,
393120795,00025,39312079500025,O,2018-01-01,02,2020,,2022-08-29T09:17:04,true,1,,,,,MAIRIE DE NOYERS,04200,NOYERS-SUR-JABRON,,,04139,,,,,,,,,,,,,,,,,,,2018-01-01,A,,,,,88.10A,NAFRev2,O,5.81581,44.16474,0.75,locality,Serre de Marie 04200 Noyers-sur-Jabron,04139_B107,G,SERRE DE MARIE,
397575390,00018,39757539000018,O,1994-01-01,NN,,,2019-11-14T14:00:14,true,5,,,,,LA PRISE,04200,NOYERS-SUR-JABRON,,,04139,,,,,,,,,,,,,,,,,,,2010-12-31,F,,,,,01.45Z,NAFRev2,N,5.820107,44.170048,0.91,locality,L’Adrech de la Prise 04200 Noyers-sur-Jabron,04139_B002,G,L ADRECH DE LA PRISE,
397879313,00021,39787931300021,O,2007-09-24,,,,2023-01-21T03:44:26,true,1,CHEZ YVETTE BLANC,,,,LE VILLAGE,04200,NOYERS-SUR-JABRON,,,04139,,,,,,,,,,,,,,,,,,,2007-09-24,A,,,,,68.20B,NAFRev2,N,5.825403,44.170094,0.94,street,Le Village 04200 Noyers-sur-Jabron,04139_dponem,G,LE VILLAGE,
398046748,00016,39804674800016,O,1900-01-01,NN,,,2019-11-14T14:00:14,true,7,,,,,LES PEYROURIERS,04200,NOYERS-SUR-JABRON,,,04139,,,,,,,,,,,,,,,,,,,2015-12-31,F,,,,,01.45Z,NAFRev2,N,5.84814,44.169783,0.86,street,Les Peyrouries 04200 Noyers-sur-Jabron,04139_jyn1xv,G,LES PEYROURIES,
398046748,00024,39804674800024,O,2003-02-07,NN,,,2019-11-14T14:00:14,false,6,,,,,LES PEYROURIERS,04200,NOYERS-SUR-JABRON,,,04139,,,,,,,,,,,,,,,,,,,2011-12-31,F,,,,,81.30Z,NAFRev2,N,5.84814,44.169783,0.86,street,Les Peyrouries 04200 Noyers-sur-Jabron,04139_jyn1xv,G,LES PEYROURIES,
398587345,00016,39858734500016,O,1900-01-01,NN,,,2019-11-14T14:00:14,false,4,,,,,LES PEYROURIERS,04200,NOYERS-SUR-JABRON,,,04139,,,,,,,,,,,,,,,,,,,1995-12-31,F,,,,,45.2V,NAF1993,N,5.84814,44.169783,0.86,street,Les Peyrouries 04200 Noyers-sur-Jabron,04139_jyn1xv,G,LES PEYROURIES,
398590844,00013,39859084400013,O,,NN,,,2019-11-14T14:00:14,true,1,,,,,LES PEYROURIERS,04200,NOYERS-SUR-JABRON,,,04139,,,,,,,,,,,,,,,,,,,1995-12-06,F,,,,,45.2A,NAF1993,O,5.84814,44.169783,0.86,street,Les Peyrouries 04200 Noyers-sur-Jabron,04139_jyn1xv,G,LES PEYROURIES,
399596287,00017,39959628700017,O,1994-12-12,NN,,,2019-11-14T14:00:14,false,4,,,,,LE MAS DU CHENE,04200,NOYERS-SUR-JABRON,,,04139,,,,,,,,,,,,,,,,,,,2010-09-15,F,,,,,68.20A,NAFRev2,N,,,0,,,,,,
400078580,00018,40007858000018,O,1995-01-01,NN,,,2022-02-01T04:08:37,true,3,,,,,CAMPAGNE LA BASTIE,04200,NOYERS-SUR-JABRON,,,04139,,,,,,,,,,,,,,,,,,,2008-01-01,A,,,,,68.20B,NAFRev2,N,,,0,,,,,,
400250734,00011,40025073400011,O,1995-01-01,NN,,,2021-10-27T08:26:40,true,4,,,,,PERIVOYE,04200,NOYERS-SUR-JABRON,,,04139,,,,,,,,,,,,,,,,,,,2019-12-31,F,,,,,01.45Z,NAFRev2,N,,,0,,,,,,
400661633,00026,40066163300026,O,2013-02-01,,,,2021-02-23T11:24:39,true,1,,,,,LE VILLAGE,04200,NOYERS-SUR-JABRON,,,04139,,,,,,,,,,,,,,,,,,,2013-02-01,A,,,,,47.91B,NAFRev2,N,5.825403,44.170094,0.94,street,Le Village 04200 Noyers-sur-Jabron,04139_dponem,G,LE VILLAGE,
400914305,00018,40091430500018,O,1900-01-01,NN,,,2019-11-14T14:00:14,false,3,,,,,LE VILLAGE,04200,NOYERS-SUR-JABRON,,,04139,,,,,,,,,,,,,,,,,,,1996-04-30,F,,,,,01.4B,NAF1993,N,5.825403,44.170094,0.94,street,Le Village 04200 Noyers-sur-Jabron,04139_dponem,G,LE VILLAGE,
401781927,00017,40178192700017,O,1995-07-01,NN,,,2019-11-14T14:00:14,true,4,,,,QUAI,LE COUVENT,04200,NOYERS-SUR-JABRON,,,04139,,,,,,,,,,,,,,,,,,,2011-04-01,F,,,,,01.45Z,NAFRev2,N,,,0,,,,,,
402710511,00013,40271051100013,O,1995-10-01,NN,,,2020-03-10T11:35:21,true,3,,,,,CAMPAGNE LA BASTIE,04200,NOYERS-SUR-JABRON,,,04139,,,,,,,,,,,,,,,,,,,2008-01-01,A,,,,,68.20A,NAFRev2,N,,,0,,,,,,
402739064,00028,40273906400028,O,2009-09-01,,,,2023-01-12T16:12:22,false,2,,,,,CHALET ST NAZAIRE,04200,NOYERS-SUR-JABRON,,,04139,,,,,,,,,,,,,,,,,,,2022-12-31,F,,,,,70.22Z,NAFRev2,N,,,0,,,,,,
402739064,00036,40273906400036,O,2018-01-01,,,,2021-02-23T11:26:55,false,1,LES LATILS,,,,CHALET SAINT NAZAIRE,04200,NOYERS-SUR-JABRON,,,04139,,,,,,,,,,,,,,,,,,,2018-01-01,A,,,,,68.20A,NAFRev2,N,,,0,,,,,,
402739718,00011,40273971800011,O,1995-08-18,NN,,,2021-01-13T03:37:33,true,4,,,,,LA RIBIERE,04200,NOYERS-SUR-JABRON,,,04139,,,,,,,,,,,,,,,,,,,2008-01-01,A,,,,,01.45Z,NAFRev2,N,6.6581542,43.9712556,0.89,poi.camp_site,Camping La Ribière Annot,https://osm.org/way/184447596,G,,
404915019,00016,40491501900016,O,1996-03-01,NN,,,2019-11-14T14:00:14,true,3,,,,,MAIRIE,04200,NOYERS-SUR-JABRON,,,04139,,,,,,,,,,,,,,,,,,,2008-01-01,A,,,,,94.99Z,NAFRev2,N,3.0709671,50.6304695,0.92,poi.townhall,Hôtel de Ville Lille,https://osm.org/way/40917078,G,,
409151289,00017,40915128900017,O,1996-10-03,NN,,,2019-11-14T14:00:14,true,3,,,,,LA FERME LE DURBAN,04200,NOYERS-SUR-JABRON,,,04139,,,,,,,,,,,,,,,,,,,2001-12-31,F,,,,,91.3E,NAF1993,N,,,0,,,,,,
409699782,00010,40969978200010,O,1996-11-06,NN,,4399CZ,2019-11-14T14:00:14,true,5,,,,,LA RIBIERE,04200,NOYERS-SUR-JABRON,,,04139,,,,,,,,,,,,,,,,,,,2015-10-08,A,,,,,43.99C,NAFRev2,N,6.6581542,43.9712556,0.89,poi.camp_site,Camping La Ribière Annot,https://osm.org/way/184447596,G,,
412190852,00019,41219085200019,O,1997-05-01,NN,,,2019-11-14T14:00:14,true,4,,,,RUE,PRINCIPALE,04200,NOYERS-SUR-JABRON,,,04139,,,,,,,,,,,,,,,,,,,2002-03-31,F,,,,,55.3B,NAF1993,N,2.061661,50.820766,0.9,poi,Rue Principale (Pont) Zouafques,https://osm.org/way/111379934,G,,
412340861,00019,41234086100019,O,1997-04-19,NN,,,2019-11-14T14:00:14,true,1,,,,RUE,PRINCIPALE,04200,NOYERS-SUR-JABRON,,,04139,,,,,,,,,,,,,,,,,,,2002-03-31,F,,,,,74.1J,NAF1993,N,2.061661,50.820766,0.9,poi,Rue Principale (Pont) Zouafques,https://osm.org/way/111379934,G,,
413918731,00022,41391873100022,O,2007-09-01,,,,2019-11-14T14:00:14,true,4,,,,,,04200,NOYERS-SUR-JABRON,,,04139,,,,,,,,,,,,,,,,,,,2012-10-30,F,LA MICHE D'OR,,,,10.71C,NAFRev2,N,,,0,,,,,,
417551348,00028,41755134800028,O,2001-01-01,NN,,,2019-11-14T14:00:14,true,4,,,,,LA CROTTE,04200,NOYERS-SUR-JABRON,,,04139,,,,,,,,,,,,,,,,,,,2011-01-31,F,,,,,01.45Z,NAFRev2,N,5.824114,44.170069,0.37,street,Parpin et Chenebotte 04200 Noyers-sur-Jabron,04139_B076,G,PARPIN ET CHENEBOTTE,
417908506,00070,41790850600070,O,2022-11-01,,,1071CA,2023-01-07T06:00:14,true,1,,2,,PL,DES NUCETOIS,04200,NOYERS-SUR-JABRON,,,04139,,,,,,,,,,,,,,,,,,,2022-11-01,A,LE FACTEUR DU PAIN,,,LE FACTEUR DU PAIN,10.71C,NAFRev2,N,5.839534,44.172337,0.34,locality,Le Plan des Berauds 04200 Noyers-sur-Jabron,04139_B086,G,LE PLAN DES BERAUDS,
418806162,00016,41880616200016,O,1982-12-31,NN,,,2019-11-14T14:00:14,true,4,,,,,FERME DURBAN,04200,NOYERS-SUR-JABRON,,,04139,,,,,,,,,,,,,,,,,,,2016-01-16,F,,,,,01.13Z,NAFRev2,N,,,0,,,,,,