siren,nic,siret,statutDiffusionEtablissement,dateCreationEtablissement,trancheEffectifsEtablissement,anneeEffectifsEtablissement,activitePrincipaleRegistreMetiersEtablissement,dateDernierTraitementEtablissement,etablissementSiege,nombrePeriodesEtablissement,complementAdresseEtablissement,numeroVoieEtablissement,indiceRepetitionEtablissement,typeVoieEtablissement,libelleVoieEtablissement,codePostalEtablissement,libelleCommuneEtablissement,libelleCommuneEtrangerEtablissement,distributionSpecialeEtablissement,codeCommuneEtablissement,codeCedexEtablissement,libelleCedexEtablissement,codePaysEtrangerEtablissement,libellePaysEtrangerEtablissement,complementAdresse2Etablissement,numeroVoie2Etablissement,indiceRepetition2Etablissement,typeVoie2Etablissement,libelleVoie2Etablissement,codePostal2Etablissement,libelleCommune2Etablissement,libelleCommuneEtranger2Etablissement,distributionSpeciale2Etablissement,codeCommune2Etablissement,codeCedex2Etablissement,libelleCedex2Etablissement,codePaysEtranger2Etablissement,libellePaysEtranger2Etablissement,dateDebut,etatAdministratifEtablissement,enseigne1Etablissement,enseigne2Etablissement,enseigne3Etablissement,denominationUsuelleEtablissement,activitePrincipaleEtablissement,nomenclatureActivitePrincipaleEtablissement,caractereEmployeurEtablissement,longitude,latitude,geo_score,geo_type,geo_adresse,geo_id,geo_ligne,geo_l4,geo_l5
210802559,00018,21080255900018,O,1983-03-01,01,2020,,2022-08-29T09:05:50,true,4,,,,RUE,SOUS L'EGLISE,08430,MAZERNY,,,08283,,,,,,,,,,,,,,,,,,,2008-01-01,A,MAIRIE,,,,84.11Z,NAFRev2,O,4.613341,49.610216,0.94,street,Rue sous l’Eglise 08430 Mazerny,08283_0127,G,RUE SOUS L EGLISE,
210802559,00034,21080255900034,O,1996-05-01,NN,,,2008-01-04T18:24:52,false,3,,,,,,08430,MAZERNY,,,08283,,,,,,,,,,,,,,,,,,,2008-01-01,A,SERVICE DES EAUX,,,,36.00Z,NAFRev2,N,,,0,,,,,,
260802525,00014,26080252500014,O,1983-03-01,NN,,,2016-11-20T14:10:51,true,4,MAIRIE,,,RUE,SOUS L'EGLISE,08430,MAZERNY,,,08283,,,,,,,,,,,,,,,,,,,2016-01-01,F,CCAS,,,,88.99B,NAFRev2,N,4.613341,49.610216,0.94,street,Rue sous l’Eglise 08430 Mazerny,08283_0127,G,RUE SOUS L EGLISE,
270802564,00012,27080256400012,O,,,,,,true,1,,,,,MAIRIE,08430,MAZERNY,,,08283,,,,,,,,,,,,,,,,,,,1995-12-25,F,,,,,41.0Z,NAF1993,N,3.0709671,50.6304695,0.92,poi.townhall,Hôtel de Ville Lille,https://osm.org/way/40917078,G,,
290802842,00010,29080284200010,O,1995-03-31,NN,,,2008-01-04T19:05:50,true,3,MAIRIE,,,RUE,SOUS L'EGLISE,08430,MAZERNY,,,08283,,,,,,,,,,,,,,,,,,,2008-01-01,A,,,,,42.99Z,NAFRev2,N,4.613341,49.610216,0.94,street,Rue sous l’Eglise 08430 Mazerny,08283_0127,G,RUE SOUS L EGLISE,
302753124,00015,30275312400015,O,1900-01-01,NN,,,2019-08-01T14:19:59,true,3,MR ANTOINE GEOFFROY,,,,,08430,MAZERNY,,,08283,,,,,,,,,,,,,,,,,,,2008-01-01,A,,,,,01.50Z,NAFRev2,N,,,0,,,,,,
307756346,00044,30775634600044,O,2010-04-01,,,,2013-12-18T08:21:59,true,1,,5,,RUE,SOUS L'EGLISE,08430,MAZERNY,,,08283,,,,,,,,,,,,,,,,,,,2010-04-01,F,,,,,43.32A,NAFRev2,N,4.612981,49.610423,0.94,housenumber,5 Rue sous l’Eglise 08430 Mazerny,08283_0127_00005,G,5 RUE SOUS L EGLISE,
310058987,00010,31005898700010,O,,NN,,,,true,1,,,,,,08430,MAZERNY,,,08283,,,,,,,,,,,,,,,,,,,1988-12-31,F,,,,,78.02,NAP,N,,,0,,,,,,
315364588,00014,31536458800014,O,1979-01-01,NN,,,2008-11-07T00:30:50,true,4,,,,,LA CRETE MOUTON,08430,MAZERNY,,,08283,,,,,,,,,,,,,,,,,,,2006-07-31,F,,,,,45.4J,NAFRev1,O,4.64228,49.621775,0.78,street,Crete Mouton 08430 Mazerny,08283_B032,G,CRETE MOUTON,
317455418,00010,31745541800010,O,1979-01-01,NN,,,2012-07-28T09:58:47,true,4,,,,,,08430,MAZERNY,,,08283,,,,,,,,,,,,,,,,,,,2008-01-01,F,,,,,10.11Z,NAFRev2,N,,,0,,,,,,
320639842,00014,32063984200014,O,,NN,,,,true,1,,,,,,08430,MAZERNY,,,08283,,,,,,,,,,,,,,,,,,,1987-12-31,F,,,,,22.02,NAP,N,,,0,,,,,,
320639883,00018,32063988300018,O,,NN,,,,true,1,,,,,,08430,MAZERNY,,,08283,,,,,,,,,,,,,,,,,,,1987-12-31,F,,,,,22.02,NAP,N,,,0,,,,,,
325207249,00013,32520724900013,O,,,,,,true,1,,,,,,08430,MAZERNY,,,08283,,,,,,,,,,,,,,,,,,,1984-12-25,F,,,,,56.01,NAP,N,,,0,,,,,,
349797324,00010,34979732400010,O,,NN,,,,true,1,,,,RUE,NAPOLEON,08430,MAZERNY,,,08283,,,,,,,,,,,,,,,,,,,1989-06-30,F,,,,,65.03,NAP,N,4.610543,49.610482,0.31,street,Rue de la Camoterie 08430 Mazerny,08283_0131,G,RUE DE LA CAMOTERIE,
388485153,00026,38848515300026,O,2000-06-01,NN,,,2019-06-24T13:15:34,true,5,,,,,GRANDE RUE,08430,MAZERNY,,,08283,,,,,,,,,,,,,,,,,,,2017-03-31,F,,,,,43.22B,NAFRev2,N,4.614138,49.608967,0.94,street,Grande Rue 08430 Mazerny,08283_0128,G,GRANDE RUE,
388980757,00016,38898075700016,O,1981-01-01,NN,,,,true,5,,,,,,08430,MAZERNY,,,08283,,,,,,,,,,,,,,,,,,,2003-03-31,F,,,,,01.1A,NAFRev1,N,,,0,,,,,,
388981078,00016,38898107800016,O,1991-01-01,NN,,,2014-03-13T03:57:33,true,4,,,,,,08430,MAZERNY,,,08283,,,,,,,,,,,,,,,,,,,2014-01-31,F,,,,,01.42Z,NAFRev2,N,,,0,,,,,,
388981532,00012,38898153200012,O,1978-01-01,NN,,,2006-10-28T01:25:57,true,3,,,,,,08430,MAZERNY,,,08283,,,,,,,,,,,,,,,,,,,2006-06-30,F,,,,,01.3Z,NAFRev1,N,,,0,,,,,,
389054545,00014,38905454500014,O,,NN,,,,true,1,,,,,FERME HAUTE MAISON,08430,MAZERNY,,,08283,,,,,,,,,,,,,,,,,,,1994-12-31,F,,,,,01.3Z,NAF1993,N,3.2078265,48.5372212,0.85,poi.guest_house,Ferme de la Haute Maison (Maison d'hôte) Saint-Loup-de-Naud,https://osm.org/node/3469150957,G,,
401294459,00029,40129445900029,O,2002-12-01,NN,,,2012-04-20T04:29:18,true,3,,,,,FERME DE LA HAUTE MAISON,08430,MAZERNY,,,08283,,,,,,,,,,,,,,,,,,,2008-01-01,A,,,,,01.42Z,NAFRev2,N,3.2078265,48.5372212,0.9,poi.guest_house,Ferme de la Haute Maison (Maison d'hôte) Saint-Loup-de-Naud,https://osm.org/node/3469150957,G,,
401734850,00019,40173485000019,O,1977-01-01,NN,,,2018-05-31T04:01:01,true,4,,,,,,08430,MAZERNY,,,08283,,,,,,,,,,,,,,,,,,,2017-10-30,F,,,,,02.40Z,NAFRev2,N,,,0,,,,,,
411419294,00011,41141929400011,O,1981-01-01,NN,,,,true,4,,,,,,08430,MAZERNY,,,08283,,,,,,,,,,,,,,,,,,,2001-11-14,F,,,,,01.1A,NAF1993,N,,,0,,,,,,
424406577,00017,42440657700017,O,1999-09-28,NN,,,2016-01-12T00:21:16,true,3,,,,,,08430,MAZERNY,,,08283,,,,,,,,,,,,,,,,,,,2008-01-01,A,,,,,01.50Z,NAFRev2,N,,,0,,,,,,
427979380,00016,42797938000016,O,1968-01-01,NN,,,2008-01-05T01:21:03,true,3,,,,,,08430,MAZERNY,,,08283,,,,,,,,,,,,,,,,,,,2008-01-01,A,,,,,01.50Z,NAFRev2,N,,,0,,,,,,
442379392,00024,44237939200024,O,2003-05-20,NN,,,2019-06-24T13:20:46,false,4,,,,,LES LOCHES,08430,MAZERNY,,,08283,,,,,,,,,,,,,,,,,,,2018-05-31,F,,,,,01.50Z,NAFRev2,N,4.634999,49.605626,0.93,street,Les Loches 08430 Mazerny,08283_4bm18d,G,LES LOCHES,
442379392,00032,44237939200032,O,2004-04-01,NN,,,2018-07-12T14:28:54,false,4,LES LOCHES,,,,,08430,MAZERNY,,,08283,,,,,,,,,,,,,,,,,,,2018-05-31,F,,,,,55.20Z,NAFRev2,N,4.634999,49.605626,0.93,street,Les Loches 08430 Mazerny,08283_4bm18d,D,LES LOCHES,
442744678,00016,44274467800016,O,1977-10-08,NN,,,2018-05-31T04:00:59,true,4,,,,,,08430,MAZERNY,,,08283,,,,,,,,,,,,,,,,,,,2017-10-30,F,,,,,68.20B,NAFRev2,N,,,0,,,,,,
443169453,00018,44316945300018,O,1977-10-08,NN,,,2017-10-17T03:36:11,true,3,,,,,,08430,MAZERNY,,,08283,,,,,,,,,,,,,,,,,,,2008-01-01,A,,,,,68.20B,NAFRev2,N,,,0,,,,,,
482808110,00019,48280811000019,O,2005-06-14,,,,2008-01-05T21:50:30,true,2,,3,,RUE,DE MAINBU,08430,MAZERNY,,,08283,,,,,,,,,,,,,,,,,,,2008-01-01,A,,,,,68.20B,NAFRev2,N,4.619121,49.612275,0.76,housenumber,3 Route de Mainbu 08430 Mazerny,08283_0135_00003,G,3 ROUTE DE MAINBU,
484777834,00017,48477783400017,O,2005-10-24,NN,,,2013-05-18T03:44:49,false,3,,,,CHE,DES LOCHES,08430,MAZERNY,,,08283,,,,,,,,,,,,,,,,,,,2011-07-12,F,,,,,62.01Z,NAFRev2,O,4.634999,49.605626,0.59,street,Les Loches 08430 Mazerny,08283_4bm18d,G,LES LOCHES,
489009514,00014,48900951400014,O,2006-01-01,,,,2020-12-03T19:35:12,true,3,,10,,,GRAND RUE,08430,MAZERNY,,,08283,,,,,,,,,,,,,,,,,,,2019-06-01,F,,,,,01.49Z,NAFRev2,N,4.613779,49.609069,0.8,housenumber,10 Grande Rue 08430 Mazerny,08283_0128_00010,G,10 GRANDE RUE,
491872453,00015,49187245300015,O,2006-09-14,,,,2010-06-17T11:36:10,true,2,,,,,GRAND'RUE,08430,MAZERNY,,,08283,,,,,,,,,,,,,,,,,,,2008-01-01,A,,,,,68.20B,NAFRev2,N,4.614138,49.608967,0.75,street,Grande Rue 08430 Mazerny,08283_0128,G,GRANDE RUE,
499015485,00018,49901548500018,O,2007-07-01,NN,,,2014-07-10T00:54:02,true,7,,,,,GRAND'RUE,08430,MAZERNY,,,08283,,,,,,,,,,,,,,,,,,,2013-09-27,F,,,,,43.22A,NAFRev2,N,4.614138,49.608967,0.75,street,Grande Rue 08430 Mazerny,08283_0128,G,GRANDE RUE,
502853419,00013,50285341900013,O,2008-03-01,,,,2018-12-06T10:53:00,true,2,,,,CHE,DES LOCHES,08430,MAZERNY,,,08283,,,,,,,,,,,,,,,,,,,2018-06-30,F,,,,,47.91B,NAFRev2,N,4.634999,49.605626,0.59,street,Les Loches 08430 Mazerny,08283_4bm18d,G,LES LOCHES,
514054642,00012,51405464200012,O,1968-04-01,NN,,,2021-06-16T03:36:53,true,2,,1,,RUE,ETIENNE HULOT,08430,MAZERNY,,,08283,,,,,,,,,,,,,,,,,,,2021-03-31,F,,,,,01.50Z,NAFRev2,N,4.612514,49.60974,0.93,housenumber,1 Rue Etienne Hulot 08430 Mazerny,08283_0129_00001,G,1 RUE ETIENNE HULOT,
751501354,00029,75150135400029,O,2018-10-22,,,1610AQ,2021-02-23T16:07:03,true,2,,13,,RUE,DE LA CAMOTERIE,08430,MAZERNY,,,08283,,,,,,,,,,,,,,,,,,,2019-01-17,A,,,,TOOFER SERVICES,81.30Z,NAFRev2,N,4.608135,49.610995,0.94,housenumber,13 Rue de la Camoterie 08430 Mazerny,08283_0131_00013,G,13 RUE DE LA CAMOTERIE,
751501354,00037,75150135400037,O,2019-05-09,,,,2021-02-23T16:07:03,false,1,,13,,RUE,DE LA CAMOTERIE,08430,MAZERNY,,,08283,,,,,,,,,,,,,,,,,,,2019-05-09,A,,,,,01.45Z,NAFRev2,N,4.608135,49.610995,0.94,housenumber,13 Rue de la Camoterie 08430 Mazerny,08283_0131_00013,G,13 RUE DE LA CAMOTERIE,
752870717,00010,75287071700010,O,2012-07-23,,,,2018-02-01T10:29:03,false,3,,1,,,LA CRETE MOUTON,08430,MAZERNY,,,08283,,,,,,,,,,,,,,,,,,,2015-12-29,F,,,,LUMIERES ET COULEURS,43.34Z,NAFRev2,N,4.642044,49.62209,0.75,housenumber,1 Crete Mouton 08430 Mazerny,08283_b032_00001,G,1 CRETE MOUTON,
780270484,00014,78027048400014,O,,NN,,,,true,1,,,,,,08430,MAZERNY,,,08283,,,,,,,,,,,,,,,,,,,1998-08-31,F,,,,,01.2A,NAF1993,N,,,0,,,,,,
780270492,00017,78027049200017,O,,NN,,,,true,1,,,,,GRAND RUE,08430,MAZERNY,,,08283,,,,,,,,,,,,,,,,,,,1987-12-31,F,,,,,22.02,NAP,N,4.614138,49.608967,0.75,street,Grande Rue 08430 Mazerny,08283_0128,G,GRANDE RUE,
780270500,00017,78027050000017,O,,NN,,,,true,1,,,,,,08430,MAZERNY,,,08283,,,,,,,,,,,,,,,,,,,,F,,,,,81.11,NAP,N,,,0,,,,,,
786620229,00033,78662022900033,O,2000-07-01,02,2020,,2022-08-29T09:46:23,true,3,FERME DE LA HAUTE MAISON,,,,FERME DE LA HAUTE MAISON,08430,MAZERNY,,,08283,,,,,,,,,,,,,,,,,,,2008-01-01,A,,,,,46.23Z,NAFRev2,O,3.2078265,48.5372212,0.9,poi.guest_house,Ferme de la Haute Maison (Maison d'hôte) Saint-Loup-de-Naud,https://osm.org/node/3469150957,G,,
800935033,00012,80093503300012,O,2014-02-01,01,2020,,2022-08-29T09:56:10,true,1,,5,,RUE,DU CHATEAU,08430,MAZERNY,,,08283,,,,,,,,,,,,,,,,,,,2014-02-01,A,,,,,01.42Z,NAFRev2,N,4.616025,49.610287,0.94,housenumber,5 Rue du Chateau 08430 Mazerny,08283_0126_00005,G,5 RUE DU CHATEAU,
811116490,00012,81111649000012,O,2014-02-27,,,,2015-04-28T16:04:12,true,1,,3,,RUE,SOUS L'EGLISE,08430,MAZERNY,,,08283,,,,,,,,,,,,,,,,,,,2014-02-27,A,,,,,90.01Z,NAFRev2,N,4.612899,49.610448,0.94,housenumber,3 Rue sous l’Eglise 08430 Mazerny,08283_0127_00003,G,3 RUE SOUS L EGLISE,
818178709,00015,81817870900015,O,2016-02-15,,,4322AZ,2022-08-09T19:37:32,true,2,,13,,RUE,SOUS L'EGLISE,08430,MAZERNY,,,08283,,,,,,,,,,,,,,,,,,,2022-07-31,F,,,,,43.22A,NAFRev2,N,4.613652,49.610071,0.94,housenumber,13 Rue sous l’Eglise 08430 Mazerny,08283_0127_00013,G,13 RUE SOUS L EGLISE,
828602334,00017,82860233400017,O,2017-03-24,12,2020,4322BB,2022-11-24T10:47:05,false,3,,9,,,GRANDE RUE,08430,MAZERNY,,,08283,,,,,,,,,,,,,,,,,,,2022-08-29,F,,,,THEVENIN JOSE,43.22B,NAFRev2,O,4.614351,49.608826,0.94,housenumber,9 Grande Rue 08430 Mazerny,08283_0128_00009,G,9 GRANDE RUE,
842060394,00017,84206039400017,O,2018-09-01,,,,2020-05-19T03:54:38,true,2,,2,,RUE,DE LA CAMOTERIE,08430,MAZERNY,,,08283,,,,,,,,,,,,,,,,,,,2019-05-15,F,,,,,47.99A,NAFRev2,N,4.611655,49.61028,0.94,housenumber,2 Rue de la Camoterie 08430 Mazerny,08283_0131_00002,G,2 RUE DE LA CAMOTERIE,
878922889,00018,87892288900018,O,2000-05-05,,,,2019-11-14T11:12:43,true,1,MAIRIE,,,RUE,SOUS L EGLISE,08430,MAZERNY,,,08283,,,,,,,,,,,,,,,,,,,2000-05-05,A,,,,,94.99Z,NAFRev2,N,4.613341,49.610216,0.94,street,Rue sous l’Eglise 08430 Mazerny,08283_0127,G,RUE SOUS L EGLISE,
881851133,00010,88185113300010,O,2020-02-01,,,,2020-02-25T03:45:09,true,1,,1,,RUE,ETIENNE HULOT,08430,MAZERNY,,,08283,,,,,,,,,,,,,,,,,,,2020-02-01,A,,,,,01.41Z,NAFRev2,N,4.612514,49.60974,0.93,housenumber,1 Rue Etienne Hulot 08430 Mazerny,08283_0129_00001,G,1 RUE ETIENNE HULOT,
881851836,00018,88185183600018,O,2020-02-01,,,,2020-02-25T09:45:48,true,1,,2,,CHE,DE VICHAUX,08430,MAZERNY,,,08283,,,,,,,,,,,,,,,,,,,2020-02-01,A,,,,,01.42Z,NAFRev2,N,4.611843,49.608984,0.82,housenumber,2 Chemin de Vichaux 08430 Mazerny,08283_0150_00002,G,2 CHEMIN DE VICHAUX,
881853774,00019,88185377400019,O,2020-04-21,,,,2020-02-25T03:45:10,true,1,,,,,,08430,MAZERNY,,,08283,,,,,,,,,,,,,,,,,,,2020-04-21,A,,,,,02.20Z,NAFRev2,N,,,0,,,,,,
881854525,00014,88185452500014,O,2020-04-21,,,,2020-02-25T03:45:10,true,1,,,,,,08430,MAZERNY,,,08283,,,,,,,,,,,,,,,,,,,2020-04-21,A,,,,,02.20Z,NAFRev2,N,,,0,,,,,,
913807210,00012,91380721000012,O,2022-06-01,,,,2022-05-25T03:38:56,true,1,,3,,RTE,DE MAINBU,08430,MAZERNY,,,08283,,,,,,,,,,,,,,,,,,,2022-06-01,A,L ABEILLE DE MAINBU,,,,01.49Z,NAFRev2,N,4.619121,49.612275,0.82,housenumber,3 Route de Mainbu 08430 Mazerny,08283_0135_00003,G,3 ROUTE DE MAINBU,
914157300,00015,91415730000015,O,2022-06-06,,,,2022-06-04T11:59:46,true,1,HARAS DE MAZERNY,,,,LES LOCHES,08430,MAZERNY,,,08283,,,,,,,,,,,,,,,,,,,2022-06-06,A,,,,REBEAU MICKAEL,62.01Z,NAFRev2,N,4.634999,49.605626,0.93,street,Les Loches 08430 Mazerny,08283_4bm18d,G,LES LOCHES,
