siren,nic,siret,statutDiffusionEtablissement,dateCreationEtablissement,trancheEffectifsEtablissement,anneeEffectifsEtablissement,activitePrincipaleRegistreMetiersEtablissement,dateDernierTraitementEtablissement,etablissementSiege,nombrePeriodesEtablissement,complementAdresseEtablissement,numeroVoieEtablissement,indiceRepetitionEtablissement,typeVoieEtablissement,libelleVoieEtablissement,codePostalEtablissement,libelleCommuneEtablissement,libelleCommuneEtrangerEtablissement,distributionSpecialeEtablissement,codeCommuneEtablissement,codeCedexEtablissement,libelleCedexEtablissement,codePaysEtrangerEtablissement,libellePaysEtrangerEtablissement,complementAdresse2Etablissement,numeroVoie2Etablissement,indiceRepetition2Etablissement,typeVoie2Etablissement,libelleVoie2Etablissement,codePostal2Etablissement,libelleCommune2Etablissement,libelleCommuneEtranger2Etablissement,distributionSpeciale2Etablissement,codeCommune2Etablissement,codeCedex2Etablissement,libelleCedex2Etablissement,codePaysEtranger2Etablissement,libellePaysEtranger2Etablissement,dateDebut,etatAdministratifEtablissement,enseigne1Etablissement,enseigne2Etablissement,enseigne3Etablissement,denominationUsuelleEtablissement,activitePrincipaleEtablissement,nomenclatureActivitePrincipaleEtablissement,caractereEmployeurEtablissement,longitude,latitude,geo_score,geo_type,geo_adresse,geo_id,geo_ligne,geo_l4,geo_l5
213500283,00014,21350028300014,O,1983-03-01,03,2020,,2022-08-29T09:06:56,true,3,,2,,PL,DE LA MAIRIE,35150,BOISTRUDAN,,,35028,,,,,,,,,,,,,,,,,,,2008-01-01,A,MAIRIE,,,,84.11Z,NAFRev2,O,-1.401933,47.969652,0.84,housenumber,2 Place de la Mairie 35150 Boistrudan,35028_0090_00002,G,2 PLACE DE LA MAIRIE,
213500283,00022,21350028300022,O,1991-09-10,NN,,,2009-06-18T11:14:42,false,3,MAIRIE,2,,PL,DE LA MAIRIE,35150,BOISTRUDAN,,,35028,,,,,,,,,,,,,,,,,,,2008-01-01,A,CANTINE MUNICIPALE,,,,56.29B,NAFRev2,N,-1.401933,47.969652,0.84,housenumber,2 Place de la Mairie 35150 Boistrudan,35028_0090_00002,G,2 PLACE DE LA MAIRIE,
213500283,00030,21350028300030,O,1996-12-25,NN,,,2013-03-30T12:03:38,false,3,,,,PL,DE LA MAIRIE,35150,BOISTRUDAN,,,35028,,,,,,,,,,,,,,,,,,,2011-12-25,F,LOTISSEMENT BELLEVUE,,,,42.99Z,NAFRev2,N,-1.402001,47.969674,0.82,street,Place de la Mairie 35150 Boistrudan,35028_0090,G,PLACE DE LA MAIRIE,
213500283,00048,21350028300048,O,2000-04-12,NN,,,2008-01-04T18:31:51,false,3,MAIRIE,2,,PL,DE LA MAIRIE,35150,BOISTRUDAN,,,35028,,,,,,,,,,,,,,,,,,,2008-01-01,A,ASSAINISSEMENT,,,,37.00Z,NAFRev2,N,-1.401933,47.969652,0.84,housenumber,2 Place de la Mairie 35150 Boistrudan,35028_0090_00002,G,2 PLACE DE LA MAIRIE,
213500283,00055,21350028300055,O,2002-01-01,NN,,,2011-10-25T15:20:00,false,4,MAIRIE,2,,PL,DE LA MAIRIE,35150,BOISTRUDAN,,,35028,,,,,,,,,,,,,,,,,,,2009-12-31,F,LOTISSEMENT DES FILANDIERS,,,,42.99Z,NAFRev2,N,-1.401933,47.969652,0.84,housenumber,2 Place de la Mairie 35150 Boistrudan,35028_0090_00002,G,2 PLACE DE LA MAIRIE,
253502041,00028,25350204100028,O,2005-06-24,NN,,,2017-02-08T08:34:08,true,3,MAIRIE,2,,PL,DE LA MAIRIE,35150,BOISTRUDAN,,,35028,,,,,,,,,,,,,,,,,,,2017-02-06,F,,,,,49.39A,NAFRev2,N,-1.401933,47.969652,0.84,housenumber,2 Place de la Mairie 35150 Boistrudan,35028_0090_00002,G,2 PLACE DE LA MAIRIE,
263500696,00012,26350069600012,O,1983-03-01,NN,,,2010-06-26T03:08:51,true,3,MAIRIE,,,,BOURG,35150,BOISTRUDAN,,,35028,,,,,,,,,,,,,,,,,,,2008-01-01,A,CCAS,,,,88.99B,NAFRev2,N,-1.402871,47.969915,0.43,street,Impasse du Fournil 35150 Boistrudan,35028_0053,G,IMPASSE DU FOURNIL,
273501775,00012,27350177500012,O,,,,,,true,1,,,,,BOURG,35150,BOISTRUDAN,,,35028,,,,,,,,,,,,,,,,,,,1995-12-25,F,,,,,70.1C,NAF1993,N,-1.402871,47.969915,0.43,street,Impasse du Fournil 35150 Boistrudan,35028_0053,G,IMPASSE DU FOURNIL,
293500575,00015,29350057500015,O,1983-08-10,NN,,,2006-11-25T09:10:37,true,1,,,,,LE BOURG,35150,BOISTRUDAN,,,35028,,,,,,,,,,,,,,,,,,,1998-12-10,F,,,,,70.1C,NAF1993,N,-1.401319,47.970946,0.51,locality,Le Bois Chardron 35150 Boistrudan,35028_B018,G,LE BOIS CHARDRON,
300039435,00049,30003943500049,O,2010-08-01,,,,2015-02-06T15:25:41,true,2,,16,,RUE,FRANCOIS MARIE LE ROUX,35150,BOISTRUDAN,,,35028,,,,,,,,,,,,,,,,,,,2013-12-31,F,,,,,46.15Z,NAFRev2,N,-1.399271,47.969074,0.87,housenumber,16 Rue Francois Marie Leroux 35150 Boistrudan,35028_jk7rqg_00016,G,16 RUE FRANCOIS MARIE LEROUX,
300805421,00033,30080542100033,O,,NN,,,,true,1,,,,,LE GRAND CHEMIN,35150,BOISTRUDAN,,,35028,,,,,,,,,,,,,,,,,,,1992-04-30,F,,,,,52.6E,NAF1993,N,-1.40482,47.978393,0.94,locality,Le Grand Chemin 35150 Boistrudan,35028_B257,G,LE GRAND CHEMIN,
309027712,00038,30902771200038,O,2001-05-02,NN,,,,false,4,,18,,RUE,FRANCOIS MARIE LEROUX,35150,BOISTRUDAN,,,35028,,,,,,,,,,,,,,,,,,,2002-04-30,F,INFO PUB OUEST,,,,74.4B,NAF1993,N,-1.401204,47.969626,0.95,housenumber,18 Rue Francois Marie Leroux 35150 Boistrudan,35028_jk7rqg_00018,G,18 RUE FRANCOIS MARIE LEROUX,
313091472,00016,31309147200016,O,,,,,,true,1,,,,,MONTBEIL,35150,BOISTRUDAN,,,35028,,,,,,,,,,,,,,,,,,,1994-01-10,F,,,,,01.2E,NAF1993,N,-1.380422,47.973878,0.6,locality,La Haute Monbeil 35150 Boistrudan,35028_B330,G,LA HAUTE MONBEIL,
313908238,00055,31390823800055,O,2001-02-01,NN,,,2022-12-16T03:54:48,true,4,,,,,LA RIVIERE AUX MEUNIERS,35150,BOISTRUDAN,,,35028,,,,,,,,,,,,,,,,,,,2022-12-31,F,,,,,47.89Z,NAFRev2,N,-1.415085,47.963823,0.94,locality,La Rivière aux Meuniers 35150 Boistrudan,35028_B705,G,LA RIVIERE AUX MEUNIERS,
316506658,00012,31650665800012,O,1979-01-01,NN,,,2008-01-04T20:46:28,true,4,,,,,FLEURET,35150,BOISTRUDAN,,,35028,,,,,,,,,,,,,,,,,,,2008-01-01,A,,,,,01.13Z,NAFRev2,N,-1.40732,47.961233,0.68,locality,Le Grand Fleure 35150 Boistrudan,35028_B263,G,LE GRAND FLEURE,
318332244,00017,31833224400017,O,1980-01-01,NN,,,,false,4,MAIRIE,,,,BOURG,35150,BOISTRUDAN,,,35028,,,,,,,,,,,,,,,,,,,2000-03-18,F,,,,,70.2B,NAF1993,N,-1.402871,47.969915,0.43,street,Impasse du Fournil 35150 Boistrudan,35028_0053,G,IMPASSE DU FOURNIL,
318332244,00025,31833224400025,O,2000-03-18,NN,,,2009-04-02T05:37:04,true,3,,,,,LA CHOUANIERE,35150,BOISTRUDAN,,,35028,,,,,,,,,,,,,,,,,,,2008-01-01,A,,,,,68.20B,NAFRev2,N,-1.415085,47.963823,0.47,locality,La Rivière aux Meuniers 35150 Boistrudan,35028_B705,G,LA RIVIERE AUX MEUNIERS,
321397879,00016,32139787900016,O,,,,,,true,1,,,,,BOURG,35150,BOISTRUDAN,,,35028,,,,,,,,,,,,,,,,,,,,F,,,,,22.02,NAP,N,-1.402871,47.969915,0.43,street,Impasse du Fournil 35150 Boistrudan,35028_0053,G,IMPASSE DU FOURNIL,
324043660,00012,32404366000012,O,,NN,,,,true,1,,,,,LE CHATEL,35150,BOISTRUDAN,,,35028,,,,,,,,,,,,,,,,,,,1987-06-22,F,,,,,77.10,NAP,N,-1.401319,47.970946,0.46,locality,Le Bois Chardron 35150 Boistrudan,35028_B018,G,LE BOIS CHARDRON,
325402485,00016,32540248500016,O,1982-09-01,NN,,,,false,4,,,,LOT,DU LEVANT,35150,BOISTRUDAN,,,35028,,,,,,,,,,,,,,,,,,,1994-12-25,F,,,,,85.1G,NAF1993,N,-1.396619,47.968812,0.87,street,Lotissement du Levant 35150 Boistrudan,35028_A005,G,LOTISSEMENT DU LEVANT,
327224713,00013,32722471300013,O,,NN,,,,true,1,,,,,BOURG,35150,BOISTRUDAN,,,35028,,,,,,,,,,,,,,,,,,,1992-03-31,F,,,,,55.4B,NAF1993,N,-1.402871,47.969915,0.43,street,Impasse du Fournil 35150 Boistrudan,35028_0053,G,IMPASSE DU FOURNIL,
327740411,00019,32774041100019,O,1983-05-26,NN,,,2013-05-18T03:21:38,true,5,,2,,RUE,FRANCOIS MARIE LEROUX,35150,BOISTRUDAN,,,35028,,,,,,,,,,,,,,,,,,,2011-04-30,F,,,,,56.30Z,NAFRev2,O,-1.401966,47.970404,0.95,housenumber,2 Rue Francois Marie Leroux 35150 Boistrudan,35028_jk7rqg_00002,G,2 RUE FRANCOIS MARIE LEROUX,
328257514,00013,32825751400013,O,,NN,,,,true,1,,,,LD,LE HAUT CONNAY,35150,BOISTRUDAN,,,35028,,,,,,,,,,,,,,,,,,,1992-10-06,F,,,,,45.1A,NAF1993,N,-1.384047,47.993834,0.82,locality,Le Haut Conay 35150 Boistrudan,35028_B323,G,LE HAUT CONAY,
330008574,00023,33000857400023,O,1988-04-15,NN,,,,true,1,,,,,BOURG,35150,BOISTRUDAN,,,35028,,,,,,,,,,,,,,,,,,,1998-03-31,F,,,,,15.8C,NAF1993,N,-1.402871,47.969915,0.43,street,Impasse du Fournil 35150 Boistrudan,35028_0053,G,IMPASSE DU FOURNIL,
330534595,00021,33053459500021,O,1994-12-29,NN,,,2008-01-04T20:00:47,true,3,,,,,LA MOTTE DE CONNAY,35150,BOISTRUDAN,,,35028,,,,,,,,,,,,,,,,,,,2008-01-01,A,,,,,68.20B,NAFRev2,N,,,0,,,,,,
331359976,00023,33135997600023,O,,NN,,,,true,1,,,,,LOTISSEMENT BELLEVUE,35150,BOISTRUDAN,,,35028,,,,,,,,,,,,,,,,,,,1992-05-03,F,,,,,60.2L,NAF1993,N,-1.403406,47.971634,0.46,street,Impasse de Bellevue 35150 Boistrudan,35028_0820,G,IMPASSE DE BELLEVUE,
331394775,00018,33139477500018,O,1984-11-26,NN,,,2007-05-19T09:36:51,true,4,,,,,LA CHOUANIERE,35150,BOISTRUDAN,,,35028,,,,,,,,,,,,,,,,,,,2005-03-30,F,,,,,60.2M,NAFRev1,N,-1.415085,47.963823,0.47,locality,La Rivière aux Meuniers 35150 Boistrudan,35028_B705,G,LA RIVIERE AUX MEUNIERS,
331704494,00011,33170449400011,O,1985-02-01,01,2020,,2022-08-29T09:22:13,true,4,,,,,MONTBEIL,35150,BOISTRUDAN,,,35028,,,,,,,,,,,,,,,,,,,2008-01-01,A,,,,,01.46Z,NAFRev2,N,-1.380422,47.973878,0.6,locality,La Haute Monbeil 35150 Boistrudan,35028_B330,G,LA HAUTE MONBEIL,
332352335,00019,33235233500019,O,,NN,,,,true,1,,,,,LA CUSSIONNIERE,35150,BOISTRUDAN,,,35028,,,,,,,,,,,,,,,,,,,,F,,,,,87.03,NAP,N,-1.415085,47.963823,0.42,locality,La Rivière aux Meuniers 35150 Boistrudan,35028_B705,G,LA RIVIERE AUX MEUNIERS,
334659992,00013,33465999200013,O,,,,,,true,1,,,,,LA CUSSONNIERE,35150,BOISTRUDAN,,,35028,,,,,,,,,,,,,,,,,,,1997-05-31,F,,,,,01.2E,NAF1993,N,-1.415085,47.963823,0.44,locality,La Rivière aux Meuniers 35150 Boistrudan,35028_B705,G,LA RIVIERE AUX MEUNIERS,
338152986,00018,33815298600018,O,,NN,,,,true,1,,,,LD,LE LEVANT,35150,BOISTRUDAN,,,35028,,,,,,,,,,,,,,,,,,,1988-02-29,F,,,,,79.06,NAP,N,-1.396619,47.968812,0.72,street,Lotissement du Levant 35150 Boistrudan,35028_A005,G,LOTISSEMENT DU LEVANT,
341189603,00051,34118960300051,O,1997-12-12,NN,,,2006-11-25T10:40:30,true,4,,9,,RUE,FRANSOIS MARIE LEROUX,35150,BOISTRUDAN,,,35028,,,,,,,,,,,,,,,,,,,2004-03-28,F,,,,,55.4B,NAFRev1,N,-1.401543,47.96994,0.86,housenumber,9 Rue Francois Marie Leroux 35150 Boistrudan,35028_jk7rqg_00009,G,9 RUE FRANCOIS MARIE LEROUX,
341857217,00010,34185721700010,O,1985-11-27,01,2020,,2022-08-29T09:27:13,true,4,,,,,BOURG,35150,BOISTRUDAN,,,35028,,,,,,,,,,,,,,,,,,,2008-01-01,A,,,,,93.12Z,NAFRev2,O,-1.402871,47.969915,0.43,street,Impasse du Fournil 35150 Boistrudan,35028_0053,G,IMPASSE DU FOURNIL,
341964617,00037,34196461700037,O,,NN,,,,true,1,,,,,LE HAUT LOURME,35150,BOISTRUDAN,,,35028,,,,,,,,,,,,,,,,,,,1992-01-02,F,,,,,51.6J,NAF1993,N,-1.395859,47.958703,0.45,locality,Au Bas Lourme 35150 Boistrudan,35028_B007,G,AU BAS LOURME,
349454512,00014,34945451200014,O,1989-02-01,01,2020,,2022-08-29T09:31:18,true,4,,,,LD,LA BASSE TRANCOUILLERE,35150,BOISTRUDAN,,,35028,,,,,,,,,,,,,,,,,,,2012-12-31,A,,,,,01.47Z,NAFRev2,O,-1.41526,47.97658,0.94,locality,La Basse Trancouillère 35150 Boistrudan,35028_B009,G,LA BASSE TRANCOUILLERE,
351709407,00024,35170940700024,O,2009-07-10,,,,2022-04-26T04:04:19,true,1,,,,,BAS-CONNAY,35150,BOISTRUDAN,,,35028,,,,,,,,,,,,,,,,,,,2009-07-10,A,,,,,68.20B,NAFRev2,N,-1.384507,47.996938,0.75,locality,Le Bas Conay 35150 Boistrudan,35028_B006,G,LE BAS CONAY,
353554546,00054,35355454600054,O,1995-10-15,,,,,false,4,,,,,L'ETRANGERE,35150,BOISTRUDAN,,,35028,,,,,,,,,,,,,,,,,,,2001-02-05,F,,,,,01.4D,NAF1993,N,-1.415648,47.9782,0.4,locality,La Hte Trancouilliere 35150 Boistrudan,35028_B745,G,LA HTE TRANCOUILLIERE,
378729552,00018,37872955200018,O,1990-07-19,NN,,,2008-01-04T21:20:08,true,3,,,,,LE HAUT CONNAY,35150,BOISTRUDAN,,,35028,,,,,,,,,,,,,,,,,,,2008-01-01,A,,,,,01.41Z,NAFRev2,N,-1.384047,47.993834,0.82,locality,Le Haut Conay 35150 Boistrudan,35028_B323,G,LE HAUT CONAY,
379198799,00015,37919879900015,O,,NN,,,,true,1,,,,,LE PLACIS,35150,BOISTRUDAN,,,35028,,,,,,,,,,,,,,,,,,,1990-12-31,F,,,,,49.05,NAP,N,-1.427134,47.97535,0.46,locality,Le Patis des Brosses 35150 Boistrudan,35028_B446,G,LE PATIS DES BROSSES,
380179226,00010,38017922600010,O,1990-10-01,NN,,,2022-06-21T04:00:41,true,4,,,,,LA BARRE,35150,BOISTRUDAN,,,35028,,,,,,,,,,,,,,,,,,,2021-12-31,F,,,,,01.41Z,NAFRev2,N,-1.388705,47.984452,0.91,street,Lieu Dit la Barre 35150 Boistrudan,35028_fptton,G,LIEU DIT LA BARRE,
380179226,00028,38017922600028,O,2012-10-23,,,,2022-04-27T12:46:50,false,2,,,,,LA BARRE,35150,BOISTRUDAN,,,35028,,,,,,,,,,,,,,,,,,,2021-12-31,F,,,,,35.11Z,NAFRev2,N,-1.388705,47.984452,0.91,street,Lieu Dit la Barre 35150 Boistrudan,35028_fptton,G,LIEU DIT LA BARRE,
380352732,00016,38035273200016,O,1991-01-01,,,,,false,4,,,,,MONTALERON,35150,BOISTRUDAN,,,35028,,,,,,,,,,,,,,,,,,,1997-11-01,F,,,,,01.3Z,NAF1993,N,,,0,,,,,,
383024932,00014,38302493200014,O,1991-09-06,NN,,,2008-01-04T22:18:34,true,3,,,,,LE BAS CONAY,35150,BOISTRUDAN,,,35028,,,,,,,,,,,,,,,,,,,2008-01-01,A,,,,,68.20B,NAFRev2,N,-1.384507,47.996938,0.94,locality,Le Bas Conay 35150 Boistrudan,35028_B006,G,LE BAS CONAY,
384348488,00014,38434848800014,O,1981-09-29,NN,,,2022-03-02T11:37:29,true,4,,,,,LA HAUTE NOUVELLE,35150,BOISTRUDAN,,,35028,,,,,,,,,,,,,,,,,,,2021-09-29,F,,,,,01.50Z,NAFRev2,N,-1.415283,47.974246,0.5,locality,La Haute Folie 35150 Boistrudan,35028_B328,G,LA HAUTE FOLIE,
384572103,00016,38457210300016,O,,,,,,true,1,,,,,BOURG,35150,BOISTRUDAN,,,35028,,,,,,,,,,,,,,,,,,,1997-11-30,F,,,,,55.4B,NAF1993,N,-1.402871,47.969915,0.43,street,Impasse du Fournil 35150 Boistrudan,35028_0053,G,IMPASSE DU FOURNIL,
387627334,00015,38762733400015,O,1992-05-01,01,2020,,2022-08-29T09:12:31,true,5,,,,,LA LINELIERE,35150,BOISTRUDAN,,,35028,,,,,,,,,,,,,,,,,,,2012-12-31,A,,,,,01.46Z,NAFRev2,O,-1.415648,47.9782,0.51,locality,La Hte Trancouilliere 35150 Boistrudan,35028_B745,G,LA HTE TRANCOUILLIERE,
390712917,00025,39071291700025,O,2016-04-01,NN,,,2018-09-29T12:18:20,true,1,,,,,LA MAUDAYAIS,35150,BOISTRUDAN,,,35028,,,,,,,,,,,,,,,,,,,2016-04-01,A,,,,,01.50Z,NAFRev2,N,-1.385423,47.979495,0.72,locality,La Touche Maudayaie 35150 Boistrudan,35028_B724,G,LA TOUCHE MAUDAYAIE,
390725752,00013,39072575200013,O,1993-04-01,NN,,,2008-01-04T23:43:41,true,3,,,,,LE HAUT BOIS CHARDRON,35150,BOISTRUDAN,,,35028,,,,,,,,,,,,,,,,,,,2008-01-01,A,,,,,01.42Z,NAFRev2,N,-1.400998,47.971696,0.94,locality,Le Haut Bois Chardron 35150 Boistrudan,35028_B322,G,LE HAUT BOIS CHARDRON,
392968517,00012,39296851700012,O,1993-08-31,NN,,3832ZA,2022-09-16T08:41:42,true,6,,,,,LES HAYEES,35150,BOISTRUDAN,,,35028,,,,,,,,,,,,,,,,,,,2021-12-31,F,,,,JEAN MICHEL BARTOS,38.32Z,NAFRev2,N,,,0,,,,,,
393227509,00089,39322750900089,O,2021-01-05,,,2341ZZ,2021-02-23T11:18:59,true,1,,,,,LD LE PLACIS,35150,BOISTRUDAN,,,35028,,,,,,,,,,,,,,,,,,,2021-01-05,A,,,,,23.41Z,NAFRev2,N,-1.427134,47.97535,0.46,locality,Le Patis des Brosses 35150 Boistrudan,35028_B446,G,LE PATIS DES BROSSES,
393998059,00017,39399805900017,O,1994-02-01,NN,,,2008-11-08T00:59:13,true,4,,1,,RUE,FRANCOIS-MARIE LE ROUX,35150,BOISTRUDAN,,,35028,,,,,,,,,,,,,,,,,,,2006-08-31,F,,,,,50.2Z,NAFRev1,O,-1.401858,47.970404,0.86,housenumber,1 Rue Francois Marie Leroux 35150 Boistrudan,35028_jk7rqg_00001,G,1 RUE FRANCOIS MARIE LEROUX,
394216147,00014,39421614700014,O,1993-01-01,NN,,,2008-01-04T18:02:15,true,3,,,,,LA HAYE,35150,BOISTRUDAN,,,35028,,,,,,,,,,,,,,,,,,,2008-01-01,A,,,,,01.41Z,NAFRev2,N,-1.415283,47.974246,0.57,locality,La Haute Folie 35150 Boistrudan,35028_B328,G,LA HAUTE FOLIE,
394450761,00017,39445076100017,O,1994-03-01,NN,,,2008-01-04T18:06:55,true,3,,,,,LA CHAUFFETIERE,35150,BOISTRUDAN,,,35028,,,,,,,,,,,,,,,,,,,2008-01-01,A,,,,,01.47Z,NAFRev2,N,-1.415085,47.963823,0.37,locality,La Rivière aux Meuniers 35150 Boistrudan,35028_B705,G,LA RIVIERE AUX MEUNIERS,
397789702,00016,39778970200016,O,1994-07-01,NN,,,2021-01-28T03:53:12,true,3,,,,,LAUNAY,35150,BOISTRUDAN,,,35028,,,,,,,,,,,,,,,,,,,2008-01-01,A,,,,,01.42Z,NAFRev2,N,-1.384047,47.993834,0.38,locality,Le Haut Conay 35150 Boistrudan,35028_B323,G,LE HAUT CONAY,
398052118,00013,39805211800013,O,1994-09-01,NN,,,2006-12-15T00:55:01,false,4,,,,,BAS CONAY,35150,BOISTRUDAN,,,35028,,,,,,,,,,,,,,,,,,,1995-12-25,F,,,,,22.1E,NAF1993,O,-1.384507,47.996938,0.93,locality,Le Bas Conay 35150 Boistrudan,35028_B006,G,LE BAS CONAY,
400925061,00030,40092506100030,O,1996-08-01,NN,,,,false,3,,,,,LA BASSE TRANCOUILLERE,35150,BOISTRUDAN,,,35028,,,,,,,,,,,,,,,,,,,1998-10-01,F,,,,,85.1G,NAF1993,,-1.41526,47.97658,0.94,locality,La Basse Trancouillère 35150 Boistrudan,35028_B009,G,LA BASSE TRANCOUILLERE,
401110598,00026,40111059800026,O,2017-09-01,,,,2021-07-14T08:42:41,true,2,,8,,,LANNERIE,35150,BOISTRUDAN,,,35028,,,,,,,,,,,,,,,,,,,2021-07-08,F,,,,,74.90B,NAFRev2,N,-1.386427,47.961049,0.93,housenumber,8 Lieu Dit Lannerie 35150 Boistrudan,35028_70unwz_00008,G,8 LIEU DIT LANNERIE,
402796825,00014,40279682500014,O,,,,,,true,1,,,,,LA MAUDAYAIE,35150,BOISTRUDAN,,,35028,,,,,,,,,,,,,,,,,,,1997-05-31,F,,,,,01.2E,NAF1993,N,-1.385423,47.979495,0.85,locality,La Touche Maudayaie 35150 Boistrudan,35028_B724,G,LA TOUCHE MAUDAYAIE,
403145089,00013,40314508900013,O,1900-01-01,NN,,,2011-05-03T00:24:12,false,2,,3,,RUE,DES FONTAINES,35150,BOISTRUDAN,,,35028,,,,,,,,,,,,,,,,,,,1996-05-21,F,,,,,,,,-1.403192,47.969072,0.94,housenumber,3 Rue des Fontaines 35150 Boistrudan,35028_0049_00003,G,3 RUE DES FONTAINES,
403908122,00019,40390812200019,O,1996-02-03,NN,,,,true,4,,,,,LE CHATEL,35150,BOISTRUDAN,,,35028,,,,,,,,,,,,,,,,,,,1999-03-31,F,,,,,01.4D,NAF1993,N,-1.401319,47.970946,0.46,locality,Le Bois Chardron 35150 Boistrudan,35028_B018,G,LE BOIS CHARDRON,
407803170,00015,40780317000015,O,,NN,,,,true,1,,,,,LA TOUCHE MAUDAYAIS,35150,BOISTRUDAN,,,35028,,,,,,,,,,,,,,,,,,,1995-03-31,F,,,,,01.3Z,NAF1993,N,-1.385423,47.979495,0.85,locality,La Touche Maudayaie 35150 Boistrudan,35028_B724,G,LA TOUCHE MAUDAYAIE,
407803188,00017,40780318800017,O,1982-12-31,NN,,,,true,4,,,,,LE GRAND FLEURET,35150,BOISTRUDAN,,,35028,,,,,,,,,,,,,,,,,,,2002-12-31,F,,,,,70.2B,NAF1993,N,-1.40732,47.961233,0.84,locality,Le Grand Fleure 35150 Boistrudan,35028_B263,G,LE GRAND FLEURE,
407803196,00010,40780319600010,O,1982-12-31,NN,,,2008-06-27T06:27:06,true,3,,,,,LE HAUT FREU,35150,BOISTRUDAN,,,35028,,,,,,,,,,,,,,,,,,,2007-10-20,F,,,,,01.1A,NAFRev1,N,-1.405813,47.974959,0.94,locality,Le Haut Freu 35150 Boistrudan,35028_B326,G,LE HAUT FREU,
407803204,00012,40780320400012,O,1982-12-31,NN,,,,true,1,,,,,CUSSONNIERE,35150,BOISTRUDAN,,,35028,,,,,,,,,,,,,,,,,,,1998-12-31,F,,,,,01.3Z,NAF1993,N,-1.415085,47.963823,0.39,locality,La Rivière aux Meuniers 35150 Boistrudan,35028_B705,G,LA RIVIERE AUX MEUNIERS,
407803212,00015,40780321200015,O,1982-12-31,NN,,,2006-10-28T03:30:17,true,3,,,,,LA MOTTE,35150,BOISTRUDAN,,,35028,,,,,,,,,,,,,,,,,,,2004-12-31,F,,,,,01.3Z,NAFRev1,N,-1.40041,47.968636,0.51,street,Rue de la Moinerie 35150 Boistrudan,35028_0095,G,RUE DE LA MOINERIE,
407803220,00018,40780322000018,O,1982-12-31,NN,,,2010-04-26T17:26:01,true,4,,,,,BOIS CHARDON,35150,BOISTRUDAN,,,35028,,,,,,,,,,,,,,,,,,,2008-03-01,A,,,,,68.20B,NAFRev2,N,-1.401319,47.970946,0.79,locality,Le Bois Chardron 35150 Boistrudan,35028_B018,G,LE BOIS CHARDRON,
407803238,00010,40780323800010,O,1985-12-31,NN,,,,true,1,,,,,HAUTE TRANCOUILLERE,35150,BOISTRUDAN,,,35028,,,,,,,,,,,,,,,,,,,1998-12-31,F,,,,,01.3Z,NAF1993,N,-1.41526,47.97658,0.7,locality,La Basse Trancouillère 35150 Boistrudan,35028_B009,G,LA BASSE TRANCOUILLERE,
407803246,00013,40780324600013,O,1989-12-31,NN,,,2008-01-04T21:00:02,true,3,,,,,LANDES DE TAILLE,35150,BOISTRUDAN,,,35028,,,,,,,,,,,,,,,,,,,2008-01-01,A,,,,,01.42Z,NAFRev2,N,-1.373808,47.981859,0.77,locality,La Lande de Taille 35150 Boistrudan,35028_B382,G,LA LANDE DE TAILLE,
407803253,00019,40780325300019,O,1990-12-31,NN,,,,true,4,,,,,LA CHOUANIERE,35150,BOISTRUDAN,,,35028,,,,,,,,,,,,,,,,,,,2003-09-30,F,,,,,01.1A,NAFRev1,N,-1.415085,47.963823,0.47,locality,La Rivière aux Meuniers 35150 Boistrudan,35028_B705,G,LA RIVIERE AUX MEUNIERS,
407803279,00014,40780327900014,O,1994-11-24,NN,,,2008-01-04T21:00:02,true,3,,,,,LE HAUT LOURME,35150,BOISTRUDAN,,,35028,,,,,,,,,,,,,,,,,,,2008-01-01,A,,,,,01.11Z,NAFRev2,N,-1.395859,47.958703,0.45,locality,Au Bas Lourme 35150 Boistrudan,35028_B007,G,AU BAS LOURME,
408588382,00023,40858838200023,O,2008-05-27,,,,2010-12-24T12:01:16,false,2,,,,,LE CHATEL,35150,BOISTRUDAN,,,35028,,,,,,,,,,,,,,,,,,,2009-01-01,F,,,,,33.12Z,NAFRev2,N,-1.401319,47.970946,0.46,locality,Le Bois Chardron 35150 Boistrudan,35028_B018,G,LE BOIS CHARDRON,
410844708,00017,41084470800017,O,1982-12-31,NN,,,2006-12-13T06:58:04,true,3,,,,,LES VERGERS,35150,BOISTRUDAN,,,35028,,,,,,,,,,,,,,,,,,,2006-10-31,F,,,,,01.3Z,NAFRev1,N,2.1184602,48.8530217,0.91,poi.orchard,Les Vergers Louveciennes,https://osm.org/way/38068605,G,,
410844716,00010,41084471600010,O,1995-04-01,NN,,,,true,1,,,,,LA TOUCHE MAUDAYAIS,35150,BOISTRUDAN,,,35028,,,,,,,,,,,,,,,,,,,2002-12-31,F,,,,,01.3Z,NAF1993,N,-1.385423,47.979495,0.85,locality,La Touche Maudayaie 35150 Boistrudan,35028_B724,G,LA TOUCHE MAUDAYAIE,
412550865,00015,41255086500015,O,1997-06-01,NN,,,,true,4,,,,,LA VIEILLE COUR,35150,BOISTRUDAN,,,35028,,,,,,,,,,,,,,,,,,,2002-11-18,F,,,,,01.2E,NAF1993,N,-1.383997,47.991873,0.94,locality,La Vieille Cour 35150 Boistrudan,35028_B737,G,LA VIEILLE COUR,
412800872,00019,41280087200019,O,1997-06-01,02,2020,,2022-08-29T09:29:25,true,4,,,,,LA MAUDAYAIS,35150,BOISTRUDAN,,,35028,,,,,,,,,,,,,,,,,,,2012-12-31,A,,,,,01.46Z,NAFRev2,O,-1.385423,47.979495,0.72,locality,La Touche Maudayaie 35150 Boistrudan,35028_B724,G,LA TOUCHE MAUDAYAIE,
414018655,00012,41401865500012,O,1997-01-01,NN,,,2012-09-04T14:36:41,true,4,,,,,LE MONTBEIL,35150,BOISTRUDAN,,,35028,,,,,,,,,,,,,,,,,,,2012-07-31,F,,,,,01.41Z,NAFRev2,N,-1.380422,47.973878,0.55,locality,La Haute Monbeil 35150 Boistrudan,35028_B330,G,LA HAUTE MONBEIL,
414019091,00019,41401909100019,O,1997-09-01,,,,,true,1,,,,,LE GRAND FLEURE,35150,BOISTRUDAN,,,35028,,,,,,,,,,,,,,,,,,,1998-02-28,F,,,,,01.2A,NAF1993,N,-1.40732,47.961233,0.94,locality,Le Grand Fleure 35150 Boistrudan,35028_B263,G,LE GRAND FLEURE,
414772665,00017,41477266500017,O,1997-11-03,,,,2006-01-19T09:52:46,false,3,,4,,LOT,,35150,BOISTRUDAN,,,35028,,,,,,,,,,,,,,,,,,,1999-01-04,F,,,,,85.1G,NAF1993,N,-1.385453,47.960842,0.44,housenumber,4 Lieu Dit Lannerie 35150 Boistrudan,35028_70unwz_00004,G,4 LIEU DIT LANNERIE,
418053740,00019,41805374000019,O,1998-03-01,NN,,,2008-01-04T23:14:48,true,4,LE GRAND FLEURE,,,,,35150,BOISTRUDAN,,,35028,,,,,,,,,,,,,,,,,,,2008-01-01,A,,,,,68.20B,NAFRev2,N,-1.40732,47.961233,0.94,locality,Le Grand Fleure 35150 Boistrudan,35028_B263,D,LE GRAND FLEURE,
418411633,00013,41841163300013,O,1998-04-01,NN,,,2011-03-31T11:48:09,true,4,,4,,RUE,FRANCOIS MARIE LEROUX,35150,BOISTRUDAN,,,35028,,,,,,,,,,,,,,,,,,,2011-03-30,F,,,,,10.71C,NAFRev2,N,-1.401872,47.970125,0.95,housenumber,4 Rue Francois Marie Leroux 35150 Boistrudan,35028_jk7rqg_00004,G,4 RUE FRANCOIS MARIE LEROUX,
421906033,00012,42190603300012,O,1999-01-01,01,2020,,2022-08-29T09:03:03,true,3,,,,,LA HAUTE TRANCOUILLERE,35150,BOISTRUDAN,,,35028,,,,,,,,,,,,,,,,,,,2008-01-01,A,,,,,01.41Z,NAFRev2,N,-1.41526,47.97658,0.7,locality,La Basse Trancouillère 35150 Boistrudan,35028_B009,G,LA BASSE TRANCOUILLERE,
422137158,00016,42213715800016,O,1999-04-02,NN,,,2019-06-24T13:06:34,true,4,,14,,LOT,DE BELLEVUE,35150,BOISTRUDAN,,,35028,,,,,,,,,,,,,,,,,,,2008-01-01,A,,,,,81.22Z,NAFRev2,O,-1.403539,47.971623,0.7,housenumber,14 Impasse de Bellevue 35150 Boistrudan,35028_0820_00014,G,14 IMPASSE DE BELLEVUE,
422532143,00019,42253214300019,O,1999-01-01,NN,,,2006-10-30T23:54:52,true,3,,,,,CUSSONNIERE,35150,BOISTRUDAN,,,35028,,,,,,,,,,,,,,,,,,,2005-10-31,F,,,,,01.3Z,NAFRev1,N,-1.415085,47.963823,0.39,locality,La Rivière aux Meuniers 35150 Boistrudan,35028_B705,G,LA RIVIERE AUX MEUNIERS,
423835370,00010,42383537000010,O,1999-07-26,NN,,,,false,4,,,,,CHATEL,35150,BOISTRUDAN,,,35028,,,,,,,,,,,,,,,,,,,2001-06-30,F,,,,,74.1G,NAF1993,N,-1.400998,47.971696,0.37,locality,Le Haut Bois Chardron 35150 Boistrudan,35028_B322,G,LE HAUT BOIS CHARDRON,