siren,nic,siret,statutDiffusionEtablissement,dateCreationEtablissement,trancheEffectifsEtablissement,anneeEffectifsEtablissement,activitePrincipaleRegistreMetiersEtablissement,dateDernierTraitementEtablissement,etablissementSiege,nombrePeriodesEtablissement,complementAdresseEtablissement,numeroVoieEtablissement,indiceRepetitionEtablissement,typeVoieEtablissement,libelleVoieEtablissement,codePostalEtablissement,libelleCommuneEtablissement,libelleCommuneEtrangerEtablissement,distributionSpecialeEtablissement,codeCommuneEtablissement,codeCedexEtablissement,libelleCedexEtablissement,codePaysEtrangerEtablissement,libellePaysEtrangerEtablissement,complementAdresse2Etablissement,numeroVoie2Etablissement,indiceRepetition2Etablissement,typeVoie2Etablissement,libelleVoie2Etablissement,codePostal2Etablissement,libelleCommune2Etablissement,libelleCommuneEtranger2Etablissement,distributionSpeciale2Etablissement,codeCommune2Etablissement,codeCedex2Etablissement,libelleCedex2Etablissement,codePaysEtranger2Etablissement,libellePaysEtranger2Etablissement,dateDebut,etatAdministratifEtablissement,enseigne1Etablissement,enseigne2Etablissement,enseigne3Etablissement,denominationUsuelleEtablissement,activitePrincipaleEtablissement,nomenclatureActivitePrincipaleEtablissement,caractereEmployeurEtablissement,longitude,latitude,geo_score,geo_type,geo_adresse,geo_id,geo_ligne,geo_l4,geo_l5
213701477,00019,21370147700019,O,1983-03-01,02,2020,,2022-08-29T09:07:01,true,4,,16,,RUE,PRINCIPALE,37800,MARCILLY-SUR-VIENNE,,,37147,,,,,,,,,,,,,,,,,,,2008-01-01,A,MAIRIE,,,,84.11Z,NAFRev2,O,0.540533,47.044171,0.95,housenumber,16 Rue Principale 37800 Marcilly-sur-Vienne,37147_0058_00016,G,16 RUE PRINCIPALE,
213701477,00027,21370147700027,O,1983-03-16,NN,,,2019-11-14T14:00:35,false,3,,,,,,37800,MARCILLY-SUR-VIENNE,,,37147,,,,,,,,,,,,,,,,,,,2008-01-01,A,CANTINE SCOLAIRE PUBLIQUE,,,,56.29B,NAFRev2,N,,,0,,,,,,
213701477,00035,21370147700035,O,1983-12-21,02,2020,,2022-08-29T09:07:01,false,3,,27,,RUE,PRINCIPALE,37800,MARCILLY-SUR-VIENNE,,,37147,,,,,,,,,,,,,,,,,,,2008-01-01,A,ECOLE PRIMAIRE PUBLIQUE,,,,85.20Z,NAFRev2,N,0.539886,47.046175,0.95,housenumber,27 Rue Principale 37800 Marcilly-sur-Vienne,37147_0058_00027,G,27 RUE PRINCIPALE,
213701477,00043,21370147700043,O,1993-01-01,NN,,,2019-11-14T14:00:35,false,3,MAIRIE,16,,RUE,PRINCIPALE,37800,MARCILLY-SUR-VIENNE,,,37147,,,,,,,,,,,,,,,,,,,2008-01-01,A,SERVICE D'ASSAINISSEMENT,,,,37.00Z,NAFRev2,N,0.540533,47.044171,0.95,housenumber,16 Rue Principale 37800 Marcilly-sur-Vienne,37147_0058_00016,G,16 RUE PRINCIPALE,
243700127,00026,24370012700026,O,,NN,,,2019-11-14T14:00:35,true,1,,,,,,37800,MARCILLY-SUR-VIENNE,,,37147,,,,,,,,,,,,,,,,,,,1994-12-30,F,,,,,75.1A,NAF1993,N,,,0,,,,,,
253753016,00018,25375301600018,O,1998-07-29,NN,,,2019-11-14T14:00:35,false,4,MAIRIE,16,,RUE,PRINCIPALE,37800,MARCILLY-SUR-VIENNE,,,37147,,,,,,,,,,,,,,,,,,,2000-09-01,F,,,,,75.1C,NAF1993,N,0.540533,47.044171,0.95,housenumber,16 Rue Principale 37800 Marcilly-sur-Vienne,37147_0058_00016,G,16 RUE PRINCIPALE,
263703654,00016,26370365400016,O,1985-12-17,NN,,,2019-11-14T14:00:35,true,4,MAIRIE,16,,RUE,PRINCIPALE,37800,MARCILLY-SUR-VIENNE,,,37147,,,,,,,,,,,,,,,,,,,2017-12-31,F,CCAS,,,,88.99B,NAFRev2,N,0.540533,47.044171,0.95,housenumber,16 Rue Principale 37800 Marcilly-sur-Vienne,37147_0058_00016,G,16 RUE PRINCIPALE,
263703662,00019,26370366200019,O,1985-12-17,NN,,,2019-11-14T14:00:35,true,3,MAIRIE,16,,RUE,PRINCIPALE,37800,MARCILLY-SUR-VIENNE,,,37147,,,,,,,,,,,,,,,,,,,2008-01-01,A,CDE,,,,88.99B,NAFRev2,N,0.540533,47.044171,0.95,housenumber,16 Rue Principale 37800 Marcilly-sur-Vienne,37147_0058_00016,G,16 RUE PRINCIPALE,
293701199,00011,29370119900011,O,1987-09-01,NN,,,2022-06-14T08:55:42,true,3,MAIRIE,16,,RUE,PRINCIPALE,37800,MARCILLY-SUR-VIENNE,,,37147,,,,,,,,,,,,,,,,,,,2008-01-01,A,,,,,42.99Z,NAFRev2,N,0.540533,47.044171,0.95,housenumber,16 Rue Principale 37800 Marcilly-sur-Vienne,37147_0058_00016,G,16 RUE PRINCIPALE,
300416138,00018,30041613800018,O,,NN,,,2019-11-14T14:00:35,true,1,,,,,,37800,MARCILLY-SUR-VIENNE,,,37147,,,,,,,,,,,,,,,,,,,,F,,,,,55.60,NAP,N,,,0,,,,,,
304698533,00011,30469853300011,O,,,,,2019-11-14T14:00:35,true,1,,,,,BOURG,37800,MARCILLY-SUR-VIENNE,,,37147,,,,,,,,,,,,,,,,,,,1984-12-25,F,,,,,67.01,NAP,N,0.536987,47.064177,0.43,street,Les Bouctonnieres 37800 Marcilly-sur-Vienne,37147_oau9ct,G,LES BOUCTONNIERES,
305119372,00046,30511937200046,O,1980-01-01,NN,,,2019-11-14T14:00:35,true,5,,,,LD,LES VARENNES,37800,MARCILLY-SUR-VIENNE,,,37147,,,,,,,,,,,,,,,,,,,2013-12-31,F,,,,,08.12Z,NAFRev2,O,0.539236,47.05871,0.94,street,Les Varennes 37800 Marcilly-sur-Vienne,37147_p7b5y5,G,LES VARENNES,
306509449,00014,30650944900014,O,1976-01-01,NN,,,2019-11-14T14:00:35,true,1,,17,,PL,DE L'EGLISE,37800,MARCILLY-SUR-VIENNE,,,37147,,,,,,,,,,,,,,,,,,,1999-03-31,F,,,,,93.0D,NAF1993,N,0.54036,47.042475,0.84,housenumber,17 Place de l’Eglise 37800 Marcilly-sur-Vienne,37147_0029_00017,G,17 PLACE DE L EGLISE,
307662403,00012,30766240300012,O,1900-01-01,NN,,,2019-11-14T14:00:35,true,3,,,,,FERME DE LA MOTTE,37800,MARCILLY-SUR-VIENNE,,,37147,,,,,,,,,,,,,,,,,,,2008-01-01,A,,,,,86.90D,NAFRev2,N,0.540929,47.050222,0.71,street,Rue de la Motte 37800 Marcilly-sur-Vienne,37147_0050,G,RUE DE LA MOTTE,
309401248,00013,30940124800013,O,,,,,2019-11-14T14:00:35,true,1,,,,,LE BOURG,37800,MARCILLY-SUR-VIENNE,,,37147,,,,,,,,,,,,,,,,,,,1987-06-30,F,,,,,55.73,NAP,N,0.536987,47.064177,0.42,street,Les Bouctonnieres 37800 Marcilly-sur-Vienne,37147_oau9ct,G,LES BOUCTONNIERES,
309803815,00013,30980381500013,O,1995-01-01,NN,,,2019-11-14T14:00:35,true,3,,,,,LES MARIAUX,37800,MARCILLY-SUR-VIENNE,,,37147,,,,,,,,,,,,,,,,,,,1999-12-31,F,,,,,70.2C,NAF1993,N,0.540439,47.038809,0.62,street,Les Fours a Chaux 37800 Marcilly-sur-Vienne,37147_B057,G,LES FOURS A CHAUX,
311576284,00013,31157628400013,O,,,,,2019-11-14T14:00:35,true,1,,,,,LE BOURG,37800,MARCILLY-SUR-VIENNE,,,37147,,,,,,,,,,,,,,,,,,,1988-12-31,F,,,,,55.60,NAP,N,0.536987,47.064177,0.42,street,Les Bouctonnieres 37800 Marcilly-sur-Vienne,37147_oau9ct,G,LES BOUCTONNIERES,
311905095,00031,31190509500031,O,,NN,,,2019-11-14T14:00:35,true,1,,,,,LE BOURG,37800,MARCILLY-SUR-VIENNE,,,37147,,,,,,,,,,,,,,,,,,,1987-12-30,F,,,,,15.03,NAP,N,0.536987,47.064177,0.42,street,Les Bouctonnieres 37800 Marcilly-sur-Vienne,37147_oau9ct,G,LES BOUCTONNIERES,
313020273,00014,31302027300014,O,,NN,,,2019-11-14T14:00:35,true,1,,,,,LD MARIAUX,37800,MARCILLY-SUR-VIENNE,,,37147,,,,,,,,,,,,,,,,,,,1987-04-07,F,,,,,55.71,NAP,N,0.540439,47.038809,0.57,street,Les Fours a Chaux 37800 Marcilly-sur-Vienne,37147_B057,G,LES FOURS A CHAUX,
320843477,00011,32084347700011,O,,NN,,,2019-11-14T14:00:35,true,1,,,,LD,LE BOURG,37800,MARCILLY-SUR-VIENNE,,,37147,,,,,,,,,,,,,,,,,,,1987-12-31,F,,,,,67.04,NAP,N,0.536987,47.064177,0.42,street,Les Bouctonnieres 37800 Marcilly-sur-Vienne,37147_oau9ct,G,LES BOUCTONNIERES,
324851948,00020,32485194800020,O,1982-11-15,,,,2019-11-14T14:00:35,false,3,,,,,,37800,MARCILLY-SUR-VIENNE,,,37147,,,,,,,,,,,,,,,,,,,1992-03-14,F,,,,,50.1Z,NAF1993,,,,0,,,,,,
324851948,00038,32485194800038,O,1992-03-14,NN,,,2019-11-14T14:00:35,true,5,,36,,RUE,DE LA MOTTE,37800,MARCILLY-SUR-VIENNE,,,37147,,,,,,,,,,,,,,,,,,,2014-07-31,F,,,,,45.11Z,NAFRev2,O,0.541498,47.053917,0.95,housenumber,36 Rue de la Motte 37800 Marcilly-sur-Vienne,37147_0050_00036,G,36 RUE DE LA MOTTE,
328157045,00027,32815704500027,O,,NN,,,2019-11-14T14:00:35,true,1,,,,,LE BOURG,37800,MARCILLY-SUR-VIENNE,,,37147,,,,,,,,,,,,,,,,,,,1992-09-30,F,,,,,55.3A,NAF1993,N,0.536987,47.064177,0.42,street,Les Bouctonnieres 37800 Marcilly-sur-Vienne,37147_oau9ct,G,LES BOUCTONNIERES,
328334180,00010,32833418000010,O,1900-01-01,NN,,,2019-11-14T14:00:35,false,1,,,,LD,LE BOURG,37800,MARCILLY-SUR-VIENNE,,,37147,,,,,,,,,,,,,,,,,,,1900-01-01,F,,,,,,,,0.536987,47.064177,0.42,street,Les Bouctonnieres 37800 Marcilly-sur-Vienne,37147_oau9ct,G,LES BOUCTONNIERES,
328334180,00028,32833418000028,O,2007-04-08,,,,2019-11-14T14:00:35,true,2,,6,,RUE,PRINCIPALE,37800,MARCILLY-SUR-VIENNE,,,37147,,,,,,,,,,,,,,,,,,,2007-12-14,F,,,,,52.5Z,NAFRev1,N,0.540481,47.043219,0.95,housenumber,6 Rue Principale 37800 Marcilly-sur-Vienne,37147_0058_00006,G,6 RUE PRINCIPALE,
332487453,00026,33248745300026,O,1985-06-01,NN,,,2019-11-14T14:00:35,true,4,,,,LD,LES BOUCTONNIERES,37800,MARCILLY-SUR-VIENNE,,,37147,,,,,,,,,,,,,,,,,,,2003-03-31,F,,,,,52.6D,NAFRev1,O,0.536987,47.064177,0.94,street,Les Bouctonnieres 37800 Marcilly-sur-Vienne,37147_oau9ct,G,LES BOUCTONNIERES,
340791326,00010,34079132600010,O,1987-04-06,NN,,,2019-11-14T14:00:35,false,3,,11,,RUE,DU MOULIN,37800,MARCILLY-SUR-VIENNE,,,37147,,,,,,,,,,,,,,,,,,,2006-07-31,F,,,,,45.3E,NAFRev1,O,0.536979,47.041509,0.95,housenumber,11 Rue du Moulin 37800 Marcilly-sur-Vienne,37147_0051_00011,G,11 RUE DU MOULIN,
342501228,00023,34250122800023,O,2000-05-09,NN,,,2019-11-14T14:00:35,true,1,,,,,LES VENAUDIERES,37800,MARCILLY-SUR-VIENNE,,,37147,,,,,,,,,,,,,,,,,,,2002-10-31,F,,,,,72.1Z,NAF1993,N,0.512848,47.038157,0.64,street,La Venaudiere 37800 Marcilly-sur-Vienne,37147_my59id,G,LA VENAUDIERE,
343337663,00011,34333766300011,O,1987-11-01,NN,,,2019-11-14T14:00:35,true,1,,,,,LA ROCHELERIE,37800,MARCILLY-SUR-VIENNE,,,37147,,,,,,,,,,,,,,,,,,,1996-04-20,F,,,,,01.1A,NAF1993,N,0.521696,47.04037,0.87,street,La Rochellerie 37800 Marcilly-sur-Vienne,37147_4jye1u,G,LA ROCHELLERIE,
343718755,00014,34371875500014,O,,NN,,,2019-11-14T14:00:35,true,1,,,,,LES BRILLONS,37800,MARCILLY-SUR-VIENNE,,,37147,,,,,,,,,,,,,,,,,,,1993-12-31,F,,,,,01.1A,NAF1993,N,0.521006,47.052879,0.94,street,Les Brillons 37800 Marcilly-sur-Vienne,37147_19fkun,G,LES BRILLONS,
347444507,00045,34744450700045,O,2012-02-06,,,9602AB,2021-02-23T11:00:20,true,1,,6,,RUE,PRINCIPALE,37800,MARCILLY-SUR-VIENNE,,,37147,,,,,,,,,,,,,,,,,,,2012-02-06,A,,,,,96.02A,NAFRev2,N,0.540481,47.043219,0.95,housenumber,6 Rue Principale 37800 Marcilly-sur-Vienne,37147_0058_00006,G,6 RUE PRINCIPALE,
348945940,00016,34894594000016,O,,NN,,,2019-11-14T14:00:35,true,1,,,,LD,LA BOULAINERIE,37800,MARCILLY-SUR-VIENNE,,,37147,,,,,,,,,,,,,,,,,,,1988-11-26,F,,,,,65.2E,NAF1993,N,0.519626,47.051857,0.94,street,La Boulainerie 37800 Marcilly-sur-Vienne,37147_xhtfa5,G,LA BOULAINERIE,
349686170,00011,34968617000011,O,1989-02-01,NN,,,2019-11-14T14:00:35,true,4,,4,,RUE,DES ECOLES,37800,MARCILLY-SUR-VIENNE,,,37147,,,,,,,,,,,,,,,,,,,2008-03-31,F,,,,,33.12Z,NAFRev2,N,0.538711,47.046534,0.94,housenumber,4 Rue des Ecoles 37800 Marcilly-sur-Vienne,37147_0027_00004,G,4 RUE DES ECOLES,
349746446,00021,34974644600021,O,2011-01-03,,,,2019-11-14T14:00:35,true,2,,15,,RUE,DU MOULIN,37800,MARCILLY-SUR-VIENNE,,,37147,,,,,,,,,,,,,,,,,,,2013-04-01,F,,,,,74.90B,NAFRev2,N,0.536211,47.040142,0.95,housenumber,15 Rue du Moulin 37800 Marcilly-sur-Vienne,37147_0051_00015,G,15 RUE DU MOULIN,
350141826,00031,35014182600031,O,2007-07-01,,,,2019-11-14T14:00:35,true,2,,,,,LE GRAND PEUIL,37800,MARCILLY-SUR-VIENNE,,,37147,,,,,,,,,,,,,,,,,,,2008-01-01,A,,,,,90.03B,NAFRev2,N,0.528585,47.045019,0.94,street,Le Grand Peuil 37800 Marcilly-sur-Vienne,37147_B065,G,LE GRAND PEUIL,
353424195,00025,35342419500025,O,1994-02-15,NN,,,2019-11-14T14:00:35,true,3,,,,,LE BOURG,37800,MARCILLY-SUR-VIENNE,,,37147,,,,,,,,,,,,,,,,,,,2008-01-01,A,,,,,47.79Z,NAFRev2,N,0.536987,47.064177,0.42,street,Les Bouctonnieres 37800 Marcilly-sur-Vienne,37147_oau9ct,G,LES BOUCTONNIERES,
356000240,04240,35600024004240,O,1991-01-01,NN,,,2019-11-14T14:00:35,false,4,,12,,RUE,PRINCIPALE,37800,MARCILLY-SUR-VIENNE,,,37147,,,,,,,,,,,,,,,,,,,2009-03-18,F,BUREAU DE POSTE,,,,53.10Z,NAFRev2,O,0.540549,47.043546,0.95,housenumber,12 Rue Principale 37800 Marcilly-sur-Vienne,37147_0058_00012,G,12 RUE PRINCIPALE,
377998356,00010,37799835600010,O,1990-04-05,NN,,,2022-03-03T13:31:53,true,5,,,,,MAIRIE,37800,MARCILLY-SUR-VIENNE,,,37147,,,,,,,,,,,,,,,,,,,2022-02-08,A,,,,,01.61Z,NAFRev2,N,3.0709671,50.6304695,0.92,poi.townhall,Hôtel de Ville Lille,https://osm.org/way/40917078,G,,
379179450,00042,37917945000042,O,2014-01-01,02,2020,,2022-08-29T09:06:14,false,2,LIEUDIT LES VARENNES,,,,,37800,MARCILLY-SUR-VIENNE,,,37147,,,,,,,,,,,,,,,,,,,2015-02-01,A,,,,SOGRACO,08.12Z,NAFRev2,O,0.539236,47.05871,0.61,street,Les Varennes 37800 Marcilly-sur-Vienne,37147_p7b5y5,D,LES VARENNES,
379931124,00018,37993112400018,O,1990-11-02,NN,,,2021-12-23T03:52:10,true,4,,,,,LE BOURG,37800,MARCILLY-SUR-VIENNE,,,37147,,,,,,,,,,,,,,,,,,,2021-09-10,F,,,,,68.20B,NAFRev2,N,0.536987,47.064177,0.42,street,Les Bouctonnieres 37800 Marcilly-sur-Vienne,37147_oau9ct,G,LES BOUCTONNIERES,
380410035,00014,38041003500014,O,1990-09-10,NN,,,2019-11-14T14:00:35,true,4,,,,,,37800,MARCILLY-SUR-VIENNE,,,37147,,,,,,,,,,,,,,,,,,,2008-01-01,A,,,,,56.29B,NAFRev2,O,,,0,,,,,,
381014505,00063,38101450500063,O,2003-07-15,01,2020,,2022-09-26T08:59:29,true,5,LES NORAIES,,,RUE,DE CAMBRAI,37800,MARCILLY-SUR-VIENNE,,,37147,,,,,,,,,,,,,,,,,,,2022-06-30,F,,,,,47.81Z,NAFRev2,O,0.537948,47.045792,0.82,street,Rue de Cambraye 37800 Marcilly-sur-Vienne,37147_0017,G,RUE DE CAMBRAYE,
388871444,00013,38887144400013,O,,NN,,,2019-11-14T14:00:35,true,1,,,,,LE BOURG,37800,MARCILLY-SUR-VIENNE,,,37147,,,,,,,,,,,,,,,,,,,1995-02-02,F,,,,,55.3A,NAF1993,N,0.536987,47.064177,0.42,street,Les Bouctonnieres 37800 Marcilly-sur-Vienne,37147_oau9ct,G,LES BOUCTONNIERES,
390531192,00024,39053119200024,O,2005-01-01,,,,2021-02-23T11:16:26,true,2,,,,LD,CAMBRAYE,37800,MARCILLY-SUR-VIENNE,,,37147,,,,,,,,,,,,,,,,,,,2008-01-01,A,,,,,01.49Z,NAFRev2,N,0.53423,47.051594,0.94,street,Cambraye 37800 Marcilly-sur-Vienne,37147_6dku89,G,CAMBRAYE,
398907246,00027,39890724600027,O,1995-01-02,NN,,,2019-11-14T14:00:35,false,5,,,,LD,LA PLAINE DES MARIAUX,37800,MARCILLY-SUR-VIENNE,,,37147,,,,,,,,,,,,,,,,,,,2004-11-01,F,,,,,60.2M,NAFRev1,N,,,0,,,,,,
399220557,00033,39922055700033,O,2012-03-24,,,,2019-11-14T14:00:35,true,1,BEAUVOIS,,,,,37800,MARCILLY-SUR-VIENNE,,,37147,,,,,,,,,,,,,,,,,,,2012-03-24,A,,,,,68.20B,NAFRev2,N,0.514019,47.029537,0.94,street,Beauvois 37800 Marcilly-sur-Vienne,37147_huj4ny,D,BEAUVOIS,
400384442,00010,40038444200010,O,1995-02-03,NN,,,2019-11-14T14:00:35,true,4,,,,,LE BOURG,37800,MARCILLY-SUR-VIENNE,,,37147,,,,,,,,,,,,,,,,,,,1999-06-29,F,,,,,55.3A,NAF1993,N,0.536987,47.064177,0.42,street,Les Bouctonnieres 37800 Marcilly-sur-Vienne,37147_oau9ct,G,LES BOUCTONNIERES,
402333652,00012,40233365200012,O,1995-01-01,NN,,,2019-11-14T14:00:35,true,4,,,,,LES MARIAUX,37800,MARCILLY-SUR-VIENNE,,,37147,,,,,,,,,,,,,,,,,,,2015-12-31,A,,,,,68.20B,NAFRev2,N,0.540439,47.038809,0.62,street,Les Fours a Chaux 37800 Marcilly-sur-Vienne,37147_B057,G,LES FOURS A CHAUX,
402497622,00017,40249762200017,O,1995-10-01,00,2020,,2022-08-29T09:23:10,true,3,LES MARIAUX,,,,,37800,MARCILLY-SUR-VIENNE,,,37147,,,,,,,,,,,,,,,,,,,2008-01-01,A,,,,,01.50Z,NAFRev2,N,0.540439,47.038809,0.62,street,Les Fours a Chaux 37800 Marcilly-sur-Vienne,37147_B057,D,LES FOURS A CHAUX,
402870836,00010,40287083600010,O,1995-10-01,NN,,,2019-11-14T14:00:35,true,3,,,,,LES MARIAUX,37800,MARCILLY-SUR-VIENNE,,,37147,,,,,,,,,,,,,,,,,,,2008-01-01,A,,,,,68.20B,NAFRev2,N,0.540439,47.038809,0.62,street,Les Fours a Chaux 37800 Marcilly-sur-Vienne,37147_B057,G,LES FOURS A CHAUX,
410905863,00016,41090586300016,O,1989-06-24,NN,,,2022-10-08T04:10:00,true,3,,,,,LES BESNAUX,37800,MARCILLY-SUR-VIENNE,,,37147,,,,,,,,,,,,,,,,,,,2008-01-01,A,,,,,01.50Z,NAFRev2,N,0.525806,47.043204,0.94,street,Les Besnaux 37800 Marcilly-sur-Vienne,37147_tnxmud,G,LES BESNAUX,
410906226,00015,41090622600015,O,1997-01-01,NN,,,2019-11-14T14:00:35,true,4,,6,,RUE,DU MOULIN,37800,MARCILLY-SUR-VIENNE,,,37147,,,,,,,,,,,,,,,,,,,2003-02-25,F,,,,,01.3Z,NAFRev1,N,0.536924,47.041624,0.95,housenumber,6 Rue du Moulin 37800 Marcilly-sur-Vienne,37147_0051_00006,G,6 RUE DU MOULIN,
413561697,00017,41356169700017,O,1997-06-01,NN,,,2019-11-14T14:00:35,true,4,,,,,LE PRIEURE,37800,MARCILLY-SUR-VIENNE,,,37147,,,,,,,,,,,,,,,,,,,2013-06-30,F,,,,,01.11Z,NAFRev2,N,0.540179,47.041107,0.68,street,Rue du Prieuré 37800 Marcilly-sur-Vienne,37147_0057,G,RUE DU PRIEURE,
413743287,00018,41374328700018,O,1997-09-10,NN,,,2019-11-14T14:00:35,false,4,,,,,LES PERRIERES,37800,MARCILLY-SUR-VIENNE,,,37147,,,,,,,,,,,,,,,,,,,2003-12-31,F,,,,,45.2V,NAFRev1,O,0.536987,47.064177,0.51,street,Les Bouctonnieres 37800 Marcilly-sur-Vienne,37147_oau9ct,G,LES BOUCTONNIERES,
413808205,00012,41380820500012,O,1997-09-10,NN,,,2019-11-14T14:00:35,false,4,,,,,LES PERRIERES,37800,MARCILLY-SUR-VIENNE,,,37147,,,,,,,,,,,,,,,,,,,2003-11-10,F,GERANT DE LA SARL OUEST RENOV 2000,,,,74.1J,NAFRev1,N,0.536987,47.064177,0.51,street,Les Bouctonnieres 37800 Marcilly-sur-Vienne,37147_oau9ct,G,LES BOUCTONNIERES,
417642451,00013,41764245100013,O,1998-02-10,NN,,,2019-11-14T14:00:35,false,4,,2,,,LA CAVE,37800,MARCILLY-SUR-VIENNE,,,37147,,,,,,,,,,,,,,,,,,,2010-01-01,F,,,,,43.21A,NAFRev2,O,0.541036,47.053367,0.84,housenumber,2 Rue de la Cave 37800 Marcilly-sur-Vienne,37147_0018_00002,G,2 RUE DE LA CAVE,
417642451,00021,41764245100021,O,2010-01-01,NN,,4321AB,2019-11-14T14:00:35,false,2,,6,,,LA CAVE,37800,MARCILLY-SUR-VIENNE,,,37147,,,,,,,,,,,,,,,,,,,2017-12-10,F,,,,,43.21A,NAFRev2,O,0.540519,47.053268,0.84,housenumber,6 Rue de la Cave 37800 Marcilly-sur-Vienne,37147_0018_00006,G,6 RUE DE LA CAVE,
417659869,00016,41765986900016,O,1998-02-01,01,2020,,2022-08-29T09:31:56,true,4,,,,,LES MARIAUX,37800,MARCILLY-SUR-VIENNE,,,37147,,,,,,,,,,,,,,,,,,,2008-01-01,A,,,,,01.45Z,NAFRev2,N,0.540439,47.038809,0.62,street,Les Fours a Chaux 37800 Marcilly-sur-Vienne,37147_B057,G,LES FOURS A CHAUX,
420159899,00012,42015989900012,O,1985-04-01,NN,,,2019-11-14T14:00:35,true,4,,,,,LE CL0S,37800,MARCILLY-SUR-VIENNE,,,37147,,,,,,,,,,,,,,,,,,,2008-12-31,F,,,,,01.50Z,NAFRev2,N,0.530057,47.058783,0.57,street,Le Clos 37800 Marcilly-sur-Vienne,37147_1nq54y,G,LE CLOS,
420159907,00013,42015990700013,O,1984-12-31,NN,,,2019-11-14T14:00:35,true,3,,,,,LA NORAIE,37800,MARCILLY-SUR-VIENNE,,,37147,,,,,,,,,,,,,,,,,,,2006-09-30,F,,,,,01.1A,NAFRev1,N,0.535286,47.045581,0.56,street,Allée des Noraies 37800 Marcilly-sur-Vienne,37147_rl8a5b,G,ALLEE DES NORAIES,
420159915,00016,42015991500016,O,1988-12-31,NN,,,2019-11-14T14:00:35,true,4,,12,,RUE,DE LA MOTTE,37800,MARCILLY-SUR-VIENNE,,,37147,,,,,,,,,,,,,,,,,,,2011-03-31,F,,,,,55.20Z,NAFRev2,N,0.540719,47.049131,0.95,housenumber,12 Rue de la Motte 37800 Marcilly-sur-Vienne,37147_0050_00012,G,12 RUE DE LA MOTTE,
420159923,00010,42015992300010,O,1986-12-31,NN,,,2019-11-14T14:00:35,true,4,,,,,LE CLOS,37800,MARCILLY-SUR-VIENNE,,,37147,,,,,,,,,,,,,,,,,,,2008-01-01,A,,,,,68.20B,NAFRev2,N,0.530057,47.058783,0.94,street,Le Clos 37800 Marcilly-sur-Vienne,37147_1nq54y,G,LE CLOS,
420159931,00013,42015993100013,O,1997-10-01,NN,,,2023-01-07T06:09:26,true,3,,24,,RUE,PRINCIPALE,37800,MARCILLY-SUR-VIENNE,,,37147,,,,,,,,,,,,,,,,,,,2008-01-01,A,,,,,01.11Z,NAFRev2,N,0.540292,47.04502,0.95,housenumber,24 Rue Principale 37800 Marcilly-sur-Vienne,37147_0058_00024,G,24 RUE PRINCIPALE,
420571325,00018,42057132500018,O,1998-09-15,01,2020,,2022-08-29T09:01:20,true,3,MAIRIE,16,,RUE,PRINCIPALE,37800,MARCILLY-SUR-VIENNE,,,37147,,,,,,,,,,,,,,,,,,,2008-01-01,A,,,,,93.12Z,NAFRev2,O,0.540533,47.044171,0.95,housenumber,16 Rue Principale 37800 Marcilly-sur-Vienne,37147_0058_00016,G,16 RUE PRINCIPALE,
420902231,00018,42090223100018,O,1982-12-31,NN,,,2019-11-14T14:00:35,true,4,,,,,LES MARIAUX,37800,MARCILLY-SUR-VIENNE,,,37147,,,,,,,,,,,,,,,,,,,2008-11-30,F,,,,,01.11Z,NAFRev2,N,0.540439,47.038809,0.62,street,Les Fours a Chaux 37800 Marcilly-sur-Vienne,37147_B057,G,LES FOURS A CHAUX,
420902249,00010,42090224900010,O,1982-12-31,NN,,,2019-11-14T14:00:35,true,4,,,,,LA BROSSE,37800,MARCILLY-SUR-VIENNE,,,37147,,,,,,,,,,,,,,,,,,,2008-03-31,F,,,,,01.11Z,NAFRev2,N,0.513466,47.032917,0.94,street,La Brosse 37800 Marcilly-sur-Vienne,37147_gpgw1r,G,LA BROSSE,
420902256,00015,42090225600015,O,1982-12-31,,,,2019-11-14T14:00:35,true,1,,,,,LA GROIE,37800,MARCILLY-SUR-VIENNE,,,37147,,,,,,,,,,,,,,,,,,,2000-12-31,F,,,,,01.1A,NAF1993,N,0.5221,47.05025,0.94,street,La Groie 37800 Marcilly-sur-Vienne,37147_ar4ybw,G,LA GROIE,
422262659,00010,42226265900010,O,1999-03-18,NN,,,2019-11-14T14:00:35,true,3,MAIRIE,16,,RUE,PRINCIPALE,37800,MARCILLY-SUR-VIENNE,,,37147,,,,,,,,,,,,,,,,,,,2008-01-01,A,,,,,85.59B,NAFRev2,N,0.540533,47.044171,0.95,housenumber,16 Rue Principale 37800 Marcilly-sur-Vienne,37147_0058_00016,G,16 RUE PRINCIPALE,
422589291,00018,42258929100018,O,1999-04-01,,,,2019-11-14T14:00:35,true,1,,17,,PL,DE L'EGLISE,37800,MARCILLY-SUR-VIENNE,,,37147,,,,,,,,,,,,,,,,,,,1999-09-30,F,,,,,93.0D,NAF1993,N,0.54036,47.042475,0.84,housenumber,17 Place de l’Eglise 37800 Marcilly-sur-Vienne,37147_0029_00017,G,17 PLACE DE L EGLISE,
423355510,00029,42335551000029,O,2013-03-01,,,,2022-04-08T04:16:15,true,2,LA RONDIERE,,,,PORT SUR VIENNE,37800,MARCILLY-SUR-VIENNE,,,37147,,,,,,,,,,,,,,,,,,,2021-06-25,F,,,,,68.20B,NAFRev2,N,0.54395,47.052115,0.86,street,Le Port de Nouatre 37800 Marcilly-sur-Vienne,37147_B106,G,LE PORT DE NOUATRE,
424820470,00013,42482047000013,O,1999-10-01,NN,,,2019-11-14T14:00:35,true,4,,17,,PL,DE L'EGLISE,37800,MARCILLY-SUR-VIENNE,,,37147,,,,,,,,,,,,,,,,,,,2002-01-22,F,,,,,52.1B,NAF1993,N,0.54036,47.042475,0.84,housenumber,17 Place de l’Eglise 37800 Marcilly-sur-Vienne,37147_0029_00017,G,17 PLACE DE L EGLISE,
430001297,00026,43000129700026,O,2003-12-09,,,,2019-11-14T14:00:35,true,3,MAIRIE,16,,RUE,PRINCIPALE,37800,MARCILLY-SUR-VIENNE,,,37147,,,,,,,,,,,,,,,,,,,2009-02-22,F,,,,,90.01Z,NAFRev2,N,0.540533,47.044171,0.95,housenumber,16 Rue Principale 37800 Marcilly-sur-Vienne,37147_0058_00016,G,16 RUE PRINCIPALE,
430882118,00010,43088211800010,O,1997-07-04,NN,,,2019-11-14T14:00:35,true,3,,5,,PL,DE L EGLISE,37800,MARCILLY-SUR-VIENNE,,,37147,,,,,,,,,,,,,,,,,,,2008-01-01,A,,,,,68.20B,NAFRev2,N,0.540168,47.042746,0.83,housenumber,5 Place de l’Eglise 37800 Marcilly-sur-Vienne,37147_0029_00005,G,5 PLACE DE L EGLISE,
432858835,00015,43285883500015,O,2000-10-03,NN,,,2019-11-14T14:00:35,false,4,,6,,RUE,DE CAMBRAYE,37800,MARCILLY-SUR-VIENNE,,,37147,,,,,,,,,,,,,,,,,,,2003-04-01,F,BOMA ENTREPRISE,,,,45.4J,NAFRev1,O,0.538625,47.04286,0.95,housenumber,6 Rue de Cambraye 37800 Marcilly-sur-Vienne,37147_0017_00006,G,6 RUE DE CAMBRAYE,
433384617,00018,43338461700018,O,2000-02-01,NN,,,2019-11-14T14:00:35,true,4,,,,,LA GROIE,37800,MARCILLY-SUR-VIENNE,,,37147,,,,,,,,,,,,,,,,,,,2014-12-31,F,,,,,01.11Z,NAFRev2,N,0.5221,47.05025,0.94,street,La Groie 37800 Marcilly-sur-Vienne,37147_ar4ybw,G,LA GROIE,
434188504,00014,43418850400014,O,2001-01-03,NN,,,2019-11-14T14:00:35,true,3,,,,,LES SAVARIS,37800,MARCILLY-SUR-VIENNE,,,37147,,,,,,,,,,,,,,,,,,,2008-01-01,A,,,,,68.20B,NAFRev2,N,0.516363,47.02771,0.94,street,Les Savaris 37800 Marcilly-sur-Vienne,37147_7s4ueg,G,LES SAVARIS,
434910378,00018,43491037800018,O,2001-04-03,NN,,,2019-11-14T14:00:35,true,3,,39,,RUE,DE LA MOTTE,37800,MARCILLY-SUR-VIENNE,,,37147,,,,,,,,,,,,,,,,,,,2003-03-31,F,,,,,,,N,0.541296,47.052669,0.95,housenumber,39 Rue de la Motte 37800 Marcilly-sur-Vienne,37147_0050_00039,G,39 RUE DE LA MOTTE,
440635472,00028,44063547200028,O,2002-08-10,NN,,,2019-11-14T14:00:35,true,4,,,,,LES MARIAUX,37800,MARCILLY-SUR-VIENNE,,,37147,,,,,,,,,,,,,,,,,,,2009-06-30,F,,,,,90.03A,NAFRev2,N,0.540439,47.038809,0.62,street,Les Fours a Chaux 37800 Marcilly-sur-Vienne,37147_B057,G,LES FOURS A CHAUX,
441017381,00035,44101738100035,O,2006-08-01,,,,2019-11-14T14:00:35,false,3,,11,,RUE,DU MOULIN,37800,MARCILLY-SUR-VIENNE,,,37147,,,,,,,,,,,,,,,,,,,2009-10-15,F,,,,,43.22A,NAFRev2,N,0.536979,47.041509,0.95,housenumber,11 Rue du Moulin 37800 Marcilly-sur-Vienne,37147_0051_00011,G,11 RUE DU MOULIN,
447718271,00011,44771827100011,O,2003-04-01,NN,,,2019-11-14T14:00:35,false,3,,,,,LES BOUCTONNIERES,37800,MARCILLY-SUR-VIENNE,,,37147,,,,,,,,,,,,,,,,,,,2005-12-01,F,,,,,52.6D,NAFRev1,O,0.536987,47.064177,0.94,street,Les Bouctonnieres 37800 Marcilly-sur-Vienne,37147_oau9ct,G,LES BOUCTONNIERES,