siren,nic,siret,statutDiffusionEtablissement,dateCreationEtablissement,trancheEffectifsEtablissement,anneeEffectifsEtablissement,activitePrincipaleRegistreMetiersEtablissement,dateDernierTraitementEtablissement,etablissementSiege,nombrePeriodesEtablissement,complementAdresseEtablissement,numeroVoieEtablissement,indiceRepetitionEtablissement,typeVoieEtablissement,libelleVoieEtablissement,codePostalEtablissement,libelleCommuneEtablissement,libelleCommuneEtrangerEtablissement,distributionSpecialeEtablissement,codeCommuneEtablissement,codeCedexEtablissement,libelleCedexEtablissement,codePaysEtrangerEtablissement,libellePaysEtrangerEtablissement,complementAdresse2Etablissement,numeroVoie2Etablissement,indiceRepetition2Etablissement,typeVoie2Etablissement,libelleVoie2Etablissement,codePostal2Etablissement,libelleCommune2Etablissement,libelleCommuneEtranger2Etablissement,distributionSpeciale2Etablissement,codeCommune2Etablissement,codeCedex2Etablissement,libelleCedex2Etablissement,codePaysEtranger2Etablissement,libellePaysEtranger2Etablissement,dateDebut,etatAdministratifEtablissement,enseigne1Etablissement,enseigne2Etablissement,enseigne3Etablissement,denominationUsuelleEtablissement,activitePrincipaleEtablissement,nomenclatureActivitePrincipaleEtablissement,caractereEmployeurEtablissement,longitude,latitude,geo_score,geo_type,geo_adresse,geo_id,geo_ligne,geo_l4,geo_l5
095840591,00010,09584059100010,O,1958-01-01,NN,,,2019-11-14T14:00:42,true,5,,,,,,51130,VILLERS-AUX-BOIS,,,51630,,,,,,,,,,,,,,,,,,,2011-12-25,F,,,,,68.20B,NAFRev2,N,,,0,,,,,,
095842167,00017,09584216700017,O,,,,,2019-11-14T14:00:42,true,1,,,,,,51130,VILLERS-AUX-BOIS,,,51630,,,,,,,,,,,,,,,,,,,1986-09-30,F,,,,,62.42,NAP,N,,,0,,,,,,
095850889,00015,09585088900015,O,,,,,2019-11-14T14:00:42,true,1,,,,,,51130,VILLERS-AUX-BOIS,,,51630,,,,,,,,,,,,,,,,,,,1992-03-01,F,,,,,20.1A,NAF1993,N,,,0,,,,,,
095950143,00032,09595014300032,O,1992-03-01,,,,2019-11-14T14:00:42,false,4,,,,RTE,DE GIONGES,51130,VILLERS-AUX-BOIS,,,51630,,,,,,,,,,,,,,,,,,,2008-01-01,F,,,,,16.10A,NAFRev2,N,3.930199,48.934811,0.4,street,Lotissement de la Noue de Givry 51130 Villers-aux-Bois,51630_03x5gi,G,LOTISSEMENT DE LA NOUE DE GIVRY,
096140215,00011,09614021500011,O,,NN,,,2019-11-14T14:00:42,true,1,,,,,,51130,VILLERS-AUX-BOIS,,,51630,,,,,,,,,,,,,,,,,,,1988-12-31,F,,,,,79.06,NAP,N,,,0,,,,,,
096240668,00010,09624066800010,O,,NN,,,2019-11-14T14:00:42,true,1,,,,,,51130,VILLERS-AUX-BOIS,,,51630,,,,,,,,,,,,,,,,,,,1995-09-30,F,,,,,55.4A,NAF1993,N,,,0,,,,,,
096341284,00014,09634128400014,O,,NN,,,2019-11-14T14:00:42,true,1,,,,,,51130,VILLERS-AUX-BOIS,,,51630,,,,,,,,,,,,,,,,,,,,F,,,,,49.01,NAP,N,,,0,,,,,,
096341292,00017,09634129200017,O,,NN,,,2019-11-14T14:00:42,true,1,,,,,,51130,VILLERS-AUX-BOIS,,,51630,,,,,,,,,,,,,,,,,,,1990-03-31,F,,,,,49.01,NAP,N,,,0,,,,,,
097041305,00026,09704130500026,O,,,,,2019-11-14T14:00:42,true,1,,,,,,51130,VILLERS-AUX-BOIS,,,51630,,,,,,,,,,,,,,,,,,,1986-01-05,F,,,,,65.02,NAP,N,,,0,,,,,,
097150163,00018,09715016300018,O,,,,,2019-11-14T14:00:42,true,1,,,,,,51130,VILLERS-AUX-BOIS,,,51630,,,,,,,,,,,,,,,,,,,,F,,,,,55.60,NAP,N,,,0,,,,,,
097350201,00014,09735020100014,O,1973-01-01,NN,,,2019-11-14T14:00:42,false,4,,,,RUE,PRINCIPALE,51130,VILLERS-AUX-BOIS,,,51630,,,,,,,,,,,,,,,,,,,1997-12-31,F,,,,,28.1A,NAF1993,O,2.061661,50.820766,0.9,poi,Rue Principale (Pont) Zouafques,https://osm.org/way/111379934,G,,
097350201,00030,09735020100030,O,1997-01-01,11,2020,,2022-08-29T09:03:14,true,4,,,,RTE,DE VERTUS,51130,VILLERS-AUX-BOIS,,,51630,,,,,,,,,,,,,,,,,,,2008-01-01,A,,,,,25.11Z,NAFRev2,O,3.937005,48.933342,0.37,street,Rue de la Foret Charbonniere 51130 Villers-aux-Bois,51630_0005,G,RUE DE LA FORET CHARBONNIERE,
215105834,00018,21510583400018,O,1983-03-01,02,2020,,2022-08-29T09:07:35,true,4,,,,RUE,DE L'EGLISE,51130,VILLERS-AUX-BOIS,,,51630,,,,,,,,,,,,,,,,,,,2008-01-01,A,MAIRIE,,,,84.11Z,NAFRev2,O,3.936289,48.932835,0.92,street,Rue de l’Eglise Saint Pierre 51130 Villers-aux-Bois,51630_0055,G,RUE DE L EGLISE SAINT PIERRE,
215105834,00026,21510583400026,O,1994-12-25,NN,,,2019-11-14T14:00:42,false,3,MAIRIE,,,RUE,DE L'EGLISE,51130,VILLERS-AUX-BOIS,,,51630,,,,,,,,,,,,,,,,,,,2008-07-04,F,SERVICE D'EAU ET D'ASSAINISSEMENT,,,,36.00Z,NAFRev2,N,3.936289,48.932835,0.92,street,Rue de l’Eglise Saint Pierre 51130 Villers-aux-Bois,51630_0055,G,RUE DE L EGLISE SAINT PIERRE,
215105834,00034,21510583400034,O,2005-08-10,,,,2019-11-14T14:00:42,false,3,MAIRIE,,,RUE,DE L'EGLISE,51130,VILLERS-AUX-BOIS,,,51630,,,,,,,,,,,,,,,,,,,2018-01-01,F,LOTISSEMENT COMMUNAL,,,,42.99Z,NAFRev2,N,3.936289,48.932835,0.92,street,Rue de l’Eglise Saint Pierre 51130 Villers-aux-Bois,51630_0055,G,RUE DE L EGLISE SAINT PIERRE,
255100505,00015,25510050500015,O,,,,,2019-11-14T14:00:42,true,1,,,,,,51130,VILLERS-AUX-BOIS,,,51630,,,,,,,,,,,,,,,,,,,,F,,,,,08.01,NAP,N,,,0,,,,,,
255101008,00019,25510100800019,O,1983-03-01,NN,,,2019-11-14T14:00:42,true,4,,,,,,51130,VILLERS-AUX-BOIS,,,51630,,,,,,,,,,,,,,,,,,,2005-06-19,F,,,,,40.1E,NAFRev1,N,,,0,,,,,,
265105395,00015,26510539500015,O,1983-03-01,NN,,,2019-11-14T14:00:42,true,4,,,,,,51130,VILLERS-AUX-BOIS,,,51630,,,,,,,,,,,,,,,,,,,2017-06-30,F,CCAS,,,,88.99B,NAFRev2,N,,,0,,,,,,
312579535,00021,31257953500021,O,1900-01-01,NN,,,2019-11-14T14:00:42,false,4,,,,,CHATEAU,51130,VILLERS-AUX-BOIS,,,51630,,,,,,,,,,,,,,,,,,,1996-12-25,F,,,,,92.7C,NAF1993,O,3.936512,48.931755,0.92,street,Rue du Chateau 51130 Villers-aux-Bois,51630_0045,G,RUE DU CHATEAU,
314558792,00011,31455879200011,O,,NN,,,2019-11-14T14:00:42,true,1,,,,,,51130,VILLERS-AUX-BOIS,,,51630,,,,,,,,,,,,,,,,,,,,F,,,,,79.01,NAP,N,,,0,,,,,,
316280387,00010,31628038700010,O,,,,,2019-11-14T14:00:42,true,1,,,,,,51130,VILLERS-AUX-BOIS,,,51630,,,,,,,,,,,,,,,,,,,1995-08-24,F,,,,,70.2C,NAF1993,N,,,0,,,,,,
323427492,00018,32342749200018,O,,NN,,,2019-11-14T14:00:42,true,1,,,,RUE,PRINCIPALE,51130,VILLERS-AUX-BOIS,,,51630,,,,,,,,,,,,,,,,,,,1990-12-25,F,,,,,79.01,NAP,N,2.061661,50.820766,0.9,poi,Rue Principale (Pont) Zouafques,https://osm.org/way/111379934,G,,
323780999,00013,32378099900013,O,1982-01-01,NN,,,2019-11-14T14:00:42,true,5,MAIRIE,,,,,51130,VILLERS-AUX-BOIS,,,51630,,,,,,,,,,,,,,,,,,,2015-06-30,A,,,,,88.99B,NAFRev2,N,3.935232,48.932488,0.9,street,Place de la Mairie 51130 Villers-aux-Bois,51630_0065,D,PLACE DE LA MAIRIE,
326190337,00021,32619033700021,O,1996-04-04,NN,,,2019-11-14T14:00:42,true,1,,6,,RUE,DE L EGLISE ST PIERRE,51130,VILLERS-AUX-BOIS,,,51630,,,,,,,,,,,,,,,,,,,1996-04-04,F,,,,,01.1G,NAF1993,N,3.936673,48.933173,0.87,housenumber,6 Rue de l’Eglise Saint Pierre 51130 Villers-aux-Bois,51630_0055_00006,G,6 RUE DE L EGLISE SAINT PIERRE,
328111802,00042,32811180200042,O,1996-04-01,NN,,,2019-11-14T14:00:42,false,2,,7,,,PARC AUX CEDRES,51130,VILLERS-AUX-BOIS,,,51630,,,,,,,,,,,,,,,,,,,1996-12-25,F,,,,,52.4C,NAF1993,N,3.933133,48.932656,0.94,housenumber,7 Parc aux Cedres 51130 Villers-aux-Bois,51630_b027_00007,G,7 PARC AUX CEDRES,
328984505,00011,32898450500011,O,,,,,2019-11-14T14:00:42,true,1,,,,RTE,DE GIONGES,51130,VILLERS-AUX-BOIS,,,51630,,,,,,,,,,,,,,,,,,,,F,,,,,55.60,NAP,N,3.930199,48.934811,0.4,street,Lotissement de la Noue de Givry 51130 Villers-aux-Bois,51630_03x5gi,G,LOTISSEMENT DE LA NOUE DE GIVRY,
338808215,00028,33880821500028,O,,NN,,,2019-11-14T14:00:42,true,1,,1,,RUE,DES COULONS,51130,VILLERS-AUX-BOIS,,,51630,,,,,,,,,,,,,,,,,,,1995-05-09,F,,,,,45.3E,NAF1993,O,3.937302,48.933567,0.94,housenumber,1 Rue des Coulons 51130 Villers-aux-Bois,51630_0060_00001,G,1 RUE DES COULONS,
339239683,00016,33923968300016,O,,NN,,,2019-11-14T14:00:42,true,1,,,,,,51130,VILLERS-AUX-BOIS,,,51630,,,,,,,,,,,,,,,,,,,1990-12-17,F,,,,,57.01,NAP,N,,,0,,,,,,
339857526,00026,33985752600026,O,1996-11-22,NN,,,2019-11-14T14:00:42,false,4,,11,,,LE PARC AUX CEDRES,51130,VILLERS-AUX-BOIS,,,51630,,,,,,,,,,,,,,,,,,,2009-01-29,F,,,,,37.00Z,NAFRev2,N,3.934259,48.932586,0.79,housenumber,11 Parc aux Cedres 51130 Villers-aux-Bois,51630_b027_00011,G,11 PARC AUX CEDRES,
349616862,00018,34961686200018,O,,NN,,,2019-11-14T14:00:42,true,1,,,,,,51130,VILLERS-AUX-BOIS,,,51630,,,,,,,,,,,,,,,,,,,1992-12-31,F,,,,,01.1A,NAF1993,N,,,0,,,,,,
351633300,00022,35163330000022,O,1996-11-22,NN,,,2019-11-14T14:00:42,true,4,VILLERS-AUX-BOIS,11,,,LE PARC AUX CEDRES,51130,VILLERS-AUX-BOIS,,,51630,,,,,,,,,,,,,,,,,,,2010-04-20,F,,,,,68.20B,NAFRev2,N,3.934259,48.932586,0.79,housenumber,11 Parc aux Cedres 51130 Villers-aux-Bois,51630_b027_00011,G,11 PARC AUX CEDRES,
377547567,00026,37754756700026,O,,NN,,,2019-11-14T14:00:42,true,1,,21,,RUE,DE LA FORET CHARBONNIERE,51130,VILLERS-AUX-BOIS,,,51630,,,,,,,,,,,,,,,,,,,1995-05-15,F,,,,,60.2P,NAF1993,N,3.936028,48.933508,0.95,housenumber,21 Rue de la Foret Charbonniere 51130 Villers-aux-Bois,51630_0005_00021,G,21 RUE DE LA FORET CHARBONNIERE,
378303549,00018,37830354900018,O,1900-01-01,NN,,,2019-11-14T14:00:42,false,3,,,,,,51130,VILLERS-AUX-BOIS,,,51630,,,,,,,,,,,,,,,,,,,1994-07-01,F,,,,,92.3A,NAF1993,N,,,0,,,,,,
382811131,00038,38281113100038,O,2004-08-25,NN,,,2019-11-14T14:00:42,true,5,,,,,,51130,VILLERS-AUX-BOIS,,,51630,,,,,,,,,,,,,,,,,,,2012-02-17,F,,,,,41.10C,NAFRev2,O,,,0,,,,,,
382996775,00047,38299677500047,O,2011-06-11,,,,2019-11-14T14:00:42,true,2,,42,T,RUE,RUE DE LAFORET CHARBONNIERE,51130,VILLERS-AUX-BOIS,,,51630,,,,,,,,,,,,,,,,,,,2012-12-01,F,,,,,47.89Z,NAFRev2,N,3.937005,48.933342,0.77,street,Rue de la Foret Charbonniere 51130 Villers-aux-Bois,51630_0005,G,RUE DE LA FORET CHARBONNIERE,
383076940,00014,38307694000014,O,,NN,,,2019-11-14T14:00:42,true,1,,,,RUE,PRINCIPALE,51130,VILLERS-AUX-BOIS,,,51630,,,,,,,,,,,,,,,,,,,1992-12-31,F,,,,,70.3A,NAF1993,N,2.061661,50.820766,0.9,poi,Rue Principale (Pont) Zouafques,https://osm.org/way/111379934,G,,
389025552,00016,38902555200016,O,1992-09-01,NN,,,2019-11-14T14:00:42,true,1,,,,,FERME FOLIE,51130,VILLERS-AUX-BOIS,,,51630,,,,,,,,,,,,,,,,,,,1998-04-01,F,,,,,01.1A,NAF1993,N,3.5473454,48.8655565,0.89,poi.farmyard,Ferme de la Folie (Corps de ferme) Montmirail,https://osm.org/way/497471062,G,,
391232022,00023,39123202200023,O,1990-01-01,NN,,,2019-11-14T14:00:42,false,3,,5,,RUE,DE LA FONTAINE,51130,VILLERS-AUX-BOIS,,,51630,,,,,,,,,,,,,,,,,,,2004-01-09,F,,,,,01.1G,NAFRev1,N,3.939301,48.932502,0.94,housenumber,5 Rue de la Fontaine 51130 Villers-aux-Bois,51630_0070_00005,G,5 RUE DE LA FONTAINE,
391245255,00016,39124525500016,O,1993-04-01,NN,,,2019-11-14T14:00:42,false,3,,1,,RUE,DE LA FORET CHARBONNIERE,51130,VILLERS-AUX-BOIS,,,51630,,,,,,,,,,,,,,,,,,,2008-01-01,A,,,,,68.20B,NAFRev2,N,3.9403,48.932247,0.95,housenumber,1 Rue de la Foret Charbonniere 51130 Villers-aux-Bois,51630_0005_00001,G,1 RUE DE LA FORET CHARBONNIERE,
391245255,00040,39124525500040,O,2008-02-01,,,,2019-11-14T14:00:42,false,2,V,1,,RUE,FORET CHARBONNIERE,51130,VILLERS-AUX-BOIS,,,51630,,,,,,,,,,,,,,,,,,,2009-07-01,F,,,,,01.21Z,NAFRev2,N,3.9403,48.932247,0.9,housenumber,1 Rue de la Foret Charbonniere 51130 Villers-aux-Bois,51630_0005_00001,G,1 RUE DE LA FORET CHARBONNIERE,
393798996,00012,39379899600012,O,,NN,,,2019-11-14T14:00:42,true,1,,21,,RUE,DE LA FORET CHARBONNIERE,51130,VILLERS-AUX-BOIS,,,51630,,,,,,,,,,,,,,,,,,,1994-01-24,F,,,,,60.2P,NAF1993,N,3.936028,48.933508,0.95,housenumber,21 Rue de la Foret Charbonniere 51130 Villers-aux-Bois,51630_0005_00021,G,21 RUE DE LA FORET CHARBONNIERE,
393968367,00028,39396836700028,O,1993-01-01,NN,,,2019-11-14T14:00:42,true,3,,,,RUE,DES COULONS,51130,VILLERS-AUX-BOIS,,,51630,,,,,,,,,,,,,,,,,,,2008-01-01,A,,,,,01.21Z,NAFRev2,N,3.937752,48.933916,0.94,street,Rue des Coulons 51130 Villers-aux-Bois,51630_0060,G,RUE DES COULONS,
394474837,00033,39447483700033,O,2012-05-23,NN,,,2019-11-14T14:00:42,true,2,,30,,RUE,DE LA FORET CHARBONNIERE,51130,VILLERS-AUX-BOIS,,,51630,,,,,,,,,,,,,,,,,,,2017-01-01,F,,,,,46.34Z,NAFRev2,N,3.934625,48.933766,0.95,housenumber,30 Rue de la Foret Charbonniere 51130 Villers-aux-Bois,51630_0005_00030,G,30 RUE DE LA FORET CHARBONNIERE,
401002704,00013,40100270400013,O,1994-10-01,,,,2019-11-14T14:00:42,true,1,,,,RUE,DE L'EGLISE ST PIERRE,51130,VILLERS-AUX-BOIS,,,51630,,,,,,,,,,,,,,,,,,,1998-09-30,F,,,,,92.6C,NAF1993,N,3.936289,48.932835,0.87,street,Rue de l’Eglise Saint Pierre 51130 Villers-aux-Bois,51630_0055,G,RUE DE L EGLISE SAINT PIERRE,
401138987,00037,40113898700037,O,2006-11-20,NN,,,2019-11-14T14:00:42,false,3,,5,,RUE,DE LA FONTAINE,51130,VILLERS-AUX-BOIS,,,51630,,,,,,,,,,,,,,,,,,,2009-10-31,F,,,,,43.22A,NAFRev2,O,3.939301,48.932502,0.94,housenumber,5 Rue de la Fontaine 51130 Villers-aux-Bois,51630_0070_00005,G,5 RUE DE LA FONTAINE,
401442454,00013,40144245400013,O,1994-01-01,NN,,,2019-11-14T14:00:42,true,1,,22,,RUE,DE LA FORET CHARBONNIERE,51130,VILLERS-AUX-BOIS,,,51630,,,,,,,,,,,,,,,,,,,2001-10-07,F,,,,,02.0A,NAF1993,N,3.935861,48.933638,0.95,housenumber,22 Rue de la Foret Charbonniere 51130 Villers-aux-Bois,51630_0005_00022,G,22 RUE DE LA FORET CHARBONNIERE,
401474663,00010,40147466300010,O,1995-07-03,NN,,1610AQ,2021-04-03T11:09:44,true,3,,3,,CHE,DES PETITS PRES,51130,VILLERS-AUX-BOIS,,,51630,,,,,,,,,,,,,,,,,,,2008-01-01,A,,,,,16.10A,NAFRev2,N,3.940288,48.932564,0.85,housenumber,3 Chemin des Petits Pres 51130 Villers-aux-Bois,51630_igpsih_00003,G,3 CHEMIN DES PETITS PRES,
402298871,00011,40229887100011,O,1994-01-01,NN,,,2019-11-14T14:00:42,true,3,,6,,RUE,DE LA FORET CHARBONNIERE,51130,VILLERS-AUX-BOIS,,,51630,,,,,,,,,,,,,,,,,,,1998-12-25,F,,,,,01.1G,NAF1993,N,3.939315,48.932584,0.95,housenumber,6 Rue de la Foret Charbonniere 51130 Villers-aux-Bois,51630_0005_00006,G,6 RUE DE LA FORET CHARBONNIERE,
402816524,00019,40281652400019,O,1995-11-13,NN,,,2019-11-14T14:00:42,false,3,,6,,,PARC AUX CEDRES,51130,VILLERS-AUX-BOIS,,,51630,,,,,,,,,,,,,,,,,,,1996-04-24,F,,,,,50.2Z,NAF1993,N,3.933072,48.932798,0.94,housenumber,6 Parc aux Cedres 51130 Villers-aux-Bois,51630_b027_00006,G,6 PARC AUX CEDRES,
403462799,00012,40346279900012,O,1996-01-01,NN,,,2019-11-14T14:00:42,false,4,,3,,CHE,DES COULONS,51130,VILLERS-AUX-BOIS,,,51630,,,,,,,,,,,,,,,,,,,2014-03-31,F,,,,,01.61Z,NAFRev2,N,3.937435,48.933725,0.74,housenumber,3 Rue des Coulons 51130 Villers-aux-Bois,51630_0060_00003,G,3 RUE DES COULONS,
403852429,00014,40385242900014,O,1996-01-03,NN,,,2019-11-14T14:00:42,true,3,VILLERS-AUX-BOIS,17,,RUE,DE LA FORET CHARBONNIERE,51130,VILLERS-AUX-BOIS,,,51630,,,,,,,,,,,,,,,,,,,2008-01-01,A,,,,,01.11Z,NAFRev2,N,3.936559,48.933369,0.95,housenumber,17 Rue de la Foret Charbonniere 51130 Villers-aux-Bois,51630_0005_00017,G,17 RUE DE LA FORET CHARBONNIERE,
407512524,00031,40751252400031,O,2000-12-21,NN,,,2019-11-14T14:00:42,false,4,,31,,RUE,DE LA FORET CHARBONNIERE,51130,VILLERS-AUX-BOIS,,,51630,,,,,,,,,,,,,,,,,,,2010-07-26,F,,,,,85.51Z,NAFRev2,N,3.935253,48.933674,0.95,housenumber,31 Rue de la Foret Charbonniere 51130 Villers-aux-Bois,51630_0005_00031,G,31 RUE DE LA FORET CHARBONNIERE,
409850237,00010,40985023700010,O,1996-01-01,NN,,,2023-01-28T03:35:01,true,2,FERME DE LA FOLIE,,,,LE VILLAGE,51130,VILLERS-AUX-BOIS,,,51630,,,,,,,,,,,,,,,,,,,1998-03-31,F,,,,,,,,3.939249,48.933147,0.94,street,Le Village 51130 Villers-aux-Bois,51630_ulsc82,G,LE VILLAGE,
411348501,00015,41134850100015,O,1981-01-01,NN,,,2019-11-14T14:00:42,false,4,,,,,,51130,VILLERS-AUX-BOIS,,,51630,,,,,,,,,,,,,,,,,,,2002-03-31,F,,,,,01.1G,NAF1993,N,,,0,,,,,,
418527867,00018,41852786700018,O,1998-04-01,NN,,,2021-10-27T08:40:03,true,3,MR PHILIPPE PERCHAT,,,,FERME DE LA FOLIE,51130,VILLERS-AUX-BOIS,,,51630,,,,,,,,,,,,,,,,,,,2008-01-01,A,,,,,01.11Z,NAFRev2,N,4.3968815,48.1141938,0.9,poi.track,Chemin de la Ferme de la Folie Bar-sur-Seine,https://osm.org/way/154702434,G,,
418759460,00011,41875946000011,O,1998-01-01,,,,2019-11-14T14:00:42,false,3,,36,,RUE,DE LA FORET CHARBONNIERE,51130,VILLERS-AUX-BOIS,,,51630,,,,,,,,,,,,,,,,,,,1999-12-31,F,,,,,01.1G,NAF1993,N,3.933898,48.933644,0.95,housenumber,36 Rue de la Foret Charbonniere 51130 Villers-aux-Bois,51630_0005_00036,G,36 RUE DE LA FORET CHARBONNIERE,
421568502,00015,42156850200015,O,1998-11-01,NN,,,2019-11-14T14:00:42,true,3,,8,,RUE,FORET CHARBONNIERE,51130,VILLERS-AUX-BOIS,,,51630,,,,,,,,,,,,,,,,,,,2008-01-01,A,,,,,01.21Z,NAFRev2,N,3.93812,48.932758,0.9,housenumber,8 Rue de la Foret Charbonniere 51130 Villers-aux-Bois,51630_0005_00008,G,8 RUE DE LA FORET CHARBONNIERE,
423268770,00033,42326877000033,O,2016-10-01,02,2020,,2022-08-29T09:04:38,true,1,,31,,RUE,DE LA FORET CHARBONNIERE,51130,VILLERS-AUX-BOIS,,,51630,,,,,,,,,,,,,,,,,,,2016-10-01,A,,,,,01.21Z,NAFRev2,O,3.935253,48.933674,0.95,housenumber,31 Rue de la Foret Charbonniere 51130 Villers-aux-Bois,51630_0005_00031,G,31 RUE DE LA FORET CHARBONNIERE,
427965231,00017,42796523100017,O,1982-01-01,NN,,,2019-11-14T14:00:42,true,4,,5,,LOT,LE VILLAGE,51130,VILLERS-AUX-BOIS,,,51630,,,,,,,,,,,,,,,,,,,2012-10-18,F,,,,,01.21Z,NAFRev2,N,3.938926,48.932748,0.88,housenumber,5 Lotissement le Village 51130 Villers-aux-Bois,51630_9u9oj1_00005,G,5 LOTISSEMENT LE VILLAGE,
427965249,00019,42796524900019,O,1982-01-01,NN,,,2019-11-14T14:00:42,true,3,,,,,GRANDE RUE,51130,VILLERS-AUX-BOIS,,,51630,,,,,,,,,,,,,,,,,,,2008-01-01,A,,,,,01.21Z,NAFRev2,N,3.937005,48.933342,0.44,street,Rue de la Foret Charbonniere 51130 Villers-aux-Bois,51630_0005,G,RUE DE LA FORET CHARBONNIERE,
427965918,00019,42796591800019,O,1970-01-01,NN,,,2019-11-14T14:00:42,true,3,,,,,,51130,VILLERS-AUX-BOIS,,,51630,,,,,,,,,,,,,,,,,,,2008-01-01,A,,,,,01.21Z,NAFRev2,N,,,0,,,,,,
427969100,00010,42796910000010,O,1985-01-01,NN,,,2019-11-14T14:00:42,true,3,,6,,LOT,VILLAGE,51130,VILLERS-AUX-BOIS,,,51630,,,,,,,,,,,,,,,,,,,2008-01-01,A,,,,,01.21Z,NAFRev2,N,3.939032,48.933014,0.8,housenumber,6 Lotissement le Village 51130 Villers-aux-Bois,51630_9u9oj1_00006,G,6 LOTISSEMENT LE VILLAGE,
427969498,00018,42796949800018,O,1985-01-01,NN,,,2019-11-14T14:00:42,true,3,,4,,,VAL AUBRY,51130,VILLERS-AUX-BOIS,,,51630,,,,,,,,,,,,,,,,,,,2008-01-01,A,,,,,01.21Z,NAFRev2,N,3.938219,48.930318,0.77,housenumber,4 Rue du Val d’Aubry 51130 Villers-aux-Bois,51630_0025_00004,G,4 RUE DU VAL D AUBRY,
427969589,00014,42796958900014,O,1986-01-01,NN,,,2019-11-14T14:00:42,true,3,,16,,RUE,FORET CHARBONNIERE,51130,VILLERS-AUX-BOIS,,,51630,,,,,,,,,,,,,,,,,,,2008-01-01,A,,,,,01.21Z,NAFRev2,N,3.936646,48.933433,0.91,housenumber,16 Rue de la Foret Charbonniere 51130 Villers-aux-Bois,51630_0005_00016,G,16 RUE DE LA FORET CHARBONNIERE,
430780049,00028,43078004900028,O,2001-10-08,NN,,,2019-11-14T14:00:42,true,3,,22,,RUE,DE LA FORET CHARBONNIERE,51130,VILLERS-AUX-BOIS,,,51630,,,,,,,,,,,,,,,,,,,2008-01-01,A,,,,,02.10Z,NAFRev2,N,3.935861,48.933638,0.95,housenumber,22 Rue de la Foret Charbonniere 51130 Villers-aux-Bois,51630_0005_00022,G,22 RUE DE LA FORET CHARBONNIERE,
431148006,00015,43114800600015,O,1991-01-01,NN,,,2019-11-14T14:00:42,true,3,,,,CHE,DES PETITS PRES,51130,VILLERS-AUX-BOIS,,,51630,,,,,,,,,,,,,,,,,,,2008-01-01,A,,,,,01.21Z,NAFRev2,N,3.940288,48.932564,0.84,street,Chemin des Petits Pres 51130 Villers-aux-Bois,51630_igpsih,G,CHEMIN DES PETITS PRES,
438205346,00010,43820534600010,O,2000-01-01,NN,,,2019-11-14T14:00:42,true,3,,23,,RUE,DE LA FORET CHARBONNIERE,51130,VILLERS-AUX-BOIS,,,51630,,,,,,,,,,,,,,,,,,,2008-01-01,A,,,,,01.21Z,NAFRev2,N,3.935866,48.93355,0.95,housenumber,23 Rue de la Foret Charbonniere 51130 Villers-aux-Bois,51630_0005_00023,G,23 RUE DE LA FORET CHARBONNIERE,
439737818,00013,43973781800013,O,2001-12-01,01,2020,,2022-08-29T09:15:48,true,3,,6,,RUE,DES COULONS,51130,VILLERS-AUX-BOIS,,,51630,,,,,,,,,,,,,,,,,,,2008-01-01,A,,,,,01.21Z,NAFRev2,N,3.937749,48.933916,0.94,housenumber,6 Rue des Coulons 51130 Villers-aux-Bois,51630_0060_00006,G,6 RUE DES COULONS,
441733409,00011,44173340900011,O,2001-09-01,NN,,,2019-11-14T14:00:42,true,3,,33,,RUE,DE LA FORET CHARBONNIERE,51130,VILLERS-AUX-BOIS,,,51630,,,,,,,,,,,,,,,,,,,2008-01-01,A,,,,,01.11Z,NAFRev2,N,3.934692,48.93369,0.95,housenumber,33 Rue de la Foret Charbonniere 51130 Villers-aux-Bois,51630_0005_00033,G,33 RUE DE LA FORET CHARBONNIERE,
447914086,00015,44791408600015,O,2002-07-15,NN,,,2019-11-14T14:00:42,true,3,,,,RUE,DE L'EGLISE,51130,VILLERS-AUX-BOIS,,,51630,,,,,,,,,,,,,,,,,,,2008-01-01,A,,,,,01.21Z,NAFRev2,N,3.936289,48.932835,0.92,street,Rue de l’Eglise Saint Pierre 51130 Villers-aux-Bois,51630_0055,G,RUE DE L EGLISE SAINT PIERRE,
448404046,00014,44840404600014,O,1970-09-16,NN,,,2019-11-14T14:00:42,true,3,,,,,,51130,VILLERS-AUX-BOIS,,,51630,,,,,,,,,,,,,,,,,,,2008-01-01,A,,,,,01.11Z,NAFRev2,N,,,0,,,,,,
449718170,00011,44971817000011,O,2003-09-22,NN,,,2019-11-14T14:00:42,false,3,,4,,RUE,DES COULONS,51130,VILLERS-AUX-BOIS,,,51630,,,,,,,,,,,,,,,,,,,2004-07-01,F,,,,,85.1G,NAFRev1,N,3.937876,48.93401,0.94,housenumber,4 Rue des Coulons 51130 Villers-aux-Bois,51630_0060_00004,G,4 RUE DES COULONS,
452520125,00017,45252012500017,O,2001-11-01,NN,,,2019-11-14T14:00:42,true,3,,2,,RUE,DU CHATEAU,51130,VILLERS-AUX-BOIS,,,51630,,,,,,,,,,,,,,,,,,,2008-01-01,A,,,,,01.21Z,NAFRev2,N,3.937233,48.931687,0.94,housenumber,2 Rue du Chateau 51130 Villers-aux-Bois,51630_0045_00002,G,2 RUE DU CHATEAU,
452677677,00018,45267767700018,O,2004-04-01,01,2020,4391BZ,2022-08-29T09:08:20,false,4,,,,RTE,DE CHALTRAIT,51130,VILLERS-AUX-BOIS,,,51630,,,,,,,,,,,,,,,,,,,2021-03-01,F,,,,,43.91B,NAFRev2,O,3.930798,48.934066,0.83,street,Route de Chaltrait 51130 Villers-aux-Bois,51630_0075,G,ROUTE DE CHALTRAIT,
452677677,00026,45267767700026,O,2021-03-01,,,4391BZ,2021-07-26T15:27:18,true,1,,3,,RUE,DE LA NOUE DE GIVRY,51130,VILLERS-AUX-BOIS,,,51630,,,,,,,,,,,,,,,,,,,2021-03-01,A,,,,,43.91B,NAFRev2,O,3.932885,48.933597,0.94,housenumber,3 Rue de la Noue de Givry 51130 Villers-aux-Bois,51630_0067_00003,G,3 RUE DE LA NOUE DE GIVRY,
479148165,00018,47914816500018,O,2004-11-01,NN,,,2019-11-14T14:00:42,true,1,,2,,RUE,DE LA FONTAINE,51130,VILLERS-AUX-BOIS,,,51630,,,,,,,,,,,,,,,,,,,2004-11-01,F,,,,,,,N,3.938,48.931674,0.94,housenumber,2 Rue de la Fontaine 51130 Villers-aux-Bois,51630_0070_00002,G,2 RUE DE LA FONTAINE,
481490530,00013,48149053000013,O,2005-03-21,NN,,4321AB,2021-10-27T08:18:00,true,6,,2,,RUE,DES COULONS,51130,VILLERS-AUX-BOIS,,,51630,,,,,,,,,,,,,,,,,,,2012-06-30,A,,,,,43.21A,NAFRev2,N,3.937752,48.933916,0.94,housenumber,2 Rue des Coulons 51130 Villers-aux-Bois,51630_0060_00002,G,2 RUE DES COULONS,
483117867,00018,48311786700018,O,2005-05-14,,,,2019-11-14T14:00:42,true,2,,,,RTE,DE CHALTRAIT,51130,VILLERS-AUX-BOIS,,,51630,,,,,,,,,,,,,,,,,,,2008-01-01,A,,,,,68.20B,NAFRev2,N,3.930798,48.934066,0.83,street,Route de Chaltrait 51130 Villers-aux-Bois,51630_0075,G,ROUTE DE CHALTRAIT,
491631255,00016,49163125500016,O,2006-08-29,NN,,4520AB,2019-11-14T14:00:42,false,7,,40,,RUE,DE LA FORET CHARBONNIERE,51130,VILLERS-AUX-BOIS,,,51630,,,,,,,,,,,,,,,,,,,2014-03-24,F,,,,,45.20A,NAFRev2,N,3.933535,48.933526,0.95,housenumber,40 Rue de la Foret Charbonniere 51130 Villers-aux-Bois,51630_0005_00040,G,40 RUE DE LA FORET CHARBONNIERE,
498042456,00018,49804245600018,O,2007-05-01,02,2020,4321AB,2022-08-29T09:29:46,true,2,,26,,RUE,DE LA FORET CHARBONNIERE,51130,VILLERS-AUX-BOIS,,,51630,,,,,,,,,,,,,,,,,,,2008-01-01,A,,,,,43.21A,NAFRev2,O,3.93537,48.93374,0.95,housenumber,26 Rue de la Foret Charbonniere 51130 Villers-aux-Bois,51630_0005_00026,G,26 RUE DE LA FORET CHARBONNIERE,
498602481,00018,49860248100018,O,2007-06-05,,,,2021-12-28T03:48:05,true,3,NIERE,11,,RUE,DE LA FORET CHARBON,51130,VILLERS-AUX-BOIS,,,51630,,,,,,,,,,,,,,,,,,,2021-07-20,F,,,,,68.20B,NAFRev2,N,3.938229,48.932719,0.91,housenumber,11 Rue de la Foret Charbonniere 51130 Villers-aux-Bois,51630_0005_00011,G,11 RUE DE LA FORET CHARBONNIERE,
500597208,00023,50059720800023,O,2015-03-23,,,,2019-11-14T14:00:42,true,1,9-5,9,,RUE,DE LA NOUE DE GIVRY,51130,VILLERS-AUX-BOIS,,,51630,,,,,,,,,,,,,,,,,,,2015-03-23,A,,,,,68.20B,NAFRev2,N,3.931369,48.933885,0.94,housenumber,9 Rue de la Noue de Givry 51130 Villers-aux-Bois,51630_0067_00009,G,9 RUE DE LA NOUE DE GIVRY,