siren,nic,siret,statutDiffusionEtablissement,dateCreationEtablissement,trancheEffectifsEtablissement,anneeEffectifsEtablissement,activitePrincipaleRegistreMetiersEtablissement,dateDernierTraitementEtablissement,etablissementSiege,nombrePeriodesEtablissement,complementAdresseEtablissement,numeroVoieEtablissement,indiceRepetitionEtablissement,typeVoieEtablissement,libelleVoieEtablissement,codePostalEtablissement,libelleCommuneEtablissement,libelleCommuneEtrangerEtablissement,distributionSpecialeEtablissement,codeCommuneEtablissement,codeCedexEtablissement,libelleCedexEtablissement,codePaysEtrangerEtablissement,libellePaysEtrangerEtablissement,complementAdresse2Etablissement,numeroVoie2Etablissement,indiceRepetition2Etablissement,typeVoie2Etablissement,libelleVoie2Etablissement,codePostal2Etablissement,libelleCommune2Etablissement,libelleCommuneEtranger2Etablissement,distributionSpeciale2Etablissement,codeCommune2Etablissement,codeCedex2Etablissement,libelleCedex2Etablissement,codePaysEtranger2Etablissement,libellePaysEtranger2Etablissement,dateDebut,etatAdministratifEtablissement,enseigne1Etablissement,enseigne2Etablissement,enseigne3Etablissement,denominationUsuelleEtablissement,activitePrincipaleEtablissement,nomenclatureActivitePrincipaleEtablissement,caractereEmployeurEtablissement,longitude,latitude,geo_score,geo_type,geo_adresse,geo_id,geo_ligne,geo_l4,geo_l5
200067908,00091,20006790800091,O,2017-12-07,,,,2019-11-14T14:00:46,false,1,,,,,LE MERLE,58330,CRUX-LA-VILLE,,,58092,,,,,,,,,,,,,,,,,,,2017-12-07,A,CAMPING DU MERLE,,,,55.30Z,NAFRev2,N,3.499932,47.137891,0.8,street,Le Hameau du Merle 58330 Crux-la-Ville,58092_0250,G,LE HAMEAU DU MERLE,
215800921,00011,21580092100011,O,1983-03-01,02,2020,,2022-08-29T09:07:54,true,4,,,,,BOURG,58330,CRUX-LA-VILLE,,,58092,,,,,,,,,,,,,,,,,,,2008-01-01,A,MAIRIE,,,,84.11Z,NAFRev2,O,3.519775,47.160662,0.92,street,Le Bourg 58330 Crux-la-Ville,58092_pfl4bp,G,LE BOURG,
215800921,00029,21580092100029,O,1983-12-21,01,2020,,2022-08-29T09:07:54,false,4,LE BOURG,,,,,58330,CRUX-LA-VILLE,,,58092,,,,,,,,,,,,,,,,,,,2022-05-13,A,ECOLE ELEMENTAIRE,,,,85.20Z,NAFRev2,N,3.519775,47.160662,0.94,street,Le Bourg 58330 Crux-la-Ville,58092_pfl4bp,D,LE BOURG,
215800921,00037,21580092100037,O,1996-12-25,NN,,,2019-11-14T14:00:46,false,2,MAIRIE,,,,BOURG,58330,CRUX-LA-VILLE,,,58092,,,,,,,,,,,,,,,,,,,2008-01-01,A,SERVICE EAU,,,,36.00Z,NAFRev2,N,3.519775,47.160662,0.92,street,Le Bourg 58330 Crux-la-Ville,58092_pfl4bp,G,LE BOURG,
265800920,00018,26580092000018,O,1983-03-01,NN,,,2019-11-14T14:00:46,true,5,MAIRIE,,,,LE BOURG,58330,CRUX-LA-VILLE,,,58092,,,,,,,,,,,,,,,,,,,2016-01-01,F,,,,,88.99B,NAFRev2,N,3.519775,47.160662,0.94,street,Le Bourg 58330 Crux-la-Ville,58092_pfl4bp,G,LE BOURG,
275800225,00011,27580022500011,O,,,,,2019-11-14T14:00:46,true,1,,,,,MAIRIE,58330,CRUX-LA-VILLE,,,58092,,,,,,,,,,,,,,,,,,,1995-12-25,F,,,,,41.0Z,NAF1993,N,3.0709671,50.6304695,0.92,poi.townhall,Hôtel de Ville Lille,https://osm.org/way/40917078,G,,
295800924,00017,29580092400017,O,1983-08-10,NN,,,2019-11-14T14:00:46,true,5,MAIRIE,,,,LE BOURG,58330,CRUX-LA-VILLE,,,58092,,,,,,,,,,,,,,,,,,,2012-07-16,F,,,,,42.99Z,NAFRev2,N,3.519775,47.160662,0.94,street,Le Bourg 58330 Crux-la-Ville,58092_pfl4bp,G,LE BOURG,
301147658,00019,30114765800019,O,,,,,2019-11-14T14:00:46,true,1,,,,LD,LE BOURG,58330,CRUX-LA-VILLE,,,58092,,,,,,,,,,,,,,,,,,,1984-12-25,F,,,,,55.40,NAP,N,3.519775,47.160662,0.94,street,Le Bourg 58330 Crux-la-Ville,58092_pfl4bp,G,LE BOURG,
301384160,00018,30138416000018,O,1973-01-01,NN,,,2019-11-14T14:00:46,true,1,,,,,,58330,CRUX-LA-VILLE,,,58092,,,,,,,,,,,,,,,,,,,1999-06-30,F,,,,,45.2V,NAF1993,O,,,0,,,,,,
306241878,00041,30624187800041,O,1998-09-14,,,,2019-11-14T14:00:46,false,1,,,,LD,L'ETANG DU MERLE,58330,CRUX-LA-VILLE,,,58092,,,,,,,,,,,,,,,,,,,1998-09-14,F,,,,,,,,3.495502,47.137731,0.84,street,Etang du Merle 58330 Crux-la-Ville,58092_B160,G,ETANG DU MERLE,
310064621,00025,31006462100025,O,,NN,,,2019-11-14T14:00:46,true,1,,,,LD,LE BERLE,58330,CRUX-LA-VILLE,,,58092,,,,,,,,,,,,,,,,,,,,F,,,,,77.05,NAP,N,3.506335,47.14886,0.69,street,La Berle 58330 Crux-la-Ville,58092_owkg3h,G,LA BERLE,
310156740,00014,31015674000014,O,1900-01-01,NN,,,2019-11-14T14:00:46,false,4,,,,HAM,LE BERLE,58330,CRUX-LA-VILLE,,,58092,,,,,,,,,,,,,,,,,,,2000-07-31,F,,,,,36.1G,NAF1993,O,3.506335,47.14886,0.69,street,La Berle 58330 Crux-la-Ville,58092_owkg3h,G,LA BERLE,
319341798,00019,31934179800019,O,1980-06-01,NN,,,2019-11-14T14:00:46,true,6,LES SERREES,,,,LES SERREES,58330,CRUX-LA-VILLE,,,58092,,,,,,,,,,,,,,,,,,,2008-12-31,F,,,,,01.42Z,NAFRev2,N,3.503573,47.126811,0.94,street,Les Serrees 58330 Crux-la-Ville,58092_mhrfc6,G,LES SERREES,
320540214,00014,32054021400014,O,,,,,2019-11-14T14:00:46,true,1,,,,,,58330,CRUX-LA-VILLE,,,58092,,,,,,,,,,,,,,,,,,,1984-12-25,F,,,,,62.43,NAP,N,,,0,,,,,,
323228726,00044,32322872600044,O,1998-08-01,NN,,,2019-11-14T14:00:46,true,1,,,,LD,MOURRY,58330,CRUX-LA-VILLE,,,58092,,,,,,,,,,,,,,,,,,,2001-03-31,F,,,,,02.0B,NAF1993,N,3.547762,47.176207,0.94,street,Mourry 58330 Crux-la-Ville,58092_elsiup,G,MOURRY,
323685412,00013,32368541200013,O,1982-01-01,NN,,,2019-11-14T14:00:46,true,4,,,,,LA VANNE,58330,CRUX-LA-VILLE,,,58092,,,,,,,,,,,,,,,,,,,2014-12-22,F,,,,,68.20B,NAFRev2,N,3.533289,47.172875,0.93,street,La Vanne 58330 Crux-la-Ville,58092_x2fcyd,G,LA VANNE,
323945675,00011,32394567500011,O,1982-03-01,NN,,,2022-04-20T04:23:55,true,3,LES PERRIERES,,,,LES PERRIERES,58330,CRUX-LA-VILLE,,,58092,,,,,,,,,,,,,,,,,,,2008-01-01,A,,,,,01.11Z,NAFRev2,N,3.526123,47.18405,0.94,street,Les Perrieres 58330 Crux-la-Ville,58092_ud0anx,G,LES PERRIERES,
324894799,00018,32489479900018,O,1982-06-23,NN,,,2019-11-14T14:00:46,true,4,CRUX LA VILLE,,,,MAIRIE,58330,CRUX-LA-VILLE,,,58092,,,,,,,,,,,,,,,,,,,2010-06-17,F,,,,,70.10Z,NAFRev2,N,3.539961,47.159436,0.64,street,Prairie des Faux 58330 Crux-la-Ville,58092_B395,G,PRAIRIE DES FAUX,
325946838,00019,32594683800019,O,,,,,2019-11-14T14:00:46,true,1,,,,,LE BOURG,58330,CRUX-LA-VILLE,,,58092,,,,,,,,,,,,,,,,,,,1984-12-25,F,,,,,38.40,NAP,N,3.519775,47.160662,0.94,street,Le Bourg 58330 Crux-la-Ville,58092_pfl4bp,G,LE BOURG,
329460901,00013,32946090100013,O,1984-03-26,NN,,,2019-11-14T14:00:46,true,3,,,,,DOMAINE DU JONC,58330,CRUX-LA-VILLE,,,58092,,,,,,,,,,,,,,,,,,,2008-01-01,A,,,,,01.11Z,NAFRev2,N,3.555308,47.164946,0.35,street,Le Jonc 58330 Crux-la-Ville,58092_mufud4,G,LE JONC,
331769711,00010,33176971100010,O,1974-06-12,NN,,,2019-11-14T14:00:46,true,3,,,,HAM,CLOISEAU,58330,CRUX-LA-VILLE,,,58092,,,,,,,,,,,,,,,,,,,2008-01-01,A,,,,,68.20B,NAFRev2,N,3.505008,47.169571,0.94,street,Cloiseau 58330 Crux-la-Ville,58092_trv5zw,G,CLOISEAU,
332082437,00010,33208243700010,O,1980-01-01,NN,,,2021-02-23T10:51:58,true,3,,,,LD,LES GRANDS MAUROIS,58330,CRUX-LA-VILLE,,,58092,,,,,,,,,,,,,,,,,,,2008-01-01,A,,,,,01.42Z,NAFRev2,N,3.539523,47.144291,0.94,street,Les Grands Maurois 58330 Crux-la-Ville,58092_ibbv7m,G,LES GRANDS MAUROIS,
334685567,00029,33468556700029,O,1993-01-01,NN,,,2019-11-14T14:00:46,true,1,,,,LD,CHALLUEE,58330,CRUX-LA-VILLE,,,58092,,,,,,,,,,,,,,,,,,,1998-06-10,F,,,,,45.2U,NAF1993,N,3.510274,47.177203,0.94,street,Challuee 58330 Crux-la-Ville,58092_jvu7hi,G,CHALLUEE,
334826443,00015,33482644300015,O,1985-01-01,NN,,,2019-11-14T14:00:46,true,3,,,,HAM,CHALLUEE,58330,CRUX-LA-VILLE,,,58092,,,,,,,,,,,,,,,,,,,2008-01-01,A,,,,,01.45Z,NAFRev2,N,3.510274,47.177203,0.94,street,Challuee 58330 Crux-la-Ville,58092_jvu7hi,G,CHALLUEE,
334827433,00015,33482743300015,O,1977-01-01,NN,,,2021-02-23T10:53:54,true,3,,,,LD,LA COME,58330,CRUX-LA-VILLE,,,58092,,,,,,,,,,,,,,,,,,,2008-01-01,A,,,,,01.42Z,NAFRev2,N,3.515535,47.148283,0.94,street,La Come 58330 Crux-la-Ville,58092_z2sh65,G,LA COME,
335154175,00012,33515417500012,O,,NN,,,2019-11-14T14:00:46,true,1,,,,,,58330,CRUX-LA-VILLE,,,58092,,,,,,,,,,,,,,,,,,,1991-12-31,F,,,,,55.72,NAP,N,,,0,,,,,,
338160716,00027,33816071600027,O,2009-04-01,,,,2021-02-23T10:54:48,true,1,,,,,LES GRAND FAUX,58330,CRUX-LA-VILLE,,,58092,,,,,,,,,,,,,,,,,,,2009-04-01,A,,,,,02.40Z,NAFRev2,N,3.546964,47.153915,0.55,street,Les Faux 58330 Crux-la-Ville,58092_codxuv,G,LES FAUX,
338160716,00035,33816071600035,O,2009-10-01,,,,2021-02-23T10:54:48,false,1,,,,,LES FAUX,58330,CRUX-LA-VILLE,,,58092,,,,,,,,,,,,,,,,,,,2009-10-01,A,,,,,81.30Z,NAFRev2,N,3.546964,47.153915,0.95,street,Les Faux 58330 Crux-la-Ville,58092_codxuv,G,LES FAUX,
339140923,00022,33914092300022,O,1998-07-22,NN,,,2019-11-14T14:00:46,true,1,,,,,L'ETANG DU MERLE,58330,CRUX-LA-VILLE,,,58092,,,,,,,,,,,,,,,,,,,2001-12-31,F,,,,,74.1J,NAF1993,N,3.495502,47.137731,0.84,street,Etang du Merle 58330 Crux-la-Ville,58092_B160,G,ETANG DU MERLE,
339967622,00038,33996762200038,O,,,,,2019-11-14T14:00:46,true,1,,,,,LA BERLE,58330,CRUX-LA-VILLE,,,58092,,,,,,,,,,,,,,,,,,,1992-06-23,F,,,,,45.2V,NAF1993,N,3.506335,47.14886,0.94,street,La Berle 58330 Crux-la-Ville,58092_owkg3h,G,LA BERLE,
341779544,00012,34177954400012,O,,NN,,,2019-11-14T14:00:46,true,1,,,,,MOULIN D ARON,58330,CRUX-LA-VILLE,,,58092,,,,,,,,,,,,,,,,,,,1988-06-30,F,,,,,57.01,NAP,N,3.510983,47.180607,0.93,street,Le Moulin d’Aron 58330 Crux-la-Ville,58092_B238,G,LE MOULIN D ARON,
343538955,00018,34353895500018,O,1987-09-01,NN,,,2019-11-14T14:00:46,true,3,,,,,CHALLUEE,58330,CRUX-LA-VILLE,,,58092,,,,,,,,,,,,,,,,,,,2008-01-01,A,,,,,68.20B,NAFRev2,N,3.510274,47.177203,0.94,street,Challuee 58330 Crux-la-Ville,58092_jvu7hi,G,CHALLUEE,
343540407,00016,34354040700016,O,1987-02-13,,,,2019-11-14T14:00:46,true,3,,,,,LE LAUDAS,58330,CRUX-LA-VILLE,,,58092,,,,,,,,,,,,,,,,,,,1995-12-25,F,,,,,01.2A,NAF1993,N,3.549949,47.172135,0.66,street,Le Landas 58330 Crux-la-Ville,58092_r37avj,G,LE LANDAS,
348414004,00013,34841400400013,O,1988-07-01,01,2020,,2022-08-29T09:30:31,true,4,,,,,LE MOULIN D ARON,58330,CRUX-LA-VILLE,,,58092,,,,,,,,,,,,,,,,,,,2008-01-01,A,,,,,47.11B,NAFRev2,O,3.510983,47.180607,0.94,street,Le Moulin d’Aron 58330 Crux-la-Ville,58092_B238,G,LE MOULIN D ARON,
349700450,00019,34970045000019,O,1989-01-01,NN,,,2019-11-14T14:00:46,true,3,,,,,MOURRY,58330,CRUX-LA-VILLE,,,58092,,,,,,,,,,,,,,,,,,,2008-01-01,A,,,,,01.42Z,NAFRev2,N,3.547762,47.176207,0.94,street,Mourry 58330 Crux-la-Ville,58092_elsiup,G,MOURRY,
349968065,00020,34996806500020,O,,NN,,,2019-11-14T14:00:46,true,1,,,,,ETANG DU MERLE,58330,CRUX-LA-VILLE,,,58092,,,,,,,,,,,,,,,,,,,1993-01-06,F,,,,,55.2C,NAF1993,O,3.495502,47.137731,0.93,street,Etang du Merle 58330 Crux-la-Ville,58092_B160,G,ETANG DU MERLE,
350708129,00027,35070812900027,O,1999-02-02,NN,,,2019-11-14T14:00:46,false,4,,,,,LE BOURG,58330,CRUX-LA-VILLE,,,58092,,,,,,,,,,,,,,,,,,,2002-09-03,F,,,,,15.8C,NAF1993,O,3.519775,47.160662,0.94,street,Le Bourg 58330 Crux-la-Ville,58092_pfl4bp,G,LE BOURG,
356000265,02068,35600026502068,O,1991-01-01,NN,,,2019-11-14T14:00:46,false,3,,,,PL,EGLISE,58330,CRUX-LA-VILLE,,,58092,,,,,,,,,,,,,,,,,,,2006-06-01,F,BUREAU DE POSTE,,,,64.1A,NAFRev1,O,-1.1676989,44.0766928,0.8,poi.park,Place de l'Église (Parc) Mézos,https://osm.org/way/37053988,G,,
380166587,00010,38016658700010,O,1990-05-01,NN,,,2019-11-14T14:00:46,false,3,LES PETITS MAUROIS,,,,LES PETITS MAUROIS,58330,CRUX-LA-VILLE,,,58092,,,,,,,,,,,,,,,,,,,2008-01-01,A,,,,,01.45Z,NAFRev2,N,3.539749,47.144382,0.63,street,Les Maurois 58330 Crux-la-Ville,58092_tl8qsm,G,LES MAUROIS,
380166587,00028,38016658700028,O,1993-01-02,NN,,0162ZP,2019-11-14T14:00:46,true,5,,,,,LES MAUROIS,58330,CRUX-LA-VILLE,,,58092,,,,,,,,,,,,,,,,,,,2008-01-01,A,,,,,85.51Z,NAFRev2,N,3.539749,47.144382,0.93,street,Les Maurois 58330 Crux-la-Ville,58092_tl8qsm,G,LES MAUROIS,
382593242,00011,38259324200011,O,1991-04-01,NN,,,2019-11-14T14:00:46,false,4,,,,,CHALLUEE,58330,CRUX-LA-VILLE,,,58092,,,,,,,,,,,,,,,,,,,2002-10-26,F,,,,,92.3A,NAF1993,N,3.510274,47.177203,0.94,street,Challuee 58330 Crux-la-Ville,58092_jvu7hi,G,CHALLUEE,
382926889,00025,38292688900025,O,2005-01-01,,,4321AB,2022-10-05T03:53:19,true,3,,,,,BICHEROLLES,58330,CRUX-LA-VILLE,,,58092,,,,,,,,,,,,,,,,,,,2022-09-30,F,,,,,43.21A,NAFRev2,N,3.563866,47.128243,0.94,street,Bicherolles 58330 Crux-la-Ville,58092_vxpzt5,G,BICHEROLLES,
383010907,00012,38301090700012,O,,,,,2019-11-14T14:00:46,true,1,,,,,LE MERLE,58330,CRUX-LA-VILLE,,,58092,,,,,,,,,,,,,,,,,,,1992-12-01,F,,,,,70.3A,NAF1993,N,3.499932,47.137891,0.8,street,Le Hameau du Merle 58330 Crux-la-Ville,58092_0250,G,LE HAMEAU DU MERLE,
385150362,00015,38515036200015,O,1992-03-01,NN,,,2019-11-14T14:00:46,true,3,,,,,,58330,CRUX-LA-VILLE,,,58092,,,,,,,,,,,,,,,,,,,2008-01-01,A,,,,,01.42Z,NAFRev2,N,,,0,,,,,,
385195110,00015,38519511000015,O,1992-03-01,01,2020,,2022-08-29T09:12:08,true,3,,,,,MOURRY,58330,CRUX-LA-VILLE,,,58092,,,,,,,,,,,,,,,,,,,2008-01-01,A,,,,,01.42Z,NAFRev2,N,3.547762,47.176207,0.94,street,Mourry 58330 Crux-la-Ville,58092_elsiup,G,MOURRY,
389770819,00024,38977081900024,O,1994-04-01,NN,,,2019-11-14T14:00:46,false,4,,,,,LE BOURG,58330,CRUX-LA-VILLE,,,58092,,,,,,,,,,,,,,,,,,,2004-12-31,F,,,,,51.1R,NAFRev1,N,3.519775,47.160662,0.94,street,Le Bourg 58330 Crux-la-Ville,58092_pfl4bp,G,LE BOURG,
390662740,00013,39066274000013,O,1993-02-20,NN,,,2019-11-14T14:00:46,false,4,,,,,LE LANDAS,58330,CRUX-LA-VILLE,,,58092,,,,,,,,,,,,,,,,,,,1996-12-25,F,,,,,01.2A,NAF1993,N,3.549949,47.172135,0.94,street,Le Landas 58330 Crux-la-Ville,58092_r37avj,G,LE LANDAS,
390688109,00011,39068810900011,O,1991-01-01,NN,,,2021-02-23T11:16:35,true,4,,,,,MARMANTRAY,58330,CRUX-LA-VILLE,,,58092,,,,,,,,,,,,,,,,,,,2008-01-01,A,,,,,68.20B,NAFRev2,N,3.568861,47.136911,0.95,street,Marmantray 58330 Crux-la-Ville,58092_9aip3j,G,MARMANTRAY,
390842243,00011,39084224300011,O,,NN,,,2019-11-14T14:00:46,true,1,,,,LD,LIGNY,58330,CRUX-LA-VILLE,,,58092,,,,,,,,,,,,,,,,,,,1993-09-30,F,,,,,52.6E,NAF1993,N,3.508947,47.144204,0.95,street,Ligny 58330 Crux-la-Ville,58092_7sqrkl,G,LIGNY,
391550605,00011,39155060500011,O,1993-05-18,NN,,,2022-02-16T04:05:53,true,3,,,,,MAIRIE,58330,CRUX-LA-VILLE,,,58092,,,,,,,,,,,,,,,,,,,2008-01-01,A,,,,,77.31Z,NAFRev2,N,3.0709671,50.6304695,0.92,poi.townhall,Hôtel de Ville Lille,https://osm.org/way/40917078,G,,
392188231,00014,39218823100014,O,1993-07-01,NN,,,2019-11-14T14:00:46,true,4,,,,,LES CHAUMES COTTET,58330,CRUX-LA-VILLE,,,58092,,,,,,,,,,,,,,,,,,,2008-01-01,A,,,,,01.50Z,NAFRev2,N,3.515135,47.133202,0.94,street,Les Chaumes Cottet 58330 Crux-la-Ville,58092_0115,G,LES CHAUMES COTTET,
392619839,00013,39261983900013,O,,NN,,,2019-11-14T14:00:46,true,1,,,,,,58330,CRUX-LA-VILLE,,,58092,,,,,,,,,,,,,,,,,,,1995-03-02,F,,,,,67.1E,NAF1993,N,,,0,,,,,,
393476171,00037,39347617100037,O,2012-06-01,,,,2019-11-14T14:00:46,true,2,,,,,MENETREUIL,58330,CRUX-LA-VILLE,,,58092,,,,,,,,,,,,,,,,,,,2014-03-15,F,,,,,58.11Z,NAFRev2,N,3.510108,47.137864,0.93,street,Grand Menetreuil 58330 Crux-la-Ville,58092_B183,G,GRAND MENETREUIL,
393840905,00037,39384090500037,O,1996-09-01,NN,,,2019-11-14T14:00:46,true,1,,,,LD,LA GRAND FONTAINE,58330,CRUX-LA-VILLE,,,58092,,,,,,,,,,,,,,,,,,,1999-12-20,F,,,,,45.4J,NAF1993,N,3.523397,47.161563,0.93,street,Rue de la Grand’Fontaine 58330 Crux-la-Ville,58092_0210,G,RUE DE LA GRAND FONTAINE,
393957014,00011,39395701400011,O,1993-12-03,NN,,,2019-11-14T14:00:46,true,3,,,,,LA CURE DU BERLE,58330,CRUX-LA-VILLE,,,58092,,,,,,,,,,,,,,,,,,,2008-01-01,A,,,,,68.20B,NAFRev2,N,3.505747,47.147654,0.6,street,Chemin Maisons du Bois au Berle 58330 Crux-la-Ville,58092_0230,G,CHEMIN MAISONS DU BOIS AU BERLE,
394639967,00014,39463996700014,O,1994-04-01,01,2020,1061AZ,2022-08-29T09:18:19,true,4,,,,LD,MOULIN D ARON,58330,CRUX-LA-VILLE,,,58092,,,,,,,,,,,,,,,,,,,2008-01-01,A,,,,,10.61A,NAFRev2,O,3.510983,47.180607,0.93,street,Le Moulin d’Aron 58330 Crux-la-Ville,58092_B238,G,LE MOULIN D ARON,
397686452,00012,39768645200012,O,1994-06-10,NN,,,2019-11-14T14:00:46,true,3,,,,,LA CURE DU BERLE,58330,CRUX-LA-VILLE,,,58092,,,,,,,,,,,,,,,,,,,2008-01-01,A,,,,,73.11Z,NAFRev2,N,3.505747,47.147654,0.6,street,Chemin Maisons du Bois au Berle 58330 Crux-la-Ville,58092_0230,G,CHEMIN MAISONS DU BOIS AU BERLE,
398911750,00014,39891175000014,O,1994-11-01,NN,,,2019-11-14T14:00:46,true,3,,,,,CLOISEAU,58330,CRUX-LA-VILLE,,,58092,,,,,,,,,,,,,,,,,,,2008-01-01,A,,,,,01.42Z,NAFRev2,N,3.505008,47.169571,0.94,street,Cloiseau 58330 Crux-la-Ville,58092_trv5zw,G,CLOISEAU,
398911750,00022,39891175000022,O,1994-11-01,NN,,,2019-11-14T14:00:46,false,3,,,,,CLOISEAU,58330,CRUX-LA-VILLE,,,58092,,,,,,,,,,,,,,,,,,,1997-12-31,F,,,,,01.1A,NAF1993,N,3.505008,47.169571,0.94,street,Cloiseau 58330 Crux-la-Ville,58092_trv5zw,G,CLOISEAU,
399623693,00013,39962369300013,O,1995-01-17,NN,,,2019-11-14T14:00:46,true,3,,,,,LES FAUX,58330,CRUX-LA-VILLE,,,58092,,,,,,,,,,,,,,,,,,,2008-01-01,A,,,,,01.42Z,NAFRev2,N,3.546964,47.153915,0.95,street,Les Faux 58330 Crux-la-Ville,58092_codxuv,G,LES FAUX,
400918108,00012,40091810800012,O,1994-04-01,NN,,,2019-11-14T14:00:46,true,1,,,,,,58330,CRUX-LA-VILLE,,,58092,,,,,,,,,,,,,,,,,,,2002-01-07,F,,,,,70.2C,NAF1993,N,,,0,,,,,,
400920021,00013,40092002100013,O,1994-01-01,NN,,,2019-11-14T14:00:46,true,3,BRIOTTE,,,,,58330,CRUX-LA-VILLE,,,58092,,,,,,,,,,,,,,,,,,,2008-01-01,A,,,,,02.10Z,NAFRev2,N,3.515135,47.133202,0.34,street,Les Chaumes Cottet 58330 Crux-la-Ville,58092_0115,D,LES CHAUMES COTTET,
401146766,00019,40114676600019,O,1995-05-25,NN,,,2019-11-14T14:00:46,true,1,,,,LD,L'ETANG DU MERLE,58330,CRUX-LA-VILLE,,,58092,,,,,,,,,,,,,,,,,,,2002-01-01,F,,,,,55.2C,NAF1993,N,3.495502,47.137731,0.84,street,Etang du Merle 58330 Crux-la-Ville,58092_B160,G,ETANG DU MERLE,
401992318,00014,40199231800014,O,1995-08-07,NN,,,2019-11-14T14:00:46,true,1,,,,,,58330,CRUX-LA-VILLE,,,58092,,,,,,,,,,,,,,,,,,,1998-12-12,F,,,,,51.6G,NAF1993,O,,,0,,,,,,
402508907,00019,40250890700019,O,,NN,,,2019-11-14T14:00:46,true,1,,,,HAM,PETIT MENETREUIL,58330,CRUX-LA-VILLE,,,58092,,,,,,,,,,,,,,,,,,,1996-02-29,F,,,,,45.4F,NAF1993,N,3.510492,47.135025,0.94,street,Petit Menetreuil 58330 Crux-la-Ville,58092_B279,G,PETIT MENETREUIL,
403399934,00013,40339993400013,O,1995-10-03,NN,,,2019-11-14T14:00:46,false,4,,,,,LE BOURG,58330,CRUX-LA-VILLE,,,58092,,,,,,,,,,,,,,,,,,,1999-02-01,F,,,,,15.8C,NAF1993,O,3.519775,47.160662,0.94,street,Le Bourg 58330 Crux-la-Ville,58092_pfl4bp,G,LE BOURG,
404824260,00024,40482426000024,O,2015-04-30,,,,2021-10-01T08:43:01,true,2,,,,,MENETREUIL,58330,CRUX-LA-VILLE,,,58092,,,,,,,,,,,,,,,,,,,2021-10-01,F,,,,,86.90F,NAFRev2,N,3.510108,47.137864,0.93,street,Grand Menetreuil 58330 Crux-la-Ville,58092_B183,G,GRAND MENETREUIL,
407871631,00021,40787163100021,O,1997-09-01,NN,,,2019-11-14T14:00:46,false,4,,,,LD,L'HUIS GIGOT,58330,CRUX-LA-VILLE,,,58092,,,,,,,,,,,,,,,,,,,2004-03-26,F,,,,,80.4D,NAFRev1,N,3.56459,47.135265,0.94,street,L’Huis Gigot 58330 Crux-la-Ville,58092_B217,G,L HUIS GIGOT,
409596707,00011,40959670700011,O,1996-10-25,NN,,,2019-11-14T14:00:46,true,3,CHEZ MR GIRARD FRANCOIS,,,,LA PALLUD,58330,CRUX-LA-VILLE,,,58092,,,,,,,,,,,,,,,,,,,2008-01-01,A,,,,,77.31Z,NAFRev2,N,3.510274,47.177203,0.46,street,Challuee 58330 Crux-la-Ville,58092_jvu7hi,G,CHALLUEE,
410028245,00018,41002824500018,O,,NN,,,2019-11-14T14:00:46,true,1,,,,,LES CHAUMES COTTET,58330,CRUX-LA-VILLE,,,58092,,,,,,,,,,,,,,,,,,,1997-12-31,F,,,,,01.1A,NAF1993,N,3.515135,47.133202,0.94,street,Les Chaumes Cottet 58330 Crux-la-Ville,58092_0115,G,LES CHAUMES COTTET,
410028252,00014,41002825200014,O,1984-12-31,NN,,,2019-11-14T14:00:46,true,1,,,,,LE PRE ROND,58330,CRUX-LA-VILLE,,,58092,,,,,,,,,,,,,,,,,,,2000-12-31,F,,,,,01.1A,NAF1993,N,3.569836,47.143729,0.93,street,Le Pre Rond 58330 Crux-la-Ville,58092_B327,G,LE PRE ROND,
410028260,00017,41002826000017,O,1984-12-31,NN,,,2019-11-14T14:00:46,true,5,,,,,MARMANTRAY,58330,CRUX-LA-VILLE,,,58092,,,,,,,,,,,,,,,,,,,2009-06-30,F,,,,,01.42Z,NAFRev2,N,3.568861,47.136911,0.95,street,Marmantray 58330 Crux-la-Ville,58092_9aip3j,G,MARMANTRAY,
410028278,00019,41002827800019,O,1984-12-31,NN,,,2019-11-14T14:00:46,true,5,,,,,AUTREVELLE,58330,CRUX-LA-VILLE,,,58092,,,,,,,,,,,,,,,,,,,2009-03-15,F,,,,,01.42Z,NAFRev2,N,3.521918,47.160457,0.92,street,Rue de l’Autrevelle 58330 Crux-la-Ville,58092_0030,G,RUE DE L AUTREVELLE,
410028286,00012,41002828600012,O,1991-12-31,NN,,,2019-11-14T14:00:46,true,4,,,,,MONTPILLARD,58330,CRUX-LA-VILLE,,,58092,,,,,,,,,,,,,,,,,,,2011-02-21,F,,,,,01.42Z,NAFRev2,N,3.527795,47.130369,0.95,street,Montpillard 58330 Crux-la-Ville,58092_mlchjc,G,MONTPILLARD,
410028294,00016,41002829400016,O,1990-01-01,NN,,,2019-11-14T14:00:46,true,4,,,,,L HUIS GIGOT,58330,CRUX-LA-VILLE,,,58092,,,,,,,,,,,,,,,,,,,2006-11-25,F,,,,,01.2A,NAFRev1,N,3.56459,47.135265,0.94,street,L’Huis Gigot 58330 Crux-la-Ville,58092_B217,G,L HUIS GIGOT,
410028302,00017,41002830200017,O,1987-12-31,NN,,,2019-11-14T14:00:46,true,1,,,,,MONTPILLARD,58330,CRUX-LA-VILLE,,,58092,,,,,,,,,,,,,,,,,,,1996-12-31,F,,,,,01.1A,NAF1993,N,3.527795,47.130369,0.95,street,Montpillard 58330 Crux-la-Ville,58092_mlchjc,G,MONTPILLARD,
410028310,00010,41002831000010,O,1995-01-01,NN,,,2019-11-14T14:00:46,true,1,,,,,LES PERRIERES,58330,CRUX-LA-VILLE,,,58092,,,,,,,,,,,,,,,,,,,1999-11-30,F,,,,,55.2E,NAF1993,N,3.526123,47.18405,0.94,street,Les Perrieres 58330 Crux-la-Ville,58092_ud0anx,G,LES PERRIERES,
410028328,00012,41002832800012,O,1995-10-01,NN,,,2019-11-14T14:00:46,true,3,,,,,CLOISEAU,58330,CRUX-LA-VILLE,,,58092,,,,,,,,,,,,,,,,,,,2008-01-01,A,,,,,01.45Z,NAFRev2,N,3.505008,47.169571,0.94,street,Cloiseau 58330 Crux-la-Ville,58092_trv5zw,G,CLOISEAU,
410441307,00023,41044130700023,O,2002-01-01,NN,,,2019-11-14T14:00:46,false,6,,,,,L'ETANG DU MERLE,58330,CRUX-LA-VILLE,,,58092,,,,,,,,,,,,,,,,,,,2017-01-03,F,AQUADIS,,,,55.30Z,NAFRev2,N,3.495502,47.137731,0.84,street,Etang du Merle 58330 Crux-la-Ville,58092_B160,G,ETANG DU MERLE,
411925571,00019,41192557100019,O,1997-01-01,NN,,,2019-11-14T14:00:46,true,4,LE JONC,,,,DOMAINE DE JONC,58330,CRUX-LA-VILLE,,,58092,,,,,,,,,,,,,,,,,,,2005-12-31,F,,,,,01.2A,NAFRev1,N,3.555308,47.164946,0.41,street,Le Jonc 58330 Crux-la-Ville,58092_mufud4,G,LE JONC,
412333981,00014,41233398100014,O,1984-12-31,NN,,,2021-02-23T11:34:40,true,3,,,,,LA PALLUD,58330,CRUX-LA-VILLE,,,58092,,,,,,,,,,,,,,,,,,,2008-01-01,A,,,,,01.11Z,NAFRev2,N,3.510274,47.177203,0.46,street,Challuee 58330 Crux-la-Ville,58092_jvu7hi,G,CHALLUEE,
412333999,00016,41233399900016,O,1984-12-31,NN,,,2019-11-14T14:00:46,true,1,,,,,CHALLUEE,58330,CRUX-LA-VILLE,,,58092,,,,,,,,,,,,,,,,,,,1998-05-31,F,,,,,01.1A,NAF1993,N,3.510274,47.177203,0.94,street,Challuee 58330 Crux-la-Ville,58092_jvu7hi,G,CHALLUEE,
413030867,00035,41303086700035,O,2014-05-13,,,,2019-11-14T14:00:46,true,2,,,,,,58330,CRUX-LA-VILLE,,,58092,,,,,,,,,,,,,,,,,,,2017-05-01,F,,,,,46.19B,NAFRev2,N,,,0,,,,,,
413605205,00017,41360520500017,O,1997-06-17,NN,,,2019-11-14T14:00:46,true,1,,,,,MARMANTRAY,58330,CRUX-LA-VILLE,,,58092,,,,,,,,,,,,,,,,,,,1998-12-31,F,,,,,74.5A,NAF1993,N,3.568861,47.136911,0.95,street,Marmantray 58330 Crux-la-Ville,58092_9aip3j,G,MARMANTRAY,
414257725,00013,41425772500013,O,1997-09-15,NN,,,2019-11-14T14:00:46,false,3,,,,,LES RAVEES,58330,CRUX-LA-VILLE,,,58092,,,,,,,,,,,,,,,,,,,2003-12-31,F,,,,,01.2J,NAFRev1,N,3.506994,47.148647,0.94,street,Les Ravees 58330 Crux-la-Ville,58092_yuv1em,G,LES RAVEES,
417529039,00014,41752903900014,O,1998-01-01,NN,,,2019-11-14T14:00:46,true,4,,,,,LES CHAUMES COTTET,58330,CRUX-LA-VILLE,,,58092,,,,,,,,,,,,,,,,,,,2012-12-31,F,,,,,01.45Z,NAFRev2,N,3.515135,47.133202,0.94,street,Les Chaumes Cottet 58330 Crux-la-Ville,58092_0115,G,LES CHAUMES COTTET,
422142885,00017,42214288500017,O,1999-04-08,NN,,4932ZA,2019-11-14T14:00:46,true,6,,,,,,58330,CRUX-LA-VILLE,,,58092,,,,,,,,,,,,,,,,,,,2018-10-30,F,,,,,49.32Z,NAFRev2,N,,,0,,,,,,
422184747,00018,42218474700018,O,1999-02-01,NN,,,2019-11-14T14:00:46,false,4,,,,,LA MELOISE,58330,CRUX-LA-VILLE,,,58092,,,,,,,,,,,,,,,,,,,2000-12-25,F,,,,,91.3E,NAF1993,O,3.542541,47.163713,0.94,street,La Meloise 58330 Crux-la-Ville,58092_m0ybkv,G,LA MELOISE,