siren,nic,siret,statutDiffusionEtablissement,dateCreationEtablissement,trancheEffectifsEtablissement,anneeEffectifsEtablissement,activitePrincipaleRegistreMetiersEtablissement,dateDernierTraitementEtablissement,etablissementSiege,nombrePeriodesEtablissement,complementAdresseEtablissement,numeroVoieEtablissement,indiceRepetitionEtablissement,typeVoieEtablissement,libelleVoieEtablissement,codePostalEtablissement,libelleCommuneEtablissement,libelleCommuneEtrangerEtablissement,distributionSpecialeEtablissement,codeCommuneEtablissement,codeCedexEtablissement,libelleCedexEtablissement,codePaysEtrangerEtablissement,libellePaysEtrangerEtablissement,complementAdresse2Etablissement,numeroVoie2Etablissement,indiceRepetition2Etablissement,typeVoie2Etablissement,libelleVoie2Etablissement,codePostal2Etablissement,libelleCommune2Etablissement,libelleCommuneEtranger2Etablissement,distributionSpeciale2Etablissement,codeCommune2Etablissement,codeCedex2Etablissement,libelleCedex2Etablissement,codePaysEtranger2Etablissement,libellePaysEtranger2Etablissement,dateDebut,etatAdministratifEtablissement,enseigne1Etablissement,enseigne2Etablissement,enseigne3Etablissement,denominationUsuelleEtablissement,activitePrincipaleEtablissement,nomenclatureActivitePrincipaleEtablissement,caractereEmployeurEtablissement,longitude,latitude,geo_score,geo_type,geo_adresse,geo_id,geo_ligne,geo_l4,geo_l5
216206748,00016,21620674800016,O,1983-03-01,03,2020,,2022-08-29T09:08:14,true,4,,51,,RUE,DE L EGLISE,62500,QUELMES,,,62674,,,,,,,,,,,,,,,,,,,2008-01-01,A,MAIRIE,,,,84.11Z,NAFRev2,O,2.136997,50.732953,0.95,housenumber,51 Rue de l’Eglise 62500 Quelmes,62674_0025_00051,G,51 RUE DE L EGLISE,
216206748,00024,21620674800024,O,1983-12-21,02,2020,,2022-08-29T09:08:14,false,3,,51,,RUE,DE L EGLISE,62500,QUELMES,,,62674,,,,,,,,,,,,,,,,,,,2008-01-01,A,ECOLE PRIMAIRE PUBLIQUE,,,,85.20Z,NAFRev2,N,2.136997,50.732953,0.95,housenumber,51 Rue de l’Eglise 62500 Quelmes,62674_0025_00051,G,51 RUE DE L EGLISE,
266206747,00013,26620674700013,O,1983-03-01,NN,,,2017-08-06T14:15:21,true,4,MAIRIE,,,,,62500,QUELMES,,,62674,,,,,,,,,,,,,,,,,,,2017-08-01,F,CCAS,,,,88.99B,NAFRev2,N,,,0,,,,,,
303738561,00016,30373856100016,O,,NN,,,,true,1,,,,LD,LA VERNOVE,62500,QUELMES,,,62674,,,,,,,,,,,,,,,,,,,1992-12-25,F,,,,,01.4A,NAF1993,N,,,0,,,,,,
304302920,00018,30430292000018,O,1991-01-01,NN,,,2008-01-04T19:29:28,true,3,,182,,RUE,VERTE,62500,QUELMES,,,62674,,,,,,,,,,,,,,,,,,,2008-01-01,A,,,,,47.99A,NAFRev2,N,2.140972,50.731938,0.95,housenumber,182 Rue Verte 62500 Quelmes,62674_0062_00182,G,182 RUE VERTE,
305982837,00026,30598283700026,O,1900-01-01,NN,,,2014-07-08T00:13:13,true,5,,,,RTE,D ACQUIN,62500,QUELMES,,,62674,,,,,,,,,,,,,,,,,,,2011-04-30,F,,,,,43.91B,NAFRev2,O,2.129457,50.735084,0.81,street,Route d’Acquin 62500 Quelmes,62674_0005,G,ROUTE D ACQUIN,
306114281,00018,30611428100018,O,,NN,,,,true,1,,,,,,62500,QUELMES,,,62674,,,,,,,,,,,,,,,,,,,1991-10-30,F,,,,,01.1A,NAF1993,N,,,0,,,,,,
313738825,00014,31373882500014,O,,,,,,true,1,,6,,RUE,VERTE,62500,QUELMES,,,62674,,,,,,,,,,,,,,,,,,,1985-12-25,F,,,,,65.06,NAP,N,2.142523,50.732774,0.81,street,Rue Verte 62500 Quelmes,62674_0062,G,RUE VERTE,
315209759,00010,31520975900010,O,1979-01-01,NN,,,2008-11-07T00:30:36,true,3,,277,,RTE,DE SAINT OMER,62500,QUELMES,,,62674,,,,,,,,,,,,,,,,,,,2004-08-04,F,,,,,45.4C,NAFRev1,N,2.141416,50.734738,0.87,housenumber,277 Route de Saint Omer 62500 Quelmes,62674_0055_00277,G,277 ROUTE DE SAINT OMER,
315209791,00013,31520979100013,O,1979-01-01,NN,,4332AA,2019-06-24T13:18:44,true,5,,277,,RTE,DE SAINT OMER,62500,QUELMES,,,62674,,,,,,,,,,,,,,,,,,,2017-02-28,F,,,,,43.32A,NAFRev2,O,2.141416,50.734738,0.87,housenumber,277 Route de Saint Omer 62500 Quelmes,62674_0055_00277,G,277 ROUTE DE SAINT OMER,
315214890,00016,31521489000016,O,1900-01-01,NN,,,2009-10-24T04:02:50,true,4,,277,,RTE,DE SAINT OMER,62500,QUELMES,,,62674,,,,,,,,,,,,,,,,,,,2004-08-04,F,,,,,45.4C,NAFRev1,O,2.141416,50.734738,0.87,housenumber,277 Route de Saint Omer 62500 Quelmes,62674_0055_00277,G,277 ROUTE DE SAINT OMER,
321807240,00015,32180724000015,O,,,,,,true,1,,6,,RUE,VERTE,62500,QUELMES,,,62674,,,,,,,,,,,,,,,,,,,1985-12-25,F,,,,,00.10,NAP,N,2.142523,50.732774,0.81,street,Rue Verte 62500 Quelmes,62674_0062,G,RUE VERTE,
325595809,00030,32559580900030,O,2013-07-01,NN,,,2021-10-27T08:24:42,true,3,,199,,RTE,D ACQUIN,62500,QUELMES,,,62674,,,,,,,,,,,,,,,,,,,2019-05-31,F,,,,ENTREPRISE INDIVIDUELLE DU BATIMENT,43.39Z,NAFRev2,O,2.132103,50.734153,0.84,housenumber,199 Route d’Acquin 62500 Quelmes,62674_0005_00199,G,199 ROUTE D ACQUIN,
326715067,00012,32671506700012,O,1983-01-15,NN,,,2020-12-16T03:48:21,true,3,,,,,,62500,QUELMES,,,62674,,,,,,,,,,,,,,,,,,,2008-01-01,A,,,,,01.11Z,NAFRev2,N,,,0,,,,,,
328339056,00025,32833905600025,O,1993-07-01,01,2020,,2022-08-29T09:20:18,false,4,,,,,LIEU DIT FONDS AUDENCTHUN,62500,QUELMES,,,62674,,,,,,,,,,,,,,,,,,,2008-01-01,A,,,,,46.76Z,NAFRev2,N,,,0,,,,,,
328580394,00026,32858039400026,O,1987-11-12,11,2020,1413ZB,2022-08-29T09:20:26,true,8,,525,,RUE,DE LA PLACE,62500,QUELMES,,,62674,,,,,,,,,,,,,,,,,,,2020-01-01,A,,,,AFATEX,14.13Z,NAFRev2,O,2.139332,50.730681,0.95,housenumber,525 Rue de la Place 62500 Quelmes,62674_0030_00525,G,525 RUE DE LA PLACE,
331179614,00010,33117961400010,O,1984-11-01,NN,,,2008-01-04T20:08:59,true,3,,127,,RUE,DE L EGLISE,62500,QUELMES,,,62674,,,,,,,,,,,,,,,,,,,2008-01-01,A,,,,,56.30Z,NAFRev2,N,2.138023,50.733066,0.95,housenumber,127 Rue de l’Eglise 62500 Quelmes,62674_0025_00127,G,127 RUE DE L EGLISE,
331207787,00010,33120778700010,O,1984-06-30,,,,2013-05-17T19:38:54,true,3,,,,,,62500,QUELMES,,,62674,,,,,,,,,,,,,,,,,,,2008-01-01,A,,,,,01.11Z,NAFRev2,N,,,0,,,,,,
332962315,00021,33296231500021,O,1987-10-30,NN,,,2006-12-15T00:26:44,false,5,LIEUDIT LE VILLAGE,525,,RUE,DE LA PLACE,62500,QUELMES,,,62674,,,,,,,,,,,,,,,,,,,2004-07-09,F,,,,,18.2E,NAFRev1,O,2.139332,50.730681,0.95,housenumber,525 Rue de la Place 62500 Quelmes,62674_0030_00525,G,525 RUE DE LA PLACE,
333100915,00011,33310091500011,O,1985-07-17,NN,,,2008-04-05T00:35:32,true,3,,,,HAM,DE LA VERNOYE,62500,QUELMES,,,62674,,,,,,,,,,,,,,,,,,,2008-01-01,A,,,,,41.10D,NAFRev2,N,2.13714,50.732216,0.42,street,Rue de la Place 62500 Quelmes,62674_0030,G,RUE DE LA PLACE,
340607480,00019,34060748000019,O,1986-12-31,NN,,,2008-01-04T21:43:54,true,3,,,,HAM,DE LA VERNOVE,62500,QUELMES,,,62674,,,,,,,,,,,,,,,,,,,2008-01-01,A,,,,,68.20A,NAFRev2,N,2.13714,50.732216,0.42,street,Rue de la Place 62500 Quelmes,62674_0030,G,RUE DE LA PLACE,
341380798,00015,34138079800015,O,,NN,,,,true,1,,15,,RUE,DE ST OMER,62500,QUELMES,,,62674,,,,,,,,,,,,,,,,,,,1987-12-31,F,,,,,67.13,NAP,N,2.140841,50.734645,0.7,housenumber,15 Route de Saint Omer 62500 Quelmes,62674_0055_00015,G,15 ROUTE DE SAINT OMER,
342669207,00017,34266920700017,O,1987-09-29,NN,,,2008-01-04T22:06:34,true,3,,,,,AU LIEUDIT LE VILLAGE,62500,QUELMES,,,62674,,,,,,,,,,,,,,,,,,,2008-01-01,A,,,,,68.20A,NAFRev2,N,,,0,,,,,,
342678687,00019,34267868700019,O,1987-09-07,NN,,,2013-12-09T04:17:37,true,3,,,,HAM,DE LA VERNOVE,62500,QUELMES,,,62674,,,,,,,,,,,,,,,,,,,2008-01-01,A,,,,,68.20A,NAFRev2,N,2.13714,50.732216,0.42,street,Rue de la Place 62500 Quelmes,62674_0030,G,RUE DE LA PLACE,
343163226,00016,34316322600016,O,1987-07-01,,,,2008-01-04T22:12:13,true,4,,245,,RUE,DE L'EGLISE,62500,QUELMES,,,62674,,,,,,,,,,,,,,,,,,,2008-01-01,A,,,,,68.20B,NAFRev2,N,2.138924,50.73371,0.78,street,Rue de l’Eglise 62500 Quelmes,62674_0025,G,RUE DE L EGLISE,
343348900,00022,34334890000022,O,1999-09-30,NN,,,2009-01-19T20:24:49,true,3,,199,,RTE,D ACQUIN,62500,QUELMES,,,62674,,,,,,,,,,,,,,,,,,,2008-01-01,A,,,,,68.20A,NAFRev2,N,2.132103,50.734153,0.84,housenumber,199 Route d’Acquin 62500 Quelmes,62674_0005_00199,G,199 ROUTE D ACQUIN,
343352696,00011,34335269600011,O,,NN,,,,true,1,,,,,,62500,QUELMES,,,62674,,,,,,,,,,,,,,,,,,,1987-10-01,F,,,,,01.1A,NAF1993,N,,,0,,,,,,
344775259,00015,34477525900015,O,1988-01-08,NN,,,2008-01-04T22:32:24,true,3,,,,HAM,DE SERNOVE,62500,QUELMES,,,62674,,,,,,,,,,,,,,,,,,,2008-01-01,A,,,,,68.20A,NAFRev2,N,2.14302,50.734851,0.36,street,Route de Saint Omer 62500 Quelmes,62674_0055,G,ROUTE DE SAINT OMER,
345136865,00036,34513686500036,O,1999-09-30,NN,,,2008-01-05T19:37:17,true,3,,199,,RTE,D ACQUIN,62500,QUELMES,,,62674,,,,,,,,,,,,,,,,,,,2008-01-01,A,,,,,68.20B,NAFRev2,N,2.132103,50.734153,0.84,housenumber,199 Route d’Acquin 62500 Quelmes,62674_0005_00199,G,199 ROUTE D ACQUIN,
345257554,00013,34525755400013,O,1988-06-01,,,,2011-04-23T06:27:44,false,4,,86,,RUE,VERTE,62500,QUELMES,,,62674,,,,,,,,,,,,,,,,,,,2002-01-01,F,,,,,01.1A,NAF1993,N,2.140174,50.731482,0.95,housenumber,86 Rue Verte 62500 Quelmes,62674_0062_00086,G,86 RUE VERTE,
345257554,00021,34525755400021,O,2002-01-01,02,2020,,2022-08-29T09:29:41,true,4,,162,,RUE,VERTE,62500,QUELMES,,,62674,,,,,,,,,,,,,,,,,,,2010-12-31,A,,,,,01.11Z,NAFRev2,O,2.140555,50.731689,0.95,housenumber,162 Rue Verte 62500 Quelmes,62674_0062_00162,G,162 RUE VERTE,
345282776,00011,34528277600011,O,,NN,,,,true,1,,162,,RTE,,62500,QUELMES,,,62674,,,,,,,,,,,,,,,,,,,1996-03-07,F,,,,,28.1A,NAF1993,O,2.140543,50.736074,0.69,housenumber,162 Route de Zudausques 62500 Quelmes,62674_0065_00162,G,162 ROUTE DE ZUDAUSQUES,
349413328,00015,34941332800015,O,1989-01-02,NN,,,2016-06-07T04:36:04,true,3,,,,,HAMEAU DE LA VERNOVE,62500,QUELMES,,,62674,,,,,,,,,,,,,,,,,,,2008-01-01,A,,,,,68.20A,NAFRev2,N,2.13714,50.732216,0.31,street,Rue de la Place 62500 Quelmes,62674_0030,G,RUE DE LA PLACE,
349805945,00012,34980594500012,O,,NN,,,,true,1,,404,,RUE,DES BERCEAUX,62500,QUELMES,,,62674,,,,,,,,,,,,,,,,,,,1989-05-16,F,,,,,60.09,NAP,N,2.134919,50.734334,0.95,housenumber,404 Rue des Berceaux 62500 Quelmes,62674_0011_00404,G,404 RUE DES BERCEAUX,
353929466,00012,35392946600012,O,1990-01-03,NN,,,2012-01-17T10:59:43,false,4,,165,,RTE,D'ACQUIN,62500,QUELMES,,,62674,,,,,,,,,,,,,,,,,,,2011-12-31,F,ELVIA ASSURANCES,,,,66.22Z,NAFRev2,N,2.13221,50.73415,0.84,housenumber,165 Route d’Acquin 62500 Quelmes,62674_0005_00165,G,165 ROUTE D ACQUIN,
377561139,00017,37756113900017,O,1990-02-09,NN,,,2020-08-25T10:14:37,true,4,,2,,RUE,DE LA PLACE,62500,QUELMES,,,62674,,,,,,,,,,,,,,,,,,,2011-01-01,A,,,,,01.11Z,NAFRev2,N,2.134591,50.734198,0.95,housenumber,2 Rue de la Place 62500 Quelmes,62674_0030_00002,G,2 RUE DE LA PLACE,
383495793,00010,38349579300010,O,,NN,,,,true,1,,128,,RTE,ZUDAUSQUES,62500,QUELMES,,,62674,,,,,,,,,,,,,,,,,,,1993-03-31,F,,,,,51.4S,NAF1993,N,2.140544,50.735887,0.85,housenumber,128 Route de Zudausques 62500 Quelmes,62674_0065_00128,G,128 ROUTE DE ZUDAUSQUES,
387962681,00012,38796268100012,O,,NN,,,,true,1,,137,,RUE,DES BERCEAUX,62500,QUELMES,,,62674,,,,,,,,,,,,,,,,,,,1995-12-25,F,,,,,52.3E,NAF1993,N,2.137699,50.734617,0.79,street,Rue des Berceaux 62500 Quelmes,62674_0011,G,RUE DES BERCEAUX,
390642593,00011,39064259300011,O,1993-01-01,NN,,,2008-01-04T23:42:42,true,3,,,,,,62500,QUELMES,,,62674,,,,,,,,,,,,,,,,,,,2008-01-01,A,,,,,01.11Z,NAFRev2,N,,,0,,,,,,
391270469,00011,39127046900011,O,1976-01-01,NN,,,2017-05-05T03:47:10,true,4,,,,,,62500,QUELMES,,,62674,,,,,,,,,,,,,,,,,,,2016-12-31,F,,,,,01.45Z,NAFRev2,N,,,0,,,,,,
391281615,00016,39128161500016,O,1991-11-01,NN,,,2021-02-23T11:17:09,true,4,,162,,RUE,VERTE,62500,QUELMES,,,62674,,,,,,,,,,,,,,,,,,,2008-01-01,A,,,,,68.20B,NAFRev2,N,2.140555,50.731689,0.95,housenumber,162 Rue Verte 62500 Quelmes,62674_0062_00162,G,162 RUE VERTE,
392335394,00012,39233539400012,O,1970-04-01,NN,,,2019-08-02T09:44:46,true,2,,422,,RUE,DE LA PLACE,62500,QUELMES,,,62674,,,,,,,,,,,,,,,,,,,1999-01-31,F,,,,,,,,2.138135,50.731259,0.95,housenumber,422 Rue de la Place 62500 Quelmes,62674_0030_00422,G,422 RUE DE LA PLACE,
402997217,00011,40299721700011,O,1993-07-05,NN,,,2008-01-04T20:14:31,true,3,MAIRIE,51,,RUE,DE L'EGLISE,62500,QUELMES,,,62674,,,,,,,,,,,,,,,,,,,2008-01-01,A,,,,,94.99Z,NAFRev2,N,2.136997,50.732953,0.95,housenumber,51 Rue de l’Eglise 62500 Quelmes,62674_0025_00051,G,51 RUE DE L EGLISE,
404258741,00010,40425874100010,O,1969-01-01,NN,,,,true,3,,464,,RTE,D ACQUIN,62500,QUELMES,,,62674,,,,,,,,,,,,,,,,,,,2003-02-01,F,,,,,01.3Z,NAFRev1,N,2.128971,50.735561,0.84,housenumber,464 Route d’Acquin 62500 Quelmes,62674_0005_00464,G,464 ROUTE D ACQUIN,
404258758,00014,40425875800014,O,1977-04-01,NN,,,2009-06-27T08:02:51,true,3,,572,,RUE,D ACQUIN,62500,QUELMES,,,62674,,,,,,,,,,,,,,,,,,,2007-01-31,F,,,,,01.3Z,NAFRev1,N,2.127425,50.735226,0.79,housenumber,572 Route d’Acquin 62500 Quelmes,62674_0005_00572,G,572 ROUTE D ACQUIN,
408073054,00038,40807305400038,O,2005-02-14,NN,,,2008-11-08T01:19:32,true,2,,525,,RUE,DE LA PLACE,62500,QUELMES,,,62674,,,,,,,,,,,,,,,,,,,2005-11-01,F,,,,,18.2E,NAFRev1,O,2.139332,50.730681,0.95,housenumber,525 Rue de la Place 62500 Quelmes,62674_0030_00525,G,525 RUE DE LA PLACE,
413445040,00020,41344504000020,O,2002-09-21,NN,,,2006-12-15T01:07:07,false,4,,67,,CHE,DE LA PLANQUETTE,62500,QUELMES,,,62674,,,,,,,,,,,,,,,,,,,2004-11-14,F,,,,,85.1G,NAFRev1,N,2.130606,50.733674,0.86,housenumber,67 Chemin de la Planquette 62500 Quelmes,62674_0042_00067,G,67 CHEMIN DE LA PLANQUETTE,
413911017,00015,41391101700015,O,1997-08-06,,,,2011-09-09T15:26:32,true,3,,691,,RTE,D'ACQUIN,62500,QUELMES,,,62674,,,,,,,,,,,,,,,,,,,2003-11-17,F,,,,,51.6L,NAFRev1,N,2.125963,50.73487,0.84,housenumber,691 Route d’Acquin 62500 Quelmes,62674_0005_00691,G,691 ROUTE D ACQUIN,
414618371,00010,41461837100010,O,1997-09-30,NN,,,2011-01-12T05:52:33,false,3,,691,,RTE,D ACQUIN,62500,QUELMES,,,62674,,,,,,,,,,,,,,,,,,,2003-12-31,F,,,,,74.1J,NAFRev1,N,2.125963,50.73487,0.84,housenumber,691 Route d’Acquin 62500 Quelmes,62674_0005_00691,G,691 ROUTE D ACQUIN,
414618371,00036,41461837100036,O,2021-05-02,,,3109BA,2022-03-11T19:35:10,false,2,,691,,RTE,D'ACQUIN,62500,QUELMES,,,62674,,,,,,,,,,,,,,,,,,,2022-03-11,F,,,,REBERGUE FX,31.09B,NAFRev2,N,2.125963,50.73487,0.84,housenumber,691 Route d’Acquin 62500 Quelmes,62674_0005_00691,G,691 ROUTE D ACQUIN,
420816621,00015,42081662100015,O,1998-11-02,,,,,true,1,,251,,RUE,VERTE,62500,QUELMES,,,62674,,,,,,,,,,,,,,,,,,,1999-02-01,F,,,,,92.3H,NAF1993,N,2.141447,50.732571,0.95,housenumber,251 Rue Verte 62500 Quelmes,62674_0062_00251,G,251 RUE VERTE,
422060772,00015,42206077200015,O,1999-02-01,NN,,,2013-03-15T04:38:56,true,4,,422,,RUE,DE LA PLACE,62500,QUELMES,,,62674,,,,,,,,,,,,,,,,,,,2013-02-01,A,,,,,68.20B,NAFRev2,N,2.138135,50.731259,0.95,housenumber,422 Rue de la Place 62500 Quelmes,62674_0030_00422,G,422 RUE DE LA PLACE,
422364612,00016,42236461200016,O,1999-02-06,,,,,false,3,,365,,RUE,VERTE,62500,QUELMES,,,62674,,,,,,,,,,,,,,,,,,,1999-12-25,F,,,,,85.1C,NAF1993,N,2.142914,50.733053,0.95,housenumber,365 Rue Verte 62500 Quelmes,62674_0062_00365,G,365 RUE VERTE,
431438845,00015,43143884500015,O,1991-01-01,NN,,,2011-01-13T09:36:36,true,4,,24,,RUE,VERTE,62500,QUELMES,,,62674,,,,,,,,,,,,,,,,,,,2010-06-01,F,,,,,01.50Z,NAFRev2,N,2.13923,50.731014,0.95,housenumber,24 Rue Verte 62500 Quelmes,62674_0062_00024,G,24 RUE VERTE,
431965201,00012,43196520100012,O,2000-06-01,NN,,,2010-04-18T08:44:26,false,6,,255,,,GRAND PLACE,62500,QUELMES,,,62674,,,,,,,,,,,,,,,,,,,2008-10-01,F,,,,,64.20Z,NAFRev2,O,2.137043,50.732494,0.54,housenumber,255 Rue de la Place 62500 Quelmes,62674_0030_00255,G,255 RUE DE LA PLACE,
432022440,00015,43202244000015,O,2000-06-01,NN,,,2018-11-13T09:20:40,false,4,,255,,,GRAND PLACE,62500,QUELMES,,,62674,,,,,,,,,,,,,,,,,,,2018-09-30,F,,,,,68.20A,NAFRev2,N,2.137043,50.732494,0.54,housenumber,255 Rue de la Place 62500 Quelmes,62674_0030_00255,G,255 RUE DE LA PLACE,
433899473,00014,43389947300014,O,2000-12-18,NN,,,2008-01-04T19:14:38,true,3,,162,,RUE,VERTE,62500,QUELMES,,,62674,,,,,,,,,,,,,,,,,,,2008-01-01,A,,,,,68.20A,NAFRev2,N,2.140555,50.731689,0.95,housenumber,162 Rue Verte 62500 Quelmes,62674_0062_00162,G,162 RUE VERTE,
439024662,00025,43902466200025,O,2003-01-06,NN,,1413ZB,2020-10-23T03:39:22,true,5,,,,LD,LE VILLAGE,62500,QUELMES,,,62674,,,,,,,,,,,,,,,,,,,2011-11-17,F,,,,,14.13Z,NAFRev2,O,2.2950702,48.9311749,0.9,poi.bar,bar le village Gennevilliers,https://osm.org/node/3287755128,G,,
441002011,00019,44100201100019,O,2000-03-01,NN,,,2008-01-04T21:09:51,true,3,CHEZ MR MOBAILLY LAURENT,422,,RUE,DE LA PLACE,62500,QUELMES,,,62674,,,,,,,,,,,,,,,,,,,2008-01-01,A,,,,,78.30Z,NAFRev2,N,2.138135,50.731259,0.95,housenumber,422 Rue de la Place 62500 Quelmes,62674_0030_00422,G,422 RUE DE LA PLACE,
441966777,00019,44196677700019,O,1995-01-01,NN,,,2008-01-04T21:31:35,true,3,,440,,RUE,VERTE,62500,QUELMES,,,62674,,,,,,,,,,,,,,,,,,,2008-01-01,A,,,,,01.11Z,NAFRev2,N,2.143945,50.733298,0.95,housenumber,440 Rue Verte 62500 Quelmes,62674_0062_00440,G,440 RUE VERTE,
442056008,00018,44205600800018,O,1995-01-01,NN,,,2008-01-04T21:33:28,true,3,,89,,RUE,VERTE,62500,QUELMES,,,62674,,,,,,,,,,,,,,,,,,,2008-01-01,A,,,,,01.11Z,NAFRev2,N,2.139895,50.731424,0.95,housenumber,89 Rue Verte 62500 Quelmes,62674_0062_00089,G,89 RUE VERTE,
442635728,00011,44263572800011,O,2002-06-27,NN,,,2008-01-04T21:46:31,true,3,,,,CHE,DES CHARRETTES,62500,QUELMES,,,62674,,,,,,,,,,,,,,,,,,,2008-01-01,A,,,,,64.30Z,NAFRev2,N,2.130794,50.733814,0.4,street,Chemin de la Planquette 62500 Quelmes,62674_0042,G,CHEMIN DE LA PLANQUETTE,
445406432,00010,44540643200010,O,2003-02-01,00,2020,,2022-08-29T09:01:18,true,3,,464,,RUE,D'ACQUIN,62500,QUELMES,,,62674,,,,,,,,,,,,,,,,,,,2008-01-01,A,,,,,01.42Z,NAFRev2,N,2.128971,50.735561,0.79,housenumber,464 Route d’Acquin 62500 Quelmes,62674_0005_00464,G,464 ROUTE D ACQUIN,
481189520,00010,48118952000010,O,2005-02-01,NN,,,2018-09-29T12:21:51,true,2,LA PLACE,245,,RUE,DE L'EGLISE,62500,QUELMES,,,62674,,,,,,,,,,,,,,,,,,,2008-01-01,A,,,,,01.11Z,NAFRev2,O,2.138924,50.73371,0.78,street,Rue de l’Eglise 62500 Quelmes,62674_0025,G,RUE DE L EGLISE,
481730653,00013,48173065300013,O,2004-01-01,NN,,,2008-01-05T00:34:12,true,3,,274,,RUE,VERTE,62500,QUELMES,,,62674,,,,,,,,,,,,,,,,,,,2008-01-01,A,,,,,47.99A,NAFRev2,N,2.14198,50.732451,0.95,housenumber,274 Rue Verte 62500 Quelmes,62674_0062_00274,G,274 RUE VERTE,
481958825,00020,48195882500020,O,2006-03-01,,,2829BZ,2021-11-24T08:38:41,true,3,,139,,RUE,DES BERCEAUX,62500,QUELMES,,,62674,,,,,,,,,,,,,,,,,,,2021-08-31,F,,,,,47.78C,NAFRev2,N,2.13859,50.734596,0.95,housenumber,139 Rue des Berceaux 62500 Quelmes,62674_0011_00139,G,139 RUE DES BERCEAUX,
484111075,00020,48411107500020,O,2011-03-01,,,,2016-09-14T03:38:22,false,2,,61,,RUE,DE LA PLACE,62500,QUELMES,,,62674,,,,,,,,,,,,,,,,,,,2016-05-15,F,,,,,81.30Z,NAFRev2,N,2.135091,50.733854,0.95,housenumber,61 Rue de la Place 62500 Quelmes,62674_0030_00061,G,61 RUE DE LA PLACE,
487852584,00019,48785258400019,O,2006-01-03,,,,2007-06-29T11:47:45,true,2,,24,,RTE,DE ZUDAUSQUES,62500,QUELMES,,,62674,,,,,,,,,,,,,,,,,,,2006-12-31,F,,,,,02.0B,NAFRev1,N,2.140465,50.736102,0.73,street,Route de Zudausques 62500 Quelmes,62674_0065,G,ROUTE DE ZUDAUSQUES,
494366891,00013,49436689100013,O,2007-02-01,NN,,,2011-03-15T05:20:15,true,4,,572,,RTE,D'ACQUIN,62500,QUELMES,,,62674,,,,,,,,,,,,,,,,,,,2010-12-31,A,,,,,68.20B,NAFRev2,N,2.127425,50.735226,0.84,housenumber,572 Route d’Acquin 62500 Quelmes,62674_0005_00572,G,572 ROUTE D ACQUIN,
494993785,00042,49499378500042,O,2020-01-21,,,,2020-05-13T17:17:54,false,2,,741,,,ROUTE D'ACQUIN,62500,QUELMES,,,62674,,,,,,,,,,,,,,,,,,,2020-03-01,F,INFIN'ESSENCE,,,,96.09Z,NAFRev2,N,2.124397,50.734561,0.95,housenumber,741 Route d’Acquin 62500 Quelmes,62674_0005_00741,G,741 ROUTE D ACQUIN,
494995756,00017,49499575600017,O,2007-02-01,02,2020,,2022-08-29T09:28:34,true,2,,162,,RUE,VERTE,62500,QUELMES,,,62674,,,,,,,,,,,,,,,,,,,2008-01-01,A,,,,,01.11Z,NAFRev2,O,2.140555,50.731689,0.95,housenumber,162 Rue Verte 62500 Quelmes,62674_0062_00162,G,162 RUE VERTE,
502300387,00011,50230038700011,O,2008-01-25,,,,2021-06-29T03:54:29,true,2,,572,,RTE,D'ACQUIN,62500,QUELMES,,,62674,,,,,,,,,,,,,,,,,,,2021-05-31,F,,,,,01.50Z,NAFRev2,N,2.127425,50.735226,0.84,housenumber,572 Route d’Acquin 62500 Quelmes,62674_0005_00572,G,572 ROUTE D ACQUIN,
507892255,00039,50789225500039,O,2012-01-10,NN,,1413ZG,2017-08-24T10:14:21,false,2,,,,,LIEU DIT LE VILLAGE,62500,QUELMES,,,62674,,,,,,,,,,,,,,,,,,,2014-01-15,A,BANDE ORIGINALE,,,,14.13Z,NAFRev2,N,2.2950702,48.9311749,0.9,poi.bar,bar le village Gennevilliers,https://osm.org/node/3287755128,G,,
515353647,00016,51535364700016,O,2009-09-17,,,,2018-10-16T04:50:00,true,1,,184,,RUE,DE LA PLACE,62500,QUELMES,,,62674,,,,,,,,,,,,,,,,,,,2009-09-17,A,,,,,85.51Z,NAFRev2,N,2.136041,50.732866,0.95,housenumber,184 Rue de la Place 62500 Quelmes,62674_0030_00184,G,184 RUE DE LA PLACE,
524722055,00018,52472205500018,O,2010-07-01,,,,2012-11-10T02:27:41,true,1,,372,,RUE,DE L EGLISE,62500,QUELMES,,,62674,,,,,,,,,,,,,,,,,,,2010-07-01,A,,,,,68.31Z,NAFRev2,N,2.140644,50.734405,0.95,housenumber,372 Rue de l’Eglise 62500 Quelmes,62674_0025_00372,G,372 RUE DE L EGLISE,
529374415,00014,52937441500014,O,2010-12-01,,,,2011-01-05T04:06:55,true,1,,672,,RTE,D ACQUIN,62500,QUELMES,,,62674,,,,,,,,,,,,,,,,,,,2010-12-01,A,,,,,90.03A,NAFRev2,N,2.125942,50.734956,0.84,housenumber,672 Route d’Acquin 62500 Quelmes,62674_0005_00672,G,672 ROUTE D ACQUIN,
529554123,00016,52955412300016,O,2011-01-03,NN,,3101ZZ,2019-06-24T13:31:24,true,3,,691,,RTE,D'ACQUIN,62500,QUELMES,,,62674,,,,,,,,,,,,,,,,,,,2015-07-07,A,,,,,31.01Z,NAFRev2,N,2.125963,50.73487,0.84,housenumber,691 Route d’Acquin 62500 Quelmes,62674_0005_00691,G,691 ROUTE D ACQUIN,
529570004,00018,52957000400018,O,2010-06-01,,,,2011-02-09T16:35:07,true,1,,24,,RUE,VERTE,62500,QUELMES,,,62674,,,,,,,,,,,,,,,,,,,2010-06-01,A,,,,,01.11Z,NAFRev2,N,2.13923,50.731014,0.95,housenumber,24 Rue Verte 62500 Quelmes,62674_0062_00024,G,24 RUE VERTE,
531794352,00017,53179435200017,O,2011-04-01,NN,,,2015-05-14T09:02:51,false,3,,165,,ALL,DU CENTRE,62500,QUELMES,,,62674,,,,,,,,,,,,,,,,,,,2013-02-12,F,,,,,47.81Z,NAFRev2,O,2.141251,50.733364,0.84,housenumber,165 Allée du Centre 62500 Quelmes,62674_0014_00165,G,165 ALLEE DU CENTRE,
533174421,00016,53317442100016,O,2010-06-10,,,,2011-06-24T09:44:31,true,1,,255,,,GRAND PLACE,62500,QUELMES,,,62674,,,,,,,,,,,,,,,,,,,2010-06-10,A,,,,,94.99Z,NAFRev2,N,2.137043,50.732494,0.54,housenumber,255 Rue de la Place 62500 Quelmes,62674_0030_00255,G,255 RUE DE LA PLACE,
533489894,00014,53348989400014,O,2011-06-14,,,,2011-07-10T05:29:22,true,1,,741,,RTE,D'ACQUIN,62500,QUELMES,,,62674,,,,,,,,,,,,,,,,,,,2011-06-14,A,,,,,68.20B,NAFRev2,N,2.124397,50.734561,0.84,housenumber,741 Route d’Acquin 62500 Quelmes,62674_0005_00741,G,741 ROUTE D ACQUIN,
533834297,00012,53383429700012,O,2011-07-20,NN,,,2019-06-24T13:35:15,false,5,,272,,RUE,DE L EGLISE,62500,QUELMES,,,62674,,,,,,,,,,,,,,,,,,,2017-04-01,F,,,,,41.20B,NAFRev2,O,2.13979,50.73368,0.95,housenumber,272 Rue de l’Eglise 62500 Quelmes,62674_0025_00272,G,272 RUE DE L EGLISE,
538688011,00013,53868801100013,O,2012-01-01,,,,2011-12-22T09:12:21,true,1,,245,,,LA PLACE,62500,QUELMES,,,62674,,,,,,,,,,,,,,,,,,,2012-01-01,A,,,,,68.20B,NAFRev2,N,2.136981,50.732415,0.86,housenumber,245 Rue de la Place 62500 Quelmes,62674_0030_00245,G,245 RUE DE LA PLACE,
538795758,00019,53879575800019,O,2012-01-01,,,,2021-03-31T08:58:02,false,2,,218,,ALL,DU CENTRE,62500,QUELMES,,,62674,,,,,,,,,,,,,,,,,,,2012-12-16,F,,,,,85.59A,NAFRev2,N,2.142024,50.73352,0.84,housenumber,218 Allée du Centre 62500 Quelmes,62674_0014_00218,G,218 ALLEE DU CENTRE,
539386839,00028,53938683900028,O,2022-04-28,,,,2022-06-15T20:00:58,true,1,,277,,,ROUTE SAINT OMER,62500,QUELMES,,,62674,,,,,,,,,,,,,,,,,,,2022-04-28,A,,,,BOOP SHOP,47.91B,NAFRev2,N,2.141416,50.734738,0.94,housenumber,277 Route de Saint Omer 62500 Quelmes,62674_0055_00277,G,277 ROUTE DE SAINT OMER,
575470836,00017,57547083600017,O,,NN,,,,true,1,,,,,,62500,QUELMES,,,62674,,,,,,,,,,,,,,,,,,,1984-12-16,F,,,,,21.01,NAP,N,,,0,,,,,,
576570303,00015,57657030300015,O,,,,,,true,1,,,,RUE,VERTE,62500,QUELMES,,,62674,,,,,,,,,,,,,,,,,,,1988-08-27,F,,,,,57.08,NAP,N,2.142523,50.732774,0.95,street,Rue Verte 62500 Quelmes,62674_0062,G,RUE VERTE,