siren,nic,siret,statutDiffusionEtablissement,dateCreationEtablissement,trancheEffectifsEtablissement,anneeEffectifsEtablissement,activitePrincipaleRegistreMetiersEtablissement,dateDernierTraitementEtablissement,etablissementSiege,nombrePeriodesEtablissement,complementAdresseEtablissement,numeroVoieEtablissement,indiceRepetitionEtablissement,typeVoieEtablissement,libelleVoieEtablissement,codePostalEtablissement,libelleCommuneEtablissement,libelleCommuneEtrangerEtablissement,distributionSpecialeEtablissement,codeCommuneEtablissement,codeCedexEtablissement,libelleCedexEtablissement,codePaysEtrangerEtablissement,libellePaysEtrangerEtablissement,complementAdresse2Etablissement,numeroVoie2Etablissement,indiceRepetition2Etablissement,typeVoie2Etablissement,libelleVoie2Etablissement,codePostal2Etablissement,libelleCommune2Etablissement,libelleCommuneEtranger2Etablissement,distributionSpeciale2Etablissement,codeCommune2Etablissement,codeCedex2Etablissement,libelleCedex2Etablissement,codePaysEtranger2Etablissement,libellePaysEtranger2Etablissement,dateDebut,etatAdministratifEtablissement,enseigne1Etablissement,enseigne2Etablissement,enseigne3Etablissement,denominationUsuelleEtablissement,activitePrincipaleEtablissement,nomenclatureActivitePrincipaleEtablissement,caractereEmployeurEtablissement,longitude,latitude,geo_score,geo_type,geo_adresse,geo_id,geo_ligne,geo_l4,geo_l5
216500363,00017,21650036300017,O,1983-03-01,01,2020,,2022-08-29T09:08:22,true,4,,,,,,65400,ARTALENS-SOUIN,,,65036,,,,,,,,,,,,,,,,,,,2008-01-01,A,MAIRIE,,,,84.11Z,NAFRev2,O,,,0,,,,,,
216500363,00025,21650036300025,O,1983-12-21,NN,,,2019-11-14T14:00:52,false,4,,,,,,65400,ARTALENS-SOUIN,,,65036,,,,,,,,,,,,,,,,,,,1999-01-07,F,ECOLE PRIMAIRE PUBLIQUE,,,,80.1Z,NAF1993,N,,,0,,,,,,
216500363,00033,21650036300033,O,1995-12-25,NN,,,2019-11-14T14:00:52,false,3,MAIRIE,,,,,65400,ARTALENS-SOUIN,,,65036,,,,,,,,,,,,,,,,,,,2013-01-01,F,SERVICE EAU ET ASSAINISSEMENT,,,,36.00Z,NAFRev2,N,-0.046685,42.975127,0.9,street,Place de la Mairie 65400 Artalens-Souin,65036_0070,D,PLACE DE LA MAIRIE,
266501568,00015,26650156800015,O,1984-11-20,NN,,,2019-11-14T14:00:52,true,4,,,,,MAIRIE,65400,ARTALENS-SOUIN,,,65036,,,,,,,,,,,,,,,,,,,1996-12-25,F,CCAS,,,,85.3K,NAF1993,N,-0.046685,42.975127,0.9,street,Place de la Mairie 65400 Artalens-Souin,65036_0070,G,PLACE DE LA MAIRIE,
276501467,00019,27650146700019,O,,,,,2019-11-14T14:00:52,true,1,,,,,MAIRIE,65400,ARTALENS-SOUIN,,,65036,,,,,,,,,,,,,,,,,,,1995-12-25,F,,,,,41.0Z,NAF1993,N,-0.046685,42.975127,0.9,street,Place de la Mairie 65400 Artalens-Souin,65036_0070,G,PLACE DE LA MAIRIE,
314679093,00018,31467909300018,O,,NN,,,2019-11-14T14:00:52,true,1,,,,,,65400,ARTALENS-SOUIN,,,65036,,,,,,,,,,,,,,,,,,,1988-11-05,F,,,,,70.2A,NAF1993,N,,,0,,,,,,
317158491,00025,31715849100025,O,2016-07-01,,,,2019-11-14T14:00:52,true,1,QUARTIER BAYESTE,,,RTE,DU HAUTACAM,65400,ARTALENS-SOUIN,,,65036,,,,,,,,,,,,,,,,,,,2016-07-01,A,,,,,68.20A,NAFRev2,N,-0.048404,42.978806,0.83,street,Route du Hautacam 65400 Artalens-Souin,65036_0050,G,ROUTE DU HAUTACAM,
317697860,00078,31769786000078,O,2004-07-01,NN,,,2019-11-14T14:00:52,false,4,,,,RTE,DU HAUTACAM,65400,ARTALENS-SOUIN,,,65036,,,,,,,,,,,,,,,,,,,2008-11-30,F,,,,,68.20A,NAFRev2,N,-0.048404,42.978806,0.83,street,Route du Hautacam 65400 Artalens-Souin,65036_0050,G,ROUTE DU HAUTACAM,
324038116,00012,32403811600012,O,1982-01-15,NN,,,2019-11-14T14:00:52,true,3,,,,,,65400,ARTALENS-SOUIN,,,65036,,,,,,,,,,,,,,,,,,,2008-01-01,A,,,,,56.10A,NAFRev2,N,,,0,,,,,,
328867502,00010,32886750200010,O,1984-01-02,NN,,,2019-11-14T14:00:52,true,2,,,,,,65400,ARTALENS-SOUIN,,,65036,,,,,,,,,,,,,,,,,,,1999-05-31,F,,,,,,,,,,0,,,,,,
342691003,00020,34269100300020,O,1994-01-01,NN,,,2019-11-14T14:00:52,false,4,,,,,,65400,ARTALENS-SOUIN,,,65036,,,,,,,,,,,,,,,,,,,2016-01-01,F,,,,,01.47Z,NAFRev2,N,,,0,,,,,,
348537713,00045,34853771300045,O,2016-04-05,,,,2019-11-14T14:00:52,true,1,,,,,QUARTIER AILLEOU,65400,ARTALENS-SOUIN,,,65036,,,,,,,,,,,,,,,,,,,2016-04-05,F,,,,,86.90F,NAFRev2,N,-0.038221,42.982118,0.51,street,Quartier Camitort 65400 Artalens-Souin,65036_A010,G,QUARTIER CAMITORT,
353384126,00010,35338412600010,O,1989-11-22,NN,,,2019-11-14T14:00:52,true,4,,,,,,65400,ARTALENS-SOUIN,,,65036,,,,,,,,,,,,,,,,,,,1993-12-25,F,,,,,01.2C,NAF1993,N,,,0,,,,,,
377810783,00011,37781078300011,O,1989-10-27,NN,,,2019-11-14T14:00:52,false,4,,,,,,65400,ARTALENS-SOUIN,,,65036,,,,,,,,,,,,,,,,,,,1999-09-30,F,,,,,45.4C,NAF1993,N,,,0,,,,,,
377810783,00029,37781078300029,O,2005-03-21,,,,2019-11-14T14:00:52,true,4,,,,,VILLAGE,65400,ARTALENS-SOUIN,,,65036,,,,,,,,,,,,,,,,,,,2015-10-01,A,,,,,43.32A,NAFRev2,N,4.39087,45.4547668,0.89,poi.cafe,Village Café Saint-Étienne,https://osm.org/node/5321738834,G,,
384464566,00015,38446456600015,O,1984-01-01,NN,,,2019-11-14T14:00:52,true,3,,,,,,65400,ARTALENS-SOUIN,,,65036,,,,,,,,,,,,,,,,,,,2008-01-01,A,,,,,01.45Z,NAFRev2,N,,,0,,,,,,
388577629,00024,38857762900024,O,2003-12-25,NN,,,2019-11-14T14:00:52,false,3,STATION DU HAUTACAM,,,,,65400,ARTALENS-SOUIN,,,65036,,,,,,,,,,,,,,,,,,,2008-01-01,A,ESF,,,,85.51Z,NAFRev2,N,-0.048404,42.978806,0.58,street,Route du Hautacam 65400 Artalens-Souin,65036_0050,D,ROUTE DU HAUTACAM,
398804484,00028,39880448400028,O,1994-07-31,NN,,,2019-11-14T14:00:52,true,4,TRIO ROMANCE CAMITORT,,,,LE CAMITORT,65400,ARTALENS-SOUIN,,,65036,,,,,,,,,,,,,,,,,,,2008-01-01,A,,,,,90.01Z,NAFRev2,N,-0.038221,42.982118,0.69,street,Quartier Camitort 65400 Artalens-Souin,65036_A010,G,QUARTIER CAMITORT,
401144035,00011,40114403500011,O,1994-01-01,NN,,,2021-11-25T03:59:19,true,4,,,,,,65400,ARTALENS-SOUIN,,,65036,,,,,,,,,,,,,,,,,,,2021-12-01,F,,,,,01.42Z,NAFRev2,N,,,0,,,,,,
403685415,00016,40368541500016,O,1996-01-05,NN,,,2019-11-14T14:00:52,true,4,,,,,L'ARRIBAT,65400,ARTALENS-SOUIN,,,65036,,,,,,,,,,,,,,,,,,,2011-09-30,F,,,,,77.29Z,NAFRev2,N,,,0,,,,,,
404736761,00010,40473676100010,O,1995-07-01,NN,,,2019-11-14T14:00:52,true,4,,,,,,65400,ARTALENS-SOUIN,,,65036,,,,,,,,,,,,,,,,,,,2009-12-31,F,,,,,01.45Z,NAFRev2,N,,,0,,,,,,
410246219,00019,41024621900019,O,1995-04-01,NN,,,2021-02-23T11:32:23,true,5,,,,,,65400,ARTALENS-SOUIN,,,65036,,,,,,,,,,,,,,,,,,,2008-01-01,A,,,,,01.42Z,NAFRev2,N,,,0,,,,,,
411689409,00018,41168940900018,O,1997-03-14,NN,,,2019-11-14T14:00:52,true,3,,,,,LE BOURG,65400,ARTALENS-SOUIN,,,65036,,,,,,,,,,,,,,,,,,,2008-01-01,A,,,,,01.11Z,NAFRev2,N,2.212915,47.9910304,0.9,poi.bar,Le Bourg (Bar) Ingrannes,https://osm.org/node/1718543174,G,,
412613572,00012,41261357200012,O,,,,,2019-11-14T14:00:52,true,1,,,,,,65400,ARTALENS-SOUIN,,,65036,,,,,,,,,,,,,,,,,,,1997-09-30,F,,,,,55.4B,NAF1993,N,,,0,,,,,,
418917019,00014,41891701900014,O,1998-04-01,NN,,,2019-11-14T14:00:52,true,3,,,,,,65400,ARTALENS-SOUIN,,,65036,,,,,,,,,,,,,,,,,,,2008-01-01,A,,,,,01.42Z,NAFRev2,N,,,0,,,,,,
419135470,00013,41913547000013,O,1982-12-31,NN,,,2020-11-28T03:46:18,true,4,,,,,,65400,ARTALENS-SOUIN,,,65036,,,,,,,,,,,,,,,,,,,2020-12-01,F,,,,,01.45Z,NAFRev2,N,,,0,,,,,,
419135488,00015,41913548800015,O,1990-01-01,NN,,,2019-11-14T14:00:52,true,3,,,,,,65400,ARTALENS-SOUIN,,,65036,,,,,,,,,,,,,,,,,,,2008-01-01,A,,,,,01.50Z,NAFRev2,N,,,0,,,,,,
419135496,00018,41913549600018,O,1982-12-31,NN,,,2019-11-14T14:00:52,true,4,,,,,,65400,ARTALENS-SOUIN,,,65036,,,,,,,,,,,,,,,,,,,2015-07-15,F,,,,,01.45Z,NAFRev2,N,,,0,,,,,,
419577358,00015,41957735800015,O,1997-01-01,NN,,,2019-11-14T14:00:52,true,3,,,,,,65400,ARTALENS-SOUIN,,,65036,,,,,,,,,,,,,,,,,,,2008-01-01,A,,,,,01.11Z,NAFRev2,N,,,0,,,,,,
420123630,00014,42012363000014,O,1998-01-01,NN,,,2019-11-14T14:00:52,true,3,,,,,,65400,ARTALENS-SOUIN,,,65036,,,,,,,,,,,,,,,,,,,2007-12-31,F,,,,,01.2C,NAFRev1,N,,,0,,,,,,
420353161,00011,42035316100011,O,1982-12-31,NN,,,2019-11-14T14:00:52,false,3,,,,,,65400,ARTALENS-SOUIN,,,65036,,,,,,,,,,,,,,,,,,,2007-07-31,F,,,,,01.1A,NAFRev1,N,,,0,,,,,,
423489764,00021,42348976400021,O,1999-02-01,NN,,,2019-11-14T14:00:52,false,3,,,,,,65400,ARTALENS-SOUIN,,,65036,,,,,,,,,,,,,,,,,,,2007-12-31,F,,,,,70.2A,NAFRev1,N,,,0,,,,,,
425231180,00018,42523118000018,O,1984-01-01,NN,,,2019-11-14T14:00:52,true,1,,,,,,65400,ARTALENS-SOUIN,,,65036,,,,,,,,,,,,,,,,,,,1994-10-09,F,,,,,70.2A,NAF1993,N,,,0,,,,,,
425236577,00010,42523657700010,O,1987-01-01,NN,,,2019-11-14T14:00:52,true,3,,,,,,65400,ARTALENS-SOUIN,,,65036,,,,,,,,,,,,,,,,,,,2002-06-15,F,,,,,70.2A,NAF1993,N,,,0,,,,,,
425273687,00011,42527368700011,O,1971-01-01,NN,,,2019-11-14T14:00:52,true,3,,,,,,65400,ARTALENS-SOUIN,,,65036,,,,,,,,,,,,,,,,,,,2005-12-25,F,,,,,01.3Z,NAFRev1,N,,,0,,,,,,
432366136,00013,43236613600013,O,2000-08-01,NN,,,2019-11-14T14:00:52,true,3,,,,RTE,DU HAUTACAM,65400,ARTALENS-SOUIN,,,65036,,,,,,,,,,,,,,,,,,,2008-01-01,A,,,,,01.47Z,NAFRev2,N,-0.048404,42.978806,0.83,street,Route du Hautacam 65400 Artalens-Souin,65036_0050,G,ROUTE DU HAUTACAM,
445218829,00015,44521882900015,O,2003-01-01,NN,,,2019-11-15T13:40:19,true,5,,,,,,65400,ARTALENS-SOUIN,,,65036,,,,,,,,,,,,,,,,,,,2019-02-25,F,,,,,68.20A,NAFRev2,O,,,0,,,,,,
451318349,00011,45131834900011,O,2004-01-01,NN,,,2019-11-14T14:00:52,true,5,,,,,ARRIBAT,65400,ARTALENS-SOUIN,,,65036,,,,,,,,,,,,,,,,,,,2008-01-01,A,,,,,85.51Z,NAFRev2,N,-0.0720203,42.9887913,0.77,poi.stream,Ruiseau d'Arribats (Ruisseau) Préchac,https://osm.org/way/194601166,G,,
451325534,00035,45132553400035,O,2006-12-01,,,,2019-11-14T14:00:52,false,1,,,,RTE,DU HAUTACAM,65400,ARTALENS-SOUIN,,,65036,,,,,,,,,,,,,,,,,,,2006-12-01,F,,,,,92.6C,NAFRev1,N,-0.048404,42.978806,0.83,street,Route du Hautacam 65400 Artalens-Souin,65036_0050,G,ROUTE DU HAUTACAM,
493999338,00012,49399933800012,O,2007-01-16,,,,2019-11-14T14:00:52,true,2,,,,RUE,PRINCIPALE,65400,ARTALENS-SOUIN,,,65036,,,,,,,,,,,,,,,,,,,2008-01-01,A,,,,,85.59B,NAFRev2,N,-0.045027,42.975169,0.33,street,Rue de la Fontaine 65400 Artalens-Souin,65036_0040,G,RUE DE LA FONTAINE,
498273507,00018,49827350700018,O,2007-06-01,,,,2019-11-14T14:00:52,true,5,HAUT DU VILLAGE,,,,VILLAGE,65400,ARTALENS-SOUIN,,,65036,,,,,,,,,,,,,,,,,,,2016-05-01,A,,,,,93.19Z,NAFRev2,N,-0.048404,42.978806,0.34,street,Route du Hautacam 65400 Artalens-Souin,65036_0050,D,ROUTE DU HAUTACAM,
498273507,00034,49827350700034,O,2019-02-01,,,,2021-02-23T14:06:03,false,1,,16,,RUE,DE LA FONTAINE,65400,ARTALENS-SOUIN,,,65036,,,,,,,,,,,,,,,,,,,2019-02-01,A,,,,,68.20A,NAFRev2,N,-0.044175,42.975373,0.94,housenumber,16 Rue de la Fontaine 65400 Artalens-Souin,65036_0040_00016,G,16 RUE DE LA FONTAINE,
499007169,00018,49900716900018,O,2007-05-01,00,2020,,2022-08-29T09:30:56,true,3,,,,,SALLE DES FETES,65400,ARTALENS-SOUIN,,,65036,,,,,,,,,,,,,,,,,,,2008-01-01,A,,,,,85.59B,NAFRev2,O,3.9860059,49.2196458,0.92,poi.community_centre,salle polyvalente (Salle des fêtes) Bezannes,https://osm.org/way/190607074,G,,
500947734,00017,50094773400017,O,2004-01-01,,,,2019-11-14T14:00:52,false,2,STOUET,,,,,65400,ARTALENS-SOUIN,,,65036,,,,,,,,,,,,,,,,,,,2008-01-01,A,,,,,68.20A,NAFRev2,N,,,0,,,,,,
501778088,00010,50177808800010,O,2008-01-01,,,,2021-02-23T14:12:24,true,2,,,,,,65400,ARTALENS-SOUIN,,,65036,,,,,,,,,,,,,,,,,,,2019-01-01,A,,,,,68.20B,NAFRev2,N,,,0,,,,,,
501778088,00028,50177808800028,O,2021-01-01,,,4312AZ,2021-02-23T14:12:24,false,1,,12,,RTE,DU HAUTACAM,65400,ARTALENS-SOUIN,,,65036,,,,,,,,,,,,,,,,,,,2021-01-01,A,,,,,43.12A,NAFRev2,N,-0.048864,42.97909,0.85,housenumber,12 Route du Hautacam 65400 Artalens-Souin,65036_0050_00012,G,12 ROUTE DU HAUTACAM,
502509359,00027,50250935900027,O,2014-10-01,NN,,,2021-04-21T03:45:25,true,3,QUARTIER,,,,ARRIBAT,65400,ARTALENS-SOUIN,,,65036,,,,,,,,,,,,,,,,,,,2020-12-15,F,SNEC,,,SNEC,71.12B,NAFRev2,N,-0.038221,42.982118,0.54,street,Quartier Camitort 65400 Artalens-Souin,65036_A010,D,QUARTIER CAMITORT,
502590292,00038,50259029200038,O,2018-10-01,,,,2019-11-14T14:00:52,false,2,,1,,RTE,DU HAUTACAM APPART 3,65400,ARTALENS-SOUIN,,,65036,,,,,,,,,,,,,,,,,,,2019-06-14,F,,,,,81.30Z,NAFRev2,N,,,0,,,,,,
503034548,00043,50303454800043,O,2021-08-09,,,,2021-09-04T12:45:50,true,1,QUARTIER ARRIBAT,27,,RTE,DU HAUTACAM,65400,ARTALENS-SOUIN,,,65036,,,,,,,,,,,,,,,,,,,2021-08-09,A,,,,PHILIPPE CAYOUX ENERGETIQUE CHINOISE,96.09Z,NAFRev2,N,-0.047947,42.978345,0.85,housenumber,27 Route du Hautacam 65400 Artalens-Souin,65036_0050_00027,G,27 ROUTE DU HAUTACAM,
508155777,00032,50815577700032,O,2013-04-30,,,,2019-11-14T14:00:52,true,1,,28,,RTE,DE HAUTACAM,65400,ARTALENS-SOUIN,,,65036,,,,,,,,,,,,,,,,,,,2013-04-30,A,,,,,71.12B,NAFRev2,N,-0.044667,42.974797,0.71,housenumber,28 Route du Hautacam 65400 Artalens-Souin,65036_0050_00028,G,28 ROUTE DU HAUTACAM,
518608062,00015,51860806200015,O,2010-01-01,,,,2023-02-25T03:46:49,true,2,,,,,LE VILLAGE,65400,ARTALENS-SOUIN,,,65036,,,,,,,,,,,,,,,,,,,2022-12-31,F,,,,,01.42Z,NAFRev2,N,2.2950702,48.9311749,0.9,poi.bar,bar le village Gennevilliers,https://osm.org/node/3287755128,G,,
523147007,00018,52314700700018,O,2010-07-01,,,,2019-11-14T14:00:52,true,2,,,,,,65400,ARTALENS-SOUIN,,,65036,,,,,,,,,,,,,,,,,,,2014-06-01,F,,,,,01.19Z,NAFRev2,N,,,0,,,,,,
527613632,00019,52761363200019,O,2010-10-12,,,,2021-01-25T10:10:01,false,2,VILLAGE,,,,,65400,ARTALENS-SOUIN,,,65036,,,,,,,,,,,,,,,,,,,2012-12-31,F,,,,,01.49Z,NAFRev2,N,,,0,,,,,,
527613632,00027,52761363200027,O,2021-01-01,,,,2021-02-23T15:43:36,true,1,,19,,RTE,DU HAUTACAM,65400,ARTALENS-SOUIN,,,65036,,,,,,,,,,,,,,,,,,,2021-01-01,A,,,,,01.49Z,NAFRev2,N,-0.04972,42.980837,0.85,housenumber,19 Route du Hautacam 65400 Artalens-Souin,65036_0050_00019,G,19 ROUTE DU HAUTACAM,
530647411,00020,53064741100020,O,2011-02-28,,,,2021-02-23T15:49:10,true,1,ROUTE DU HAUTACAM ARTALENS,,,,,65400,ARTALENS-SOUIN,,,65036,,,,,,,,,,,,,,,,,,,2011-02-28,A,,,,,55.20Z,NAFRev2,N,-0.048404,42.978806,0.94,street,Route du Hautacam 65400 Artalens-Souin,65036_0050,D,ROUTE DU HAUTACAM,
534255005,00017,53425500500017,O,2011-08-01,,,,2019-11-14T14:00:52,true,2,,,,RTE,DU HAUTACAM,65400,ARTALENS-SOUIN,,,65036,,,,,,,,,,,,,,,,,,,2011-09-15,F,,,,,96.09Z,NAFRev2,N,-0.048404,42.978806,0.83,street,Route du Hautacam 65400 Artalens-Souin,65036_0050,G,ROUTE DU HAUTACAM,
539155499,00038,53915549900038,O,2015-07-01,,,,2019-11-14T14:00:52,true,1,,,,QUA,ARRIBAT,65400,ARTALENS-SOUIN,,,65036,,,,,,,,,,,,,,,,,,,2015-07-01,A,,,,,68.20A,NAFRev2,N,,,0,,,,,,
540030418,00011,54003041800011,O,2012-02-15,,,,2019-11-14T14:00:52,true,2,HAUT DU VILLAGE,,,,,65400,ARTALENS-SOUIN,,,65036,,,,,,,,,,,,,,,,,,,2013-02-28,F,,,,,43.91A,NAFRev2,N,-0.048404,42.978806,0.37,street,Route du Hautacam 65400 Artalens-Souin,65036_0050,D,ROUTE DU HAUTACAM,
672771607,00013,67277160700013,O,,NN,,,2019-11-14T14:00:52,true,1,,,,,,65400,ARTALENS-SOUIN,,,65036,,,,,,,,,,,,,,,,,,,1996-11-16,F,,,,,55.4A,NAF1993,N,,,0,,,,,,
780082814,00010,78008281400010,O,1973-01-01,NN,,,2019-11-14T14:00:52,true,4,,,,,,65400,ARTALENS-SOUIN,,,65036,,,,,,,,,,,,,,,,,,,2010-06-27,F,,,,,68.20B,NAFRev2,N,,,0,,,,,,
791425721,00010,79142572100010,O,2013-01-01,,,,2019-11-14T14:00:52,true,1,,,,RTE,DU HAUTACAM,65400,ARTALENS-SOUIN,,,65036,,,,,,,,,,,,,,,,,,,2013-01-01,A,,,,,01.11Z,NAFRev2,N,-0.048404,42.978806,0.83,street,Route du Hautacam 65400 Artalens-Souin,65036_0050,G,ROUTE DU HAUTACAM,
801276130,00011,80127613000011,O,2014-03-12,,,,2019-11-14T14:00:52,false,2,,,,,SOUIN,65400,ARTALENS-SOUIN,,,65036,,,,,,,,,,,,,,,,,,,2014-07-30,F,,,,,86.90D,NAFRev2,N,-0.048404,42.978806,0.91,street,Route du Hautacam 65400 Artalens-Souin,65036_0050,G,ROUTE DU HAUTACAM,
804042638,00010,80404263800010,O,2014-07-16,NN,,,2019-11-14T14:00:52,true,1,,,,,BRG AU VILLAGE,65400,ARTALENS-SOUIN,,,65036,,,,,,,,,,,,,,,,,,,2014-07-16,A,,,,,90.01Z,NAFRev2,N,,,0,,,,,,
808144331,00010,80814433100010,O,2015-01-01,,,,2019-11-14T14:00:52,true,1,LA LANNE,,,,,65400,ARTALENS-SOUIN,,,65036,,,,,,,,,,,,,,,,,,,2015-01-01,A,,,,,01.45Z,NAFRev2,N,-0.046311,42.973799,0.9,street,Impasse de la Lanne 65400 Artalens-Souin,65036_0060,D,IMPASSE DE LA LANNE,
808757983,00016,80875798300016,O,2015-01-01,,,,2021-03-08T14:18:46,true,1,HAMEAU DE SOUIN,,,,,65400,ARTALENS-SOUIN,,,65036,,,,,,,,,,,,,,,,,,,2015-01-01,A,ELEVAGE LATAPIE,,,,01.45Z,NAFRev2,N,-0.04499,42.975525,0.48,street,Chemin de Plagnets 65400 Artalens-Souin,65036_0090,D,CHEMIN DE PLAGNETS,
808757983,00024,80875798300024,O,2021-01-01,,,,2021-03-08T14:20:39,false,1,HAMEAU DE SOUIN,1,,,RTE DU HAUTACAM,65400,ARTALENS-SOUIN,,,65036,,,,,,,,,,,,,,,,,,,2021-01-01,A,,,,,55.20Z,NAFRev2,N,-0.052191,42.985399,0.84,housenumber,1 Route du Hautacam 65400 Artalens-Souin,65036_0050_00001,G,1 ROUTE DU HAUTACAM,
809746001,00019,80974600100019,O,2015-02-15,,,,2019-11-14T14:00:52,true,1,HAMEAU DE SOUIN,,,,,65400,ARTALENS-SOUIN,,,65036,,,,,,,,,,,,,,,,,,,2015-02-15,A,ANCLADERES,,,,01.45Z,NAFRev2,N,-0.04499,42.975525,0.48,street,Chemin de Plagnets 65400 Artalens-Souin,65036_0090,D,CHEMIN DE PLAGNETS,
820282150,00011,82028215000011,O,2016-04-28,,,,2019-11-14T14:00:52,true,2,,,,,SAINT ANDRE RTE DU HAUTACAM,65400,ARTALENS-SOUIN,,,65036,,,,,,,,,,,,,,,,,,,2018-05-13,F,,,,,01.49Z,NAFRev2,N,-0.048404,42.978806,0.53,street,Route du Hautacam 65400 Artalens-Souin,65036_0050,G,ROUTE DU HAUTACAM,
820847549,00020,82084754900020,O,2021-12-01,,,,2022-01-07T14:47:55,true,1,,4,,RUE,DE L'EGLISE,65400,ARTALENS-SOUIN,,,65036,,,,,,,,,,,,,,,,,,,2021-12-01,A,,,,,81.30Z,NAFRev2,N,-0.052983,42.986359,0.94,housenumber,4 Rue de l’Église 65400 Artalens-Souin,65036_0035_00004,G,4 RUE DE L EGLISE,
823974621,00026,82397462100026,O,2021-06-03,,,,2021-06-18T14:04:06,false,1,,32,T,RTE,DU HAUTACAM,65400,ARTALENS-SOUIN,,,65036,,,,,,,,,,,,,,,,,,,2021-06-03,A,,,,,73.11Z,NAFRev2,N,-0.044435,42.974926,0.85,interpolation,32 Route du Hautacam 65400 Artalens-Souin,,G,30 ROUTE DU HAUTACAM,
824386171,00014,82438617100014,O,2016-12-14,,,,2019-11-14T14:00:52,true,1,,4,,RTE,ROUTE DU HAUTACAM,65400,ARTALENS-SOUIN,,,65036,,,,,,,,,,,,,,,,,,,2016-12-14,A,,,,,74.10Z,NAFRev2,N,-0.051979,42.985288,0.84,housenumber,4 Route du Hautacam 65400 Artalens-Souin,65036_0050_00004,G,4 ROUTE DU HAUTACAM,
840783138,00026,84078313800026,O,2020-12-08,,,,2021-02-23T18:00:07,true,1,QUARTIER ARRIBAT,27,,RTE,DU HAUTACAM,65400,ARTALENS-SOUIN,,,65036,,,,,,,,,,,,,,,,,,,2020-12-08,A,,,,,86.90F,NAFRev2,N,-0.047947,42.978345,0.85,housenumber,27 Route du Hautacam 65400 Artalens-Souin,65036_0050_00027,G,27 ROUTE DU HAUTACAM,
844653147,00018,84465314700018,O,2019-01-01,,,,2019-11-14T14:00:52,true,1,,12,,,QUARTIER ARRIBAT,65400,ARTALENS-SOUIN,,,65036,,,,,,,,,,,,,,,,,,,2019-01-01,A,,,,,01.42Z,NAFRev2,N,-0.038221,42.982118,0.55,street,Quartier Camitort 65400 Artalens-Souin,65036_A010,G,QUARTIER CAMITORT,
851951996,00012,85195199600012,O,2019-07-01,,,4312BA,2021-06-26T03:50:25,true,2,,,,,21 QUARTIER ARRIBAT,65400,ARTALENS-SOUIN,,,65036,,,,,,,,,,,,,,,,,,,2021-04-20,F,,,,CORNET TERRASSEMENT,43.12A,NAFRev2,N,-0.038221,42.982118,0.55,street,Quartier Camitort 65400 Artalens-Souin,65036_A010,G,QUARTIER CAMITORT,
892897760,00013,89289776000013,O,2019-09-01,,,,2021-01-14T14:27:45,true,1,QUARTIER DE LA QUINTA,33,,RTE,DU HAUTACAM,65400,ARTALENS-SOUIN,,,65036,,,,,,,,,,,,,,,,,,,2019-09-01,A,,,,,68.20A,NAFRev2,N,-0.049671,42.980165,0.85,housenumber,33 Route du Hautacam 65400 Artalens-Souin,65036_0050_00033,G,33 ROUTE DU HAUTACAM,
893334540,00018,89333454000018,O,2021-01-18,,,,2021-01-26T14:33:14,true,1,,26,,RTE,DU HAUTACAM,65400,ARTALENS-SOUIN,,,65036,,,,,,,,,,,,,,,,,,,2021-01-18,A,,,,,74.10Z,NAFRev2,N,-0.045909,42.973583,0.85,housenumber,26 Route du Hautacam 65400 Artalens-Souin,65036_0050_00026,G,26 ROUTE DU HAUTACAM,
897399085,00017,89739908500017,O,2021-03-19,,,,2021-05-03T12:34:43,true,1,,39,,RTE,DU HAUTACAM,65400,ARTALENS-SOUIN,,,65036,,,,,,,,,,,,,,,,,,,2021-03-19,A,,,,,70.10Z,NAFRev2,N,-0.046198,42.973818,0.85,housenumber,39 Route du Hautacam 65400 Artalens-Souin,65036_0050_00039,G,39 ROUTE DU HAUTACAM,
897399085,00025,89739908500025,O,2021-04-01,,,1072ZZ,2021-05-13T14:30:31,false,2,,4,,,RTE DU HAUTACAM,65400,ARTALENS-SOUIN,,,65036,,,,,,,,,,,,,,,,,,,2021-05-10,A,,,,,10.72Z,NAFRev2,O,-0.051979,42.985288,0.84,housenumber,4 Route du Hautacam 65400 Artalens-Souin,65036_0050_00004,G,4 ROUTE DU HAUTACAM,
898518238,00016,89851823800016,O,2021-04-20,,,4312AZ,2023-02-04T14:57:29,true,1,,21,,,ARRIBAT ,65400,ARTALENS-SOUIN,,,65036,,,,,,,,,,,,,,,,,,,2021-04-20,A,,,,CORNET TERRASSEMENT,43.12A,NAFRev2,N,-0.04879,42.97916,0.35,housenumber,21 Route du Hautacam 65400 Artalens-Souin,65036_0050_00021,G,21 ROUTE DU HAUTACAM,
899983134,00011,89998313400011,O,2021-06-12,,,,2021-06-03T08:35:22,true,1,,16,,RUE,DE LA FONTAINE,65400,ARTALENS-SOUIN,,,65036,,,,,,,,,,,,,,,,,,,2021-06-12,A,,,,,68.20A,NAFRev2,N,-0.044175,42.975373,0.94,housenumber,16 Rue de la Fontaine 65400 Artalens-Souin,65036_0040_00016,G,16 RUE DE LA FONTAINE,
900405978,00017,90040597800017,O,2021-06-01,,,8121ZZ,2022-10-29T03:35:39,true,2,,31,,RTE,DU HAUTACAM,65400,ARTALENS-SOUIN,,,65036,,,,,,,,,,,,,,,,,,,2022-08-01,F,,,,,81.21Z,NAFRev2,N,-0.048112,42.978599,0.85,housenumber,31 Route du Hautacam 65400 Artalens-Souin,65036_0050_00031,G,31 ROUTE DU HAUTACAM,
907617377,00011,90761737700011,O,2021-11-01,,,,2022-03-11T03:43:37,false,2,,4,,RUE,DE LA FONTAINE,65400,ARTALENS-SOUIN,,,65036,,,,,,,,,,,,,,,,,,,2022-02-22,F,,,,,66.30Z,NAFRev2,N,-0.046104,42.975164,0.94,housenumber,4 Rue de la Fontaine 65400 Artalens-Souin,65036_0040_00004,G,4 RUE DE LA FONTAINE,
914916473,00012,91491647300012,O,2022-06-08,,,,2023-01-06T08:00:01,true,1,,44,,RTE,DU HAUTACAM ,65400,ARTALENS-SOUIN,,,65036,,,,,,,,,,,,,,,,,,,2022-06-08,A,,,,,55.10Z,NAFRev2,N,-0.04405,42.984199,0.85,housenumber,44 Route du Hautacam 65400 Artalens-Souin,65036_0050_00044,G,44 ROUTE DU HAUTACAM,
918754680,00018,91875468000018,O,2022-06-06,,,,2022-08-31T08:43:59,true,1,,9,B,RTE,DU HAUTACAM,65400,ARTALENS-SOUIN,,,65036,,,,,,,,,,,,,,,,,,,2022-06-06,A,,,,,68.20A,NAFRev2,N,-0.050875,42.982852,0.85,interpolation,9 Route du Hautacam 65400 Artalens-Souin,,G,7 ROUTE DU HAUTACAM,
922007547,00016,92200754700016,O,2022-12-01,,,,2022-12-08T07:57:16,true,1,,39,,RTE,DU HAUTACAM ,65400,ARTALENS-SOUIN,,,65036,,,,,,,,,,,,,,,,,,,2022-12-01,A,,,,,68.20B,NAFRev2,N,-0.046198,42.973818,0.85,housenumber,39 Route du Hautacam 65400 Artalens-Souin,65036_0050_00039,G,39 ROUTE DU HAUTACAM,
