siren,nic,siret,statutDiffusionEtablissement,dateCreationEtablissement,trancheEffectifsEtablissement,anneeEffectifsEtablissement,activitePrincipaleRegistreMetiersEtablissement,dateDernierTraitementEtablissement,etablissementSiege,nombrePeriodesEtablissement,complementAdresseEtablissement,numeroVoieEtablissement,indiceRepetitionEtablissement,typeVoieEtablissement,libelleVoieEtablissement,codePostalEtablissement,libelleCommuneEtablissement,libelleCommuneEtrangerEtablissement,distributionSpecialeEtablissement,codeCommuneEtablissement,codeCedexEtablissement,libelleCedexEtablissement,codePaysEtrangerEtablissement,libellePaysEtrangerEtablissement,complementAdresse2Etablissement,numeroVoie2Etablissement,indiceRepetition2Etablissement,typeVoie2Etablissement,libelleVoie2Etablissement,codePostal2Etablissement,libelleCommune2Etablissement,libelleCommuneEtranger2Etablissement,distributionSpeciale2Etablissement,codeCommune2Etablissement,codeCedex2Etablissement,libelleCedex2Etablissement,codePaysEtranger2Etablissement,libellePaysEtranger2Etablissement,dateDebut,etatAdministratifEtablissement,enseigne1Etablissement,enseigne2Etablissement,enseigne3Etablissement,denominationUsuelleEtablissement,activitePrincipaleEtablissement,nomenclatureActivitePrincipaleEtablissement,caractereEmployeurEtablissement,longitude,latitude,geo_score,geo_type,geo_adresse,geo_id,geo_ligne,geo_l4,geo_l5
216502013,00016,21650201300016,O,1983-03-01,02,2020,,2022-08-29T09:08:22,true,3,,,,,,65100,GEU,,,65201,,,,,,,,,,,,,,,,,,,2008-01-01,A,MAIRIE,,,,84.11Z,NAFRev2,N,,,0,,,,,,
256501339,00012,25650133900012,O,1985-09-30,01,2020,,2022-08-29T09:10:07,true,4,,,,,MAIRIE,65100,GEU,,,65201,,,,,,,,,,,,,,,,,,,2008-01-01,A,,,,,84.11Z,NAFRev2,O,3.0709671,50.6304695,0.92,poi.townhall,Hôtel de Ville Lille,https://osm.org/way/40917078,G,,
266503119,00015,26650311900015,O,1984-11-20,NN,,,2022-08-04T12:41:22,true,3,,,,,MAIRIE,65100,GEU,,,65201,,,,,,,,,,,,,,,,,,,2002-01-01,F,CCAS,,,,85.3K,NAF1993,N,3.0709671,50.6304695,0.92,poi.townhall,Hôtel de Ville Lille,https://osm.org/way/40917078,G,,
305981987,00053,30598198700053,O,1996-06-25,NN,,,,false,4,,,,,,65100,GEU,,,65201,,,,,,,,,,,,,,,,,,,2002-09-30,F,,,,,70.1F,NAF1993,N,,,0,,,,,,
307591271,00027,30759127100027,O,,NN,,,,true,1,,,,,,65100,GEU,,,65201,,,,,,,,,,,,,,,,,,,1991-07-31,F,,,,,55.73,NAP,N,,,0,,,,,,
316359660,00032,31635966000032,O,1973-01-01,NN,,,2022-03-01T04:07:39,true,7,,,,,,65100,GEU,,,65201,,,,,,,,,,,,,,,,,,,2021-04-26,F,,,,,55.20Z,NAFRev2,N,,,0,,,,,,
321494411,00010,32149441100010,O,1980-04-20,NN,,,2008-01-04T18:26:36,true,4,,,,,,65100,GEU,,,65201,,,,,,,,,,,,,,,,,,,2008-01-01,A,,,,,68.20B,NAFRev2,N,,,0,,,,,,
321494429,00012,32149442900012,O,,NN,,,,true,1,,,,,,65100,GEU,,,65201,,,,,,,,,,,,,,,,,,,1993-01-01,F,,,,,70.2C,NAF1993,N,,,0,,,,,,
321494437,00015,32149443700015,O,,NN,,,,true,1,,,,,,65100,GEU,,,65201,,,,,,,,,,,,,,,,,,,1993-01-01,F,,,,,70.2C,NAF1993,N,,,0,,,,,,
321494445,00018,32149444500018,O,,NN,,,,true,1,,,,,,65100,GEU,,,65201,,,,,,,,,,,,,,,,,,,1993-01-01,F,,,,,70.2C,NAF1993,N,,,0,,,,,,
321494452,00014,32149445200014,O,,NN,,,,true,1,,,,,,65100,GEU,,,65201,,,,,,,,,,,,,,,,,,,1993-01-01,F,,,,,70.2C,NAF1993,N,,,0,,,,,,
321494460,00017,32149446000017,O,,NN,,,,true,1,,,,,,65100,GEU,,,65201,,,,,,,,,,,,,,,,,,,1989-12-25,F,,,,,70.2C,NAF1993,N,,,0,,,,,,
321494478,00019,32149447800019,O,,NN,,,,true,1,,,,,,65100,GEU,,,65201,,,,,,,,,,,,,,,,,,,1993-01-01,F,,,,,70.2C,NAF1993,N,,,0,,,,,,
324618776,00029,32461877600029,O,1983-10-13,NN,,,2008-01-04T18:58:36,true,3,,,,,,65100,GEU,,,65201,,,,,,,,,,,,,,,,,,,2008-01-01,A,,,,,68.20B,NAFRev2,N,,,0,,,,,,
327467585,00029,32746758500029,O,,NN,,,,true,1,,,,,,65100,GEU,,,65201,,,,,,,,,,,,,,,,,,,1989-03-31,F,,,,,67.01,NAP,N,,,0,,,,,,
332979475,00024,33297947500024,O,,NN,,,,true,1,,,,,,65100,GEU,,,65201,,,,,,,,,,,,,,,,,,,1988-03-31,F,,,,,62.46,NAP,N,,,0,,,,,,
334622776,00022,33462277600022,O,1998-05-02,NN,,,2008-11-07T00:54:56,false,4,,,,,,65100,GEU,,,65201,,,,,,,,,,,,,,,,,,,2004-01-27,F,LE SABLIER,,,,55.3B,NAFRev1,O,,,0,,,,,,
344866637,00020,34486663700020,O,2001-10-01,02,2020,4391AZ,2022-08-29T09:29:23,true,4,,16,,CHE,DE PEYREMAILLERE,65100,GEU,,,65201,,,,,,,,,,,,,,,,,,,2008-01-01,A,,,,,43.91A,NAFRev2,O,-0.047716,43.041812,0.78,housenumber,16 Camin de Peyremaillere 65100 Geu,65201_tmnzqf_00016,G,16 CAMIN DE PEYREMAILLERE,
349884338,00055,34988433800055,O,2009-09-10,,,,2011-03-23T11:02:23,false,2,,,,LOT,LES ARIAILS,65100,GEU,,,65201,,,,,,,,,,,,,,,,,,,2011-03-22,F,,,,,47.89Z,NAFRev2,N,-0.047417,43.04067,0.53,street,Camin Deths Ariails 65100 Geu,65201_bbfbys,G,CAMIN DETHS ARIAILS,
351171160,00010,35117116000010,O,1989-07-02,NN,,,,true,4,,,,,,65100,GEU,,,65201,,,,,,,,,,,,,,,,,,,1992-12-25,F,,,,,55.3A,NAF1993,N,,,0,,,,,,
352503536,00018,35250353600018,O,,NN,,,,true,1,,,,,,65100,GEU,,,65201,,,,,,,,,,,,,,,,,,,1993-01-01,F,,,,,70.2C,NAF1993,N,,,0,,,,,,
353109101,00017,35310910100017,O,1989-11-25,NN,,,2008-01-04T23:50:37,true,3,,,,,,65100,GEU,,,65201,,,,,,,,,,,,,,,,,,,2008-01-01,A,,,,,68.20A,NAFRev2,N,,,0,,,,,,
390147320,00019,39014732000019,O,1993-04-14,01,2020,4942ZZ,2022-08-29T09:14:40,true,6,,,,,LE VILLAGE,65100,GEU,,,65201,,,,,,,,,,,,,,,,,,,2008-01-01,A,,,,,49.42Z,NAFRev2,O,2.2950702,48.9311749,0.9,poi.bar,bar le village Gennevilliers,https://osm.org/node/3287755128,G,,
390413805,00024,39041380500024,O,2002-07-22,NN,,,,true,1,,,,LD,AOUZOS,65100,GEU,,,65201,,,,,,,,,,,,,,,,,,,2002-09-16,F,,,,,74.8A,NAF1993,N,,,0,,,,,,
402016257,00022,40201625700022,O,1996-05-16,NN,,,2015-10-20T03:53:41,true,2,,,,,,65100,GEU,,,65201,,,,,,,,,,,,,,,,,,,1996-10-30,F,,,,,,,,,,0,,,,,,
419051693,00010,41905169300010,O,1998-05-02,NN,,,2016-03-03T04:23:46,true,5,,,,,,65100,GEU,,,65201,,,,,,,,,,,,,,,,,,,2013-06-30,F,,,,,56.10C,NAFRev2,O,,,0,,,,,,
419052337,00013,41905233700013,O,1998-05-02,NN,,,2006-11-25T16:00:52,true,3,,,,,,65100,GEU,,,65201,,,,,,,,,,,,,,,,,,,2003-10-01,F,,,,,55.3B,NAFRev1,O,,,0,,,,,,
419142229,00014,41914222900014,O,1990-12-31,NN,,,2008-01-04T23:31:42,true,3,,,,,,65100,GEU,,,65201,,,,,,,,,,,,,,,,,,,2008-01-01,A,,,,,01.42Z,NAFRev2,N,,,0,,,,,,
422654459,00011,42265445900011,O,1996-05-02,NN,,,2008-01-05T00:25:06,true,3,MAISON LA TRILLE,,,,,65100,GEU,,,65201,,,,,,,,,,,,,,,,,,,2008-01-01,A,,,,,82.99Z,NAFRev2,N,,,0,,,,,,
422654459,00029,42265445900029,O,2009-04-01,,,,2021-02-23T11:44:21,false,1,,,,,MAISON LATRILLE,65100,GEU,,,65201,,,,,,,,,,,,,,,,,,,2009-04-01,A,,,,,47.89Z,NAFRev2,N,,,0,,,,,,
425230521,00014,42523052100014,O,1971-10-01,NN,,,,true,3,,,,,,65100,GEU,,,65201,,,,,,,,,,,,,,,,,,,2003-02-20,F,,,,,70.2C,NAFRev1,N,,,0,,,,,,
425238078,00017,42523807800017,O,,,,,,true,1,,,,,,65100,GEU,,,65201,,,,,,,,,,,,,,,,,,,1986-01-01,F,,,,,70.2A,NAF1993,N,,,0,,,,,,
439760513,00010,43976051300010,O,2001-01-01,NN,,,,true,3,,,,,BAYETS,65100,GEU,,,65201,,,,,,,,,,,,,,,,,,,2003-02-20,F,,,,,70.2C,NAFRev1,N,-0.056758,43.039985,0.93,street,Bayets 65100 Geu,65201_fmnyo5,G,BAYETS,
439763459,00013,43976345900013,O,2000-01-01,NN,,,2008-01-04T20:42:09,true,3,,,,RUE,DE PEYREMAILLERE,65100,GEU,,,65201,,,,,,,,,,,,,,,,,,,2008-01-01,A,,,,,68.20B,NAFRev2,N,-0.048482,43.041683,0.89,street,Rue Camin de Peyremaillere 65100 Geu,65201_0072,G,RUE CAMIN DE PEYREMAILLERE,
487645087,00049,48764508700049,O,2018-12-01,,,,2021-02-23T13:51:41,false,1,,17,,,CAMIN TREME SOULE,65100,GEU,,,65201,,,,,,,,,,,,,,,,,,,2018-12-01,A,,,,,68.20A,NAFRev2,N,-0.048477,43.041785,0.94,housenumber,17 Camin Treme Soule 65100 Geu,65201_lyaqm7_00017,G,17 CAMIN TREME SOULE,
487645087,00056,48764508700056,O,2020-11-12,,,,2021-02-24T14:26:53,true,1,,17,,CHE,TREME SOULE,65100,GEU,,,65201,,,,,,,,,,,,,,,,,,,2020-11-12,A,,,,,43.22A,NAFRev2,N,-0.048477,43.041785,0.74,housenumber,17 Camin Treme Soule 65100 Geu,65201_lyaqm7_00017,G,17 CAMIN TREME SOULE,
489368159,00054,48936815900054,O,2020-06-08,,,,2021-02-23T13:54:31,true,1,,5,,CHE,D'ERA LANNE DESSUS,65100,GEU,,,65201,,,,,,,,,,,,,,,,,,,2020-06-08,A,,,,,55.20Z,NAFRev2,N,-0.046919,43.041378,0.59,housenumber,5 Lanne Dessus 65100 Geu,65201_b016_00005,G,5 LANNE DESSUS,
493478010,00025,49347801000025,O,2015-09-17,,,4333ZZ,2021-02-23T14:01:17,true,1,,8,,,CAMIN DETH ESTANQUET,65100,GEU,,,65201,,,,,,,,,,,,,,,,,,,2015-09-17,A,,,,,43.33Z,NAFRev2,N,-0.058205,43.042391,0.93,housenumber,8 Camin Deth Estanquet 65100 Geu,65201_3ejacv_00008,G,8 CAMIN DETH ESTANQUET,
503019176,00042,50301917600042,O,2017-11-28,,,5610CR,2021-02-23T14:14:35,true,1,,21,,,CAMIN DETHS POURETS,65100,GEU,,,65201,,,,,,,,,,,,,,,,,,,2017-11-28,A,,,,,56.10C,NAFRev2,N,-0.04828,43.040697,0.94,housenumber,21 Camin Deths Pourets 65100 Geu,65201_abs0fn_00021,G,21 CAMIN DETHS POURETS,
504497058,00041,50449705800041,O,2011-06-06,,,,2022-03-09T04:06:42,true,4,,10,,,CAMIN DE POUZADE,65100,GEU,,,65201,,,,,,,,,,,,,,,,,,,2022-03-15,F,LA MAISON DU BONNET,,,TIRES REBEHA,47.71Z,NAFRev2,N,-0.0516,43.042055,0.94,housenumber,10 Camin de Pouzade 65100 Geu,65201_13kqo2_00010,G,10 CAMIN DE POUZADE,
510559909,00013,51055990900013,O,2009-01-01,,,,2021-04-07T08:47:26,true,1,,,,CHE,HOUNTDADERRE,65100,GEU,,,65201,,,,,,,,,,,,,,,,,,,2009-01-01,A,,,,,68.20B,NAFRev2,N,-0.049277,43.040953,0.66,street,Camin de Hountdadere 65100 Geu,65201_5stdc4,G,CAMIN DE HOUNTDADERE,
515349397,00015,51534939700015,O,2009-10-01,,,,2018-12-11T09:26:42,false,2,,4,,,CAMIN DETHS POURETS,65100,GEU,,,65201,,,,,,,,,,,,,,,,,,,2012-01-17,F,,,,,43.31Z,NAFRev2,N,-0.049584,43.039766,0.94,housenumber,4 Camin Deths Pourets 65100 Geu,65201_abs0fn_00004,G,4 CAMIN DETHS POURETS,
517915955,00036,51791595500036,O,2014-08-01,,,,2021-11-05T03:41:21,false,3,,10,,,CAMIN DE POUZADE,65100,GEU,,,65201,,,,,,,,,,,,,,,,,,,2020-10-01,F,,,,LAVIGNE PIERRE,47.89Z,NAFRev2,N,-0.0516,43.042055,0.94,housenumber,10 Camin de Pouzade 65100 Geu,65201_13kqo2_00010,G,10 CAMIN DE POUZADE,
519073696,00022,51907369600022,O,2017-08-01,NN,,,2020-08-25T10:33:10,true,2,,22,,,CAMIN DETHS ARIAILS,65100,GEU,,,65201,,,,,,,,,,,,,,,,,,,2018-08-01,F,,,,,43.32A,NAFRev2,O,-0.047083,43.040851,0.94,housenumber,22 Camin Deths Ariails 65100 Geu,65201_bbfbys_00022,G,22 CAMIN DETHS ARIAILS,
519178214,00028,51917821400028,O,2013-02-19,,,,2016-08-05T14:36:18,false,2,,21,,,LOTISSEMENT PELAFFIGUE,65100,GEU,,,65201,,,,,,,,,,,,,,,,,,,2016-03-01,F,,,,,43.21A,NAFRev2,N,,,0,,,,,,
523399525,00022,52339952500022,O,2010-12-16,,,,2011-02-04T08:44:20,false,2,GITE LA GLORIETTE,,,,,65100,GEU,,,65201,,,,,,,,,,,,,,,,,,,2011-01-05,F,,,,,86.90E,NAFRev2,N,,,0,,,,,,
523966265,00010,52396626500010,O,2010-07-23,NN,,,2013-05-18T04:19:09,false,2,,,,,CAMIN DETH LABADE,65100,GEU,,,65201,,,,,,,,,,,,,,,,,,,2011-07-01,F,,,,,43.91B,NAFRev2,O,-0.050354,43.039732,0.94,street,Camin Deth Labade 65100 Geu,65201_y29i0g,G,CAMIN DETH LABADE,
552094112,01891,55209411201891,O,1992-01-01,NN,,,2006-11-03T00:37:43,false,3,,,,,LES ARTIGUES,65100,GEU,,,65201,,,,,,,,,,,,,,,,,,,2004-12-31,F,,,,,41.0Z,NAFRev1,N,-0.1373919,44.9839954,0.89,poi.runway,(Piste) Les Artigues-de-Lussac,https://osm.org/way/171387270,G,,
622770212,00018,62277021200018,O,,,,,,true,1,,,,,,65100,GEU,,,65201,,,,,,,,,,,,,,,,,,,1984-12-25,F,,,,,86.05,NAP,N,,,0,,,,,,
750955171,00038,75095517100038,O,2021-07-01,,,4334ZC,2021-09-04T11:41:24,true,1,,,,,LD CAZAOUS CHEMIN DU BEDAT,65100,GEU,,,65201,,,,,,,,,,,,,,,,,,,2021-07-01,A,,,,DUPEROIR THOMAS,43.34Z,NAFRev2,N,-0.058689,43.032906,0.39,street,Cazaous 65100 Geu,65201_taxal2,G,CAZAOUS,
808929590,00012,80892959000012,O,2015-01-15,,,,2019-01-04T04:39:22,true,2,,3,,RUE,CAMIN DE PEYREMAILLERE,65100,GEU,,,65201,,,,,,,,,,,,,,,,,,,2019-01-01,F,A LA SAVEUR DU PALAIS,,,,56.21Z,NAFRev2,N,-0.048958,43.041796,0.94,housenumber,3 Rue Camin de Peyremaillere 65100 Geu,65201_0072_00003,G,3 RUE CAMIN DE PEYREMAILLERE,
820879831,00015,82087983100015,O,2016-04-18,,,,2022-02-08T04:31:50,true,2,,15,,,CAMI COURREGES,65100,GEU,,,65201,,,,,,,,,,,,,,,,,,,2021-10-31,F,EARL ECURIE ET ELEVAGE THYVALTHE,,,,01.43Z,NAFRev2,N,-0.05289,43.041524,0.83,housenumber,15 Camin de Courreges 65100 Geu,65201_vwqhhu_00015,G,15 CAMIN DE COURREGES,
821684016,00016,82168401600016,O,2016-08-01,,,,2020-03-26T08:37:38,false,2,,,,,LAS ARTIGUES,65100,GEU,,,65201,,,,,,,,,,,,,,,,,,,2016-12-31,F,,,,BOD AUDIO-VIDEO SYSTEMES,47.59B,NAFRev2,N,-0.6897894,44.1312826,0.89,poi.stream,Ruisseau de Las Artigues Sabres,https://osm.org/relation/6748758,G,,
821684016,00024,82168401600024,O,2020-03-28,,,,2023-01-03T08:47:11,false,1,,12,,RUE,CAMINAU DE GER,65100,GEU,,,65201,,,,,,,,,,,,,,,,,,,2020-03-28,A,BODNAMIEL,,,,01.49Z,NAFRev2,N,-0.058055,43.040646,0.93,housenumber,12 Rue Caminau de Ger 65100 Geu,65201_0061_00012,G,12 RUE CAMINAU DE GER,
821684016,00032,82168401600032,O,2022-12-23,,,9511ZZ,2023-01-03T08:47:11,true,1,,12,,,CAMINAU DE GER,65100,GEU,,,65201,,,,,,,,,,,,,,,,,,,2022-12-23,A,,,,BODNAMIEL,95.11Z,NAFRev2,N,-0.057183,43.040904,0.93,housenumber,12 Caminau de Ger 65100 Geu,65201_82naxj_00012,G,12 CAMINAU DE GER,
825044670,00024,82504467000024,O,2017-09-04,,,,2017-08-24T08:32:54,false,1,,,,LD,CAZAOUS,65100,GEU,,,65201,,,,,,,,,,,,,,,,,,,2017-09-04,A,,,,,01.13Z,NAFRev2,N,-0.058689,43.032906,0.93,street,Cazaous 65100 Geu,65201_taxal2,G,CAZAOUS,
825044670,00032,82504467000032,O,2021-07-01,,,4334ZC,2021-09-04T12:41:13,true,1,,,,,LD CAZAOUS CHEMIN DU BEDAT,65100,GEU,,,65201,,,,,,,,,,,,,,,,,,,2021-07-01,A,,,,CAZAJOUS CORALIE,43.34Z,NAFRev2,N,-0.058689,43.032906,0.39,street,Cazaous 65100 Geu,65201_taxal2,G,CAZAOUS,
832333678,00015,83233367800015,O,2017-10-01,,,1413ZG,2017-11-07T09:29:13,true,1,,20,,,CAMIN DES COURREGES,65100,GEU,,,65201,,,,,,,,,,,,,,,,,,,2017-10-01,A,,,,LA BOBINE SE DEFILE,14.13Z,NAFRev2,N,-0.051559,43.041343,0.86,housenumber,20 Camin de Courreges 65100 Geu,65201_vwqhhu_00020,G,20 CAMIN DE COURREGES,
840404206,00012,84040420600012,O,2018-05-30,,,,2021-07-20T08:55:56,true,2,,18,,,CAMIN DETHS ARIAILS,65100,GEU,,,65201,,,,,,,,,,,,,,,,,,,2020-12-31,F,,,,,68.31Z,NAFRev2,N,-0.047034,43.040531,0.94,housenumber,18 Camin Deths Ariails 65100 Geu,65201_bbfbys_00018,G,18 CAMIN DETHS ARIAILS,
840798243,00019,84079824300019,O,2018-07-02,,,4332AA,2018-07-03T19:32:33,true,1,,22,,,CAMIN DETHS ARIAILS,65100,GEU,,,65201,,,,,,,,,,,,,,,,,,,2018-07-02,A,,,,,43.32A,NAFRev2,N,-0.047083,43.040851,0.94,housenumber,22 Camin Deths Ariails 65100 Geu,65201_bbfbys_00022,G,22 CAMIN DETHS ARIAILS,
847894565,00013,84789456500013,O,2019-01-15,,,4322BA,2022-08-04T03:43:04,false,2,,57,,,CAMIN DE LONGARRIOU,65100,GEU,,,65201,,,,,,,,,,,,,,,,,,,2020-03-01,F,,,,,43.22B,NAFRev2,N,-0.051057,43.04069,0.94,housenumber,57 Camin de Longarriou 65100 Geu,65201_3cl824_00057,G,57 CAMIN DE LONGARRIOU,
880818208,00014,88081820800014,O,2019-11-30,,,9602BA,2021-10-04T10:48:05,true,3,,54,,CHE,CAMIN DE LONGARRIOU,65100,GEU,,,65201,,,,,,,,,,,,,,,,,,,2021-10-01,A,,,,MADEMOISELLE PREND SOIN D'ELLE BY LS,96.02B,NAFRev2,N,-0.051411,43.040627,0.82,housenumber,54 Camin de Longarriou 65100 Geu,65201_3cl824_00054,G,54 CAMIN DE LONGARRIOU,
892348632,00019,89234863200019,O,2020-11-28,,,,2020-12-24T19:33:45,true,1,,20,,CHE,DES COURREGES,65100,GEU,,,65201,,,,,,,,,,,,,,,,,,,2020-11-28,A,,,,,70.10Z,NAFRev2,N,-0.051559,43.041343,0.66,housenumber,20 Camin de Courreges 65100 Geu,65201_vwqhhu_00020,G,20 CAMIN DE COURREGES,
902335686,00017,90233568600017,O,2021-09-01,,,4332BB,2021-08-18T03:40:15,true,1,,14,,,CAMIN DETH ARIAILS,65100,GEU,,,65201,,,,,,,,,,,,,,,,,,,2021-09-01,A,,,,YOHAN SERRURERIE,43.32B,NAFRev2,N,-0.04708,43.040356,0.86,housenumber,14 Camin Deths Ariails 65100 Geu,65201_bbfbys_00014,G,14 CAMIN DETHS ARIAILS,
912631991,00011,91263199100011,O,2022-04-20,,,9529ZC,2022-04-21T03:57:30,true,1,,17,,RUE,CAMINAU DE GER,65100,GEU,,,65201,,,,,,,,,,,,,,,,,,,2022-04-20,A,,,,B COUTURE,95.29Z,NAFRev2,N,-0.056401,43.039564,0.93,housenumber,17 Rue Caminau de Ger 65100 Geu,65201_0061_00017,G,17 RUE CAMINAU DE GER,
913891966,00016,91389196600016,O,2022-05-17,,,,2022-05-30T08:55:53,true,1,,12,,,CAMI DE GER ,65100,GEU,,,65201,,,,,,,,,,,,,,,,,,,2022-05-17,A,,,,,68.20B,NAFRev2,N,-0.057183,43.040904,0.81,housenumber,12 Caminau de Ger 65100 Geu,65201_82naxj_00012,G,12 CAMINAU DE GER,
919708677,00019,91970867700019,O,2021-06-29,,,,2022-09-27T19:40:51,true,1,,17,,,CAMIN TREME SOULE,65100,GEU,,,65201,,,,,,,,,,,,,,,,,,,2021-06-29,A,,,,,88.99B,NAFRev2,N,-0.048477,43.041785,0.94,housenumber,17 Camin Treme Soule 65100 Geu,65201_lyaqm7_00017,G,17 CAMIN TREME SOULE,
920941895,00012,92094189500012,O,2022-10-03,,,,2022-10-31T09:18:54,true,1,,21,,,CAMIN DETHS POURETS,65100,GEU,,,65201,,,,,,,,,,,,,,,,,,,2022-10-03,A,,,,,94.99Z,NAFRev2,N,-0.04828,43.040697,0.94,housenumber,21 Camin Deths Pourets 65100 Geu,65201_abs0fn_00021,G,21 CAMIN DETHS POURETS,
922114061,00018,92211406100018,O,2022-11-15,,,,2022-12-12T09:45:03,true,1,,21,,,CAMIN DETHS POURETS,65100,GEU,,,65201,,,,,,,,,,,,,,,,,,,2022-11-15,A,,,,,58.11Z,NAFRev2,N,-0.04828,43.040697,0.94,housenumber,21 Camin Deths Pourets 65100 Geu,65201_abs0fn_00021,G,21 CAMIN DETHS POURETS,
948368972,00014,94836897200014,O,2023-01-24,,,,2023-01-24T18:03:42,true,1,,20,,CAMI,DE COURREGES,65100,GEU,,,65201,,,,,,,,,,,,,,,,,,,2023-01-24,A,,,,,70.10Z,NAFRev2,N,-0.051559,43.041343,0.85,housenumber,20 Camin de Courreges 65100 Geu,65201_vwqhhu_00020,G,20 CAMIN DE COURREGES,
