siren,nic,siret,statutDiffusionEtablissement,dateCreationEtablissement,trancheEffectifsEtablissement,anneeEffectifsEtablissement,activitePrincipaleRegistreMetiersEtablissement,dateDernierTraitementEtablissement,etablissementSiege,nombrePeriodesEtablissement,complementAdresseEtablissement,numeroVoieEtablissement,indiceRepetitionEtablissement,typeVoieEtablissement,libelleVoieEtablissement,codePostalEtablissement,libelleCommuneEtablissement,libelleCommuneEtrangerEtablissement,distributionSpecialeEtablissement,codeCommuneEtablissement,codeCedexEtablissement,libelleCedexEtablissement,codePaysEtrangerEtablissement,libellePaysEtrangerEtablissement,complementAdresse2Etablissement,numeroVoie2Etablissement,indiceRepetition2Etablissement,typeVoie2Etablissement,libelleVoie2Etablissement,codePostal2Etablissement,libelleCommune2Etablissement,libelleCommuneEtranger2Etablissement,distributionSpeciale2Etablissement,codeCommune2Etablissement,codeCedex2Etablissement,libelleCedex2Etablissement,codePaysEtranger2Etablissement,libellePaysEtranger2Etablissement,dateDebut,etatAdministratifEtablissement,enseigne1Etablissement,enseigne2Etablissement,enseigne3Etablissement,denominationUsuelleEtablissement,activitePrincipaleEtablissement,nomenclatureActivitePrincipaleEtablissement,caractereEmployeurEtablissement,longitude,latitude,geo_score,geo_type,geo_adresse,geo_id,geo_ligne,geo_l4,geo_l5
217105196,00018,21710519600018,O,1983-03-01,01,2020,,2022-08-29T09:08:40,true,4,,,,,,71310,SERRIGNY-EN-BRESSE,,,71519,,,,,,,,,,,,,,,,,,,2008-01-01,A,MAIRIE,,,,84.11Z,NAFRev2,O,,,0,,,,,,
267105633,00015,26710563300015,O,1986-01-01,NN,,,2019-11-14T14:00:55,true,3,,,,,MAIRIE,71310,SERRIGNY-EN-BRESSE,,,71519,,,,,,,,,,,,,,,,,,,2008-01-01,A,CCAS,,,,88.99B,NAFRev2,N,3.0709671,50.6304695,0.92,poi.townhall,Hôtel de Ville Lille,https://osm.org/way/40917078,G,,
305417123,00026,30541712300026,O,,NN,,,2019-11-14T14:00:55,true,1,,,,LD,LE BOUCHAT,71310,SERRIGNY-EN-BRESSE,,,71519,,,,,,,,,,,,,,,,,,,1994-12-31,F,,,,,45.3E,NAF1993,N,5.111049,46.830272,0.92,street,Chemin le Bouchat 71310 Serrigny-en-Bresse,71519_0001,G,CHEMIN LE BOUCHAT,
309832053,00016,30983205300016,O,1977-01-01,NN,,4334ZC,2019-11-14T14:00:55,false,4,,,,LD,BARAUD,71310,SERRIGNY-EN-BRESSE,,,71519,,,,,,,,,,,,,,,,,,,2009-01-01,F,,,,,43.34Z,NAFRev2,N,-0.1329932,45.6225399,0.75,poi.castle,Château Barraud Bouteville,https://osm.org/node/5076842031,G,,
312918717,00033,31291871700033,O,1998-01-01,NN,,,2019-11-14T14:00:55,true,3,,,,,VILLEGAUDIN,71310,SERRIGNY-EN-BRESSE,,,71519,,,,,,,,,,,,,,,,,,,2008-01-01,A,,,,,02.10Z,NAFRev2,N,5.119376,46.811821,0.47,street,Chemin de Villeneuve 71310 Serrigny-en-Bresse,71519_0105,G,CHEMIN DE VILLENEUVE,
329688246,00035,32968824600035,O,1991-05-01,NN,,,2021-02-23T10:50:26,false,4,,2,,CHE,DU PLATOT,71310,SERRIGNY-EN-BRESSE,,,71519,,,,,,,,,,,,,,,,,,,2000-08-03,A,,,,DARLING DOG,01.49Z,NAFRev2,N,5.132177,46.817948,0.82,housenumber,2 Chemin du Platot 71310 Serrigny-en-Bresse,71519_0065_00002,G,2 CHEMIN DU PLATOT,
337602726,00016,33760272600016,O,1986-01-01,NN,,4322AZ,2019-11-14T14:00:55,true,3,,,,LD,LE BOUCHAT,71310,SERRIGNY-EN-BRESSE,,,71519,,,,,,,,,,,,,,,,,,,2008-01-01,A,,,,,43.22A,NAFRev2,N,5.111049,46.830272,0.92,street,Chemin le Bouchat 71310 Serrigny-en-Bresse,71519_0001,G,CHEMIN LE BOUCHAT,
337602726,00024,33760272600024,O,2000-01-01,NN,,,2019-11-14T14:00:55,false,3,,,,,LE BOUCHAT,71310,SERRIGNY-EN-BRESSE,,,71519,,,,,,,,,,,,,,,,,,,2008-01-01,A,,,,,01.43Z,NAFRev2,N,5.111049,46.830272,0.92,street,Chemin le Bouchat 71310 Serrigny-en-Bresse,71519_0001,G,CHEMIN LE BOUCHAT,
337602908,00010,33760290800010,O,,NN,,,2019-11-14T14:00:55,true,1,,,,LD,LE BOUCHAT,71310,SERRIGNY-EN-BRESSE,,,71519,,,,,,,,,,,,,,,,,,,1994-12-31,F,,,,,45.3E,NAF1993,N,5.111049,46.830272,0.92,street,Chemin le Bouchat 71310 Serrigny-en-Bresse,71519_0001,G,CHEMIN LE BOUCHAT,
395366784,00019,39536678400019,O,,NN,,,2019-11-14T14:00:55,true,1,,,,,LA COTTIERE,71310,SERRIGNY-EN-BRESSE,,,71519,,,,,,,,,,,,,,,,,,,1996-10-31,F,,,,,01.3Z,NAF1993,N,5.135291,46.81813,0.91,street,Chemin de la Cottiere 71310 Serrigny-en-Bresse,71519_0030,G,CHEMIN DE LA COTTIERE,
397655705,00010,39765570500010,O,1981-01-01,NN,,,2019-11-14T14:00:55,false,3,,,,,LA GRANGE DES BOIS,71310,SERRIGNY-EN-BRESSE,,,71519,,,,,,,,,,,,,,,,,,,2006-12-31,F,,,,,01.3Z,NAFRev1,N,2.2595457,48.4783908,0.9,poi.track,Chemin de la Grange des Bois Villeneuve-sur-Auvers,https://osm.org/way/385605630,G,,
397655705,00028,39765570500028,O,2018-08-14,,,,2021-02-23T11:21:25,true,1,,4,,CHE,DE POUILLY,71310,SERRIGNY-EN-BRESSE,,,71519,,,,,,,,,,,,,,,,,,,2018-08-14,A,,,,,35.11Z,NAFRev2,N,5.121812,46.82478,0.83,housenumber,4 Chemin de Pouilly 71310 Serrigny-en-Bresse,71519_0080_00004,G,4 CHEMIN DE POUILLY,
397655721,00017,39765572100017,O,1986-11-01,NN,,,2019-11-14T14:00:55,false,4,,,,,,71310,SERRIGNY-EN-BRESSE,,,71519,,,,,,,,,,,,,,,,,,,2003-03-31,F,,,,,01.1A,NAFRev1,N,,,0,,,,,,
397655721,00025,39765572100025,O,2004-07-01,NN,,,2019-11-14T14:00:55,true,4,,,,,PETIT VELARD,71310,SERRIGNY-EN-BRESSE,,,71519,,,,,,,,,,,,,,,,,,,2008-11-30,F,,,,,01.11Z,NAFRev2,N,5.108074,46.806093,0.91,street,Chemin du Petit Velard 71310 Serrigny-en-Bresse,71519_0060,G,CHEMIN DU PETIT VELARD,
397791856,00016,39779185600016,O,1900-01-01,NN,,,2019-11-14T14:00:55,false,2,,,,LD,FUSSEY,71310,SERRIGNY-EN-BRESSE,,,71519,,,,,,,,,,,,,,,,,,,1994-08-31,F,,,,,,,,5.134592,46.824346,0.37,street,Chemin du Rothey 71310 Serrigny-en-Bresse,71519_0090,G,CHEMIN DU ROTHEY,
398332478,00013,39833247800013,O,,NN,,,2019-11-14T14:00:55,true,1,,,,,LE VELARD,71310,SERRIGNY-EN-BRESSE,,,71519,,,,,,,,,,,,,,,,,,,1994-12-31,F,,,,,01.3Z,NAF1993,N,5.117992,46.808975,0.64,street,Impasse du Velard 71310 Serrigny-en-Bresse,71519_0100,G,IMPASSE DU VELARD,
399563949,00011,39956394900011,O,1995-01-01,NN,,,2019-11-14T14:00:55,true,3,,,,,,71310,SERRIGNY-EN-BRESSE,,,71519,,,,,,,,,,,,,,,,,,,2008-01-01,A,,,,,01.11Z,NAFRev2,N,,,0,,,,,,
401206586,00018,40120658600018,O,1995-01-01,NN,,,2019-11-14T14:00:55,true,1,,,,,LE VELARD,71310,SERRIGNY-EN-BRESSE,,,71519,,,,,,,,,,,,,,,,,,,2000-11-10,F,,,,,01.3Z,NAF1993,N,5.117992,46.808975,0.64,street,Impasse du Velard 71310 Serrigny-en-Bresse,71519_0100,G,IMPASSE DU VELARD,
401234257,00020,40123425700020,O,2006-12-05,,,,2021-02-23T11:25:12,true,3,LE BOUCHAT,6,,CHE,DU CLOUZOT,71310,SERRIGNY-EN-BRESSE,,,71519,,,,,,,,,,,,,,,,,,,2019-01-17,A,AUX BONBECS,,,AU PLAISIR GLACE,47.81Z,NAFRev2,N,5.111908,46.830538,0.83,housenumber,6 Chemin du Clouzot 71310 Serrigny-en-Bresse,71519_0025_00006,G,6 CHEMIN DU CLOUZOT,
409825908,00018,40982590800018,O,1982-12-31,NN,,,2019-11-14T14:00:55,true,4,,,,,LE BOURG,71310,SERRIGNY-EN-BRESSE,,,71519,,,,,,,,,,,,,,,,,,,2008-08-31,F,,,,,01.50Z,NAFRev2,N,5.111049,46.830272,0.61,street,Chemin le Bouchat 71310 Serrigny-en-Bresse,71519_0001,G,CHEMIN LE BOUCHAT,
412295669,00011,41229566900011,O,1982-12-31,NN,,,2019-11-14T14:00:55,true,1,,,,,LA COLTIERE,71310,SERRIGNY-EN-BRESSE,,,71519,,,,,,,,,,,,,,,,,,,1998-05-21,F,,,,,01.1A,NAF1993,N,5.135291,46.81813,0.69,street,Chemin de la Cottiere 71310 Serrigny-en-Bresse,71519_0030,G,CHEMIN DE LA COTTIERE,
419490081,00017,41949008100017,O,1998-05-21,,,,2019-11-14T14:00:55,true,1,,,,,LA COTTIERE,71310,SERRIGNY-EN-BRESSE,,,71519,,,,,,,,,,,,,,,,,,,1998-11-10,F,,,,,01.3Z,NAF1993,N,5.135291,46.81813,0.91,street,Chemin de la Cottiere 71310 Serrigny-en-Bresse,71519_0030,G,CHEMIN DE LA COTTIERE,
428902423,00030,42890242300030,O,2011-01-01,,,,2019-11-14T14:00:55,true,2,,7,,CHE,DE POUILLY,71310,SERRIGNY-EN-BRESSE,,,71519,,,,,,,,,,,,,,,,,,,2011-12-31,F,BRESSE INTERIEUR,,,BRESSE INTERIEUR,43.31Z,NAFRev2,N,5.109748,46.828071,0.83,housenumber,7 Chemin de Pouilly 71310 Serrigny-en-Bresse,71519_0080_00007,G,7 CHEMIN DE POUILLY,
428918361,00018,42891836100018,O,,NN,,,2019-11-14T14:00:55,true,1,,,,,,71310,SERRIGNY-EN-BRESSE,,,71519,,,,,,,,,,,,,,,,,,,2002-01-25,F,,,,,02.0D,NAF1993,N,,,0,,,,,,
428918585,00012,42891858500012,O,,NN,,,2019-11-14T14:00:55,true,1,,,,,,71310,SERRIGNY-EN-BRESSE,,,71519,,,,,,,,,,,,,,,,,,,2002-01-25,F,,,,,02.0D,NAF1993,N,,,0,,,,,,
432778892,00013,43277889200013,O,2000-09-06,NN,,,2019-11-14T14:00:55,true,3,,,,,LE VELARD,71310,SERRIGNY-EN-BRESSE,,,71519,,,,,,,,,,,,,,,,,,,2008-01-01,A,,,,,68.20B,NAFRev2,N,5.117992,46.808975,0.64,street,Impasse du Velard 71310 Serrigny-en-Bresse,71519_0100,G,IMPASSE DU VELARD,
447546938,00013,44754693800013,O,2003-03-01,NN,,,2019-11-14T14:00:55,false,4,LA COLTIERE,1,,CHE,DE ROTHEY,71310,SERRIGNY-EN-BRESSE,,,71519,,,,,,,,,,,,,,,,,,,2004-12-25,F,,,,,52.6E,NAFRev1,N,5.13087,46.824048,0.65,housenumber,1 Chemin du Rothey 71310 Serrigny-en-Bresse,71519_0090_00001,G,1 CHEMIN DU ROTHEY,
448295758,00016,44829575800016,O,2003-04-22,NN,,,2019-11-14T14:00:55,true,3,,,,HAM,DE BARAUD,71310,SERRIGNY-EN-BRESSE,,,71519,,,,,,,,,,,,,,,,,,,2008-01-01,A,,,,,68.20B,NAFRev2,N,0.3708221,45.0315731,0.8,poi,Rue de Barraud (Pont) Mussidan,https://osm.org/way/283784486,G,,
477559892,00021,47755989200021,O,2010-10-23,,,,2021-02-23T13:38:58,true,1,,1,,IMP,DE LA COTTIERE,71310,SERRIGNY-EN-BRESSE,,,71519,,,,,,,,,,,,,,,,,,,2010-10-23,A,,,,,68.20B,NAFRev2,N,5.132472,46.819431,0.84,housenumber,1 Impasse de la Cottière 71310 Serrigny-en-Bresse,71519_0031_00001,G,1 IMPASSE DE LA COTTIERE,
488812298,00021,48881229800021,O,2008-11-01,01,2020,,2022-08-29T09:20:53,true,4,1 ET,3,,RUE,DU BOURG,71310,SERRIGNY-EN-BRESSE,,,71519,,,,,,,,,,,,,,,,,,,2020-09-07,A,,,,,58.19Z,NAFRev2,O,5.116438,46.817395,0.94,housenumber,3 Rue du Bourg 71310 Serrigny-en-Bresse,71519_0005_00003,G,3 RUE DU BOURG,
493943807,00013,49394380700013,O,2007-02-01,NN,,,2019-11-14T14:00:55,true,4,,4,,CHE,DE ROTHEY,71310,SERRIGNY-EN-BRESSE,,,71519,,,,,,,,,,,,,,,,,,,2008-01-01,A,,,,,81.30Z,NAFRev2,O,5.134204,46.824076,0.65,housenumber,4 Chemin du Rothey 71310 Serrigny-en-Bresse,71519_0090_00004,G,4 CHEMIN DU ROTHEY,
502303761,00014,50230376100014,O,2008-02-01,,,,2019-11-14T14:00:55,false,2,,,,,LE BARRAUD,71310,SERRIGNY-EN-BRESSE,,,71519,,,,,,,,,,,,,,,,,,,2011-01-14,F,A.M.S.E.,,,,68.20B,NAFRev2,N,0.3896559,44.6590845,0.81,poi.stream,Le Pont Barraud (Ruisseau) Eymet,https://osm.org/way/117208626,G,,
508475852,00010,50847585200010,O,2008-10-06,,,,2019-11-14T14:00:55,true,2,,16,,CHE,DE VILLENEUVE,71310,SERRIGNY-EN-BRESSE,,,71519,,,,,,,,,,,,,,,,,,,2009-06-30,F,,,,,96.02B,NAFRev2,N,5.123255,46.819331,0.85,housenumber,16 Chemin de Villeneuve 71310 Serrigny-en-Bresse,71519_0105_00016,G,16 CHEMIN DE VILLENEUVE,
509168282,00010,50916828200010,O,2008-12-01,03,2020,,2022-08-29T09:12:08,true,1,,1,,CHE,DU PETIT VELARD,71310,SERRIGNY-EN-BRESSE,,,71519,,,,,,,,,,,,,,,,,,,2008-12-01,A,,,,,01.50Z,NAFRev2,O,5.108073,46.806874,0.85,housenumber,1 Chemin du Petit Velard 71310 Serrigny-en-Bresse,71519_0060_00001,G,1 CHEMIN DU PETIT VELARD,
514496983,00016,51449698300016,O,2009-09-07,,,,2019-11-14T14:00:55,true,2,,,,CHE,LE BOUCHAT,71310,SERRIGNY-EN-BRESSE,,,71519,,,,,,,,,,,,,,,,,,,2012-10-31,F,DAME DE CARREAUX,,,,43.33Z,NAFRev2,N,5.111049,46.830272,0.81,street,Chemin le Bouchat 71310 Serrigny-en-Bresse,71519_0001,G,CHEMIN LE BOUCHAT,
517534293,00017,51753429300017,O,2009-09-15,,,,2019-11-14T14:00:55,true,1,,,,,LE BOURG,71310,SERRIGNY-EN-BRESSE,,,71519,,,,,,,,,,,,,,,,,,,2009-09-15,A,,,,,43.22A,NAFRev2,N,5.111049,46.830272,0.61,street,Chemin le Bouchat 71310 Serrigny-en-Bresse,71519_0001,G,CHEMIN LE BOUCHAT,
518649728,00012,51864972800012,O,2010-04-01,,,,2019-11-14T14:00:55,true,1,,2,,CHE,COTTIERE,71310,SERRIGNY-EN-BRESSE,,,71519,,,,,,,,,,,,,,,,,,,2010-04-01,A,SCHAARM ELEVAGE,,,,01.49Z,NAFRev2,N,5.136117,46.816067,0.8,housenumber,2 Chemin de la Cottiere 71310 Serrigny-en-Bresse,71519_0030_00002,G,2 CHEMIN DE LA COTTIERE,
518737374,00018,51873737400018,O,2010-01-04,,,,2019-11-14T14:00:55,false,2,,6,,RTE,DE LA VILLENEUVE,71310,SERRIGNY-EN-BRESSE,,,71519,,,,,,,,,,,,,,,,,,,2011-09-30,F,BEA-SERENITE,,,,47.99A,NAFRev2,N,2.8525185,47.5505345,0.82,poi,Route de la Villeneuve (Pont) Bonny-sur-Loire,https://osm.org/way/353667254,G,,
527671820,00035,52767182000035,O,2012-09-01,,,,2019-11-14T14:00:55,false,2,,7,,CHE,DE POUILLY,71310,SERRIGNY-EN-BRESSE,,,71519,,,,,,,,,,,,,,,,,,,2014-09-01,F,,,,,85.51Z,NAFRev2,N,5.109748,46.828071,0.83,housenumber,7 Chemin de Pouilly 71310 Serrigny-en-Bresse,71519_0080_00007,G,7 CHEMIN DE POUILLY,
528063597,00017,52806359700017,O,2010-11-01,,,,2019-11-14T14:00:55,true,1,,7,,CHE,DE POUILLY,71310,SERRIGNY-EN-BRESSE,,,71519,,,,,,,,,,,,,,,,,,,2010-11-01,A,,,,,47.91A,NAFRev2,N,5.109748,46.828071,0.83,housenumber,7 Chemin de Pouilly 71310 Serrigny-en-Bresse,71519_0080_00007,G,7 CHEMIN DE POUILLY,
529147589,00020,52914758900020,O,2011-08-11,NN,,4331ZB,2021-01-29T03:33:38,true,3,,5,,RTE,DE CHALON,71310,SERRIGNY-EN-BRESSE,,,71519,,,,,,,,,,,,,,,,,,,2019-09-27,F,,,,,43.31Z,NAFRev2,O,5.123624,46.810763,0.82,housenumber,5 Route de Chalon 71310 Serrigny-en-Bresse,71519_0015_00005,G,5 ROUTE DE CHALON,
530640549,00016,53064054900016,O,2011-02-28,,,,2019-11-14T14:00:55,true,2,,5,,CHE,DU BOUCHAT,71310,SERRIGNY-EN-BRESSE,,,71519,,,,,,,,,,,,,,,,,,,2013-01-22,F,,,,,81.30Z,NAFRev2,N,3.8495673,48.5032821,0.83,poi.track,Ruelle du Bouchat (Chemin) Châtres,https://osm.org/way/151074038,G,,
531108728,00019,53110872800019,O,2011-04-01,,,,2019-11-14T14:00:55,true,2,,1,,IMP,DE LA COTTIERE,71310,SERRIGNY-EN-BRESSE,,,71519,,,,,,,,,,,,,,,,,,,2018-02-01,F,,,,,74.10Z,NAFRev2,N,5.132472,46.819431,0.84,housenumber,1 Impasse de la Cottière 71310 Serrigny-en-Bresse,71519_0031_00001,G,1 IMPASSE DE LA COTTIERE,
531145282,00012,53114528200012,O,2011-03-21,,,,2019-11-14T14:00:55,false,2,,6,,CHE,PLATOT,71310,SERRIGNY-EN-BRESSE,,,71519,,,,,,,,,,,,,,,,,,,2015-01-30,F,,,,,68.20B,NAFRev2,N,5.123818,46.819557,0.79,housenumber,6 Chemin du Platot 71310 Serrigny-en-Bresse,71519_0065_00006,G,6 CHEMIN DU PLATOT,
531948412,00014,53194841200014,O,2011-05-02,,,,2019-11-14T14:00:55,false,2,,1,,CHE,DE ROTHEY,71310,SERRIGNY-EN-BRESSE,,,71519,,,,,,,,,,,,,,,,,,,2014-04-01,F,,,,,46.19B,NAFRev2,N,5.13087,46.824048,0.65,housenumber,1 Chemin du Rothey 71310 Serrigny-en-Bresse,71519_0090_00001,G,1 CHEMIN DU ROTHEY,
532398203,00010,53239820300010,O,2011-07-01,,,,2019-11-14T14:00:55,true,1,,1,,RTE,DE CHALON,71310,SERRIGNY-EN-BRESSE,,,71519,,,,,,,,,,,,,,,,,,,2011-07-01,A,,,,,47.78B,NAFRev2,N,5.107958,46.811646,0.82,housenumber,1 Route de Chalon 71310 Serrigny-en-Bresse,71519_0015_00001,G,1 ROUTE DE CHALON,
533219259,00017,53321925900017,O,2011-07-01,,,,2019-11-14T14:00:55,false,3,,5,,CHE,DU BOUCHAT,71310,SERRIGNY-EN-BRESSE,,,71519,,,,,,,,,,,,,,,,,,,2012-08-01,F,,,,,96.09Z,NAFRev2,N,3.8495673,48.5032821,0.83,poi.track,Ruelle du Bouchat (Chemin) Châtres,https://osm.org/way/151074038,G,,
534892237,00023,53489223700023,O,2011-10-01,,,,2021-02-23T15:56:49,false,1,,,,,LE VELARD 4,71310,SERRIGNY-EN-BRESSE,,,71519,,,,,,,,,,,,,,,,,,,2011-10-01,A,,,,,46.90Z,NAFRev2,N,5.117992,46.808975,0.54,street,Impasse du Velard 71310 Serrigny-en-Bresse,71519_0100,G,IMPASSE DU VELARD,
752278796,00012,75227879600012,O,2012-06-23,,,,2019-11-14T14:00:55,true,1,,12,,RUE,DU BOURG,71310,SERRIGNY-EN-BRESSE,,,71519,,,,,,,,,,,,,,,,,,,2012-06-23,A,,,,,94.99Z,NAFRev2,N,5.116786,46.816792,0.94,housenumber,12 Rue du Bourg 71310 Serrigny-en-Bresse,71519_0005_00012,G,12 RUE DU BOURG,
792337008,00025,79233700800025,O,2015-03-01,,,,2019-11-14T14:00:55,true,2,,3,,CHE,ROTHEY,71310,SERRIGNY-EN-BRESSE,,,71519,,,,,,,,,,,,,,,,,,,2017-07-10,F,,,,,85.52Z,NAFRev2,N,5.138089,46.824981,0.79,housenumber,3 Chemin du Rothey 71310 Serrigny-en-Bresse,71519_0090_00003,G,3 CHEMIN DU ROTHEY,
817792617,00018,81779261700018,O,2016-01-18,,,,2019-11-14T14:00:55,true,1,LE BOUCHAT,4,,CHE,DU CLOUZOT,71310,SERRIGNY-EN-BRESSE,,,71519,,,,,,,,,,,,,,,,,,,2016-01-18,A,,,,,70.10Z,NAFRev2,N,5.112708,46.830634,0.83,housenumber,4 Chemin du Clouzot 71310 Serrigny-en-Bresse,71519_0025_00004,G,4 CHEMIN DU CLOUZOT,
819900366,00017,81990036600017,O,2015-06-28,,,,2019-11-14T14:00:55,true,1,,,,,,71310,SERRIGNY-EN-BRESSE,,,71519,,,,,,,,,,,,,,,,,,,2015-06-28,A,,,,,93.19Z,NAFRev2,N,,,0,,,,,,
819970096,00015,81997009600015,O,2014-05-21,,,,2019-11-14T14:00:55,true,2,,11,,CHE,DE VILLENEUVE,71310,SERRIGNY-EN-BRESSE,,,71519,,,,,,,,,,,,,,,,,,,2018-04-06,F,,,,,94.99Z,NAFRev2,N,5.123146,46.81943,0.85,housenumber,11 Chemin de Villeneuve 71310 Serrigny-en-Bresse,71519_0105_00011,G,11 CHEMIN DE VILLENEUVE,
819970781,00012,81997078100012,O,2004-01-17,,,,2019-11-14T14:00:55,true,1,MAIRIE DE SERRIGNY-EN-BRESSE,12,,RUE,DU BOURG,71310,SERRIGNY-EN-BRESSE,,,71519,,,,,,,,,,,,,,,,,,,2004-01-17,A,,,,,94.99Z,NAFRev2,N,5.116786,46.816792,0.94,housenumber,12 Rue du Bourg 71310 Serrigny-en-Bresse,71519_0005_00012,G,12 RUE DU BOURG,
821844883,00024,82184488300024,O,2019-01-17,,,,2019-11-14T14:00:55,true,1,,9,,RUE,DU BOURG,71310,SERRIGNY-EN-BRESSE,,,71519,,,,,,,,,,,,,,,,,,,2019-01-17,A,,,,,68.20B,NAFRev2,N,5.121997,46.819472,0.94,housenumber,9 Rue du Bourg 71310 Serrigny-en-Bresse,71519_0005_00009,G,9 RUE DU BOURG,
823635008,00027,82363500800027,O,2022-04-01,,,9602AB,2022-05-07T12:33:56,true,1,,26,A,RUE,DU BOURG,71310,SERRIGNY-EN-BRESSE,,,71519,,,,,,,,,,,,,,,,,,,2022-04-01,A,ANELYSE COIFFURE,,,ANELYSE COIFFURE,96.02A,NAFRev2,N,5.121279,46.819063,0.94,housenumber,26a Rue du Bourg 71310 Serrigny-en-Bresse,71519_0005_00026_a,G,26A RUE DU BOURG,
839311115,00019,83931111500019,O,2018-04-27,,,,2019-11-14T14:00:55,true,1,LE BOUCHAT,4,,CHE,DU CLOUZOT,71310,SERRIGNY-EN-BRESSE,,,71519,,,,,,,,,,,,,,,,,,,2018-04-27,A,,,,,68.20B,NAFRev2,N,5.112708,46.830634,0.83,housenumber,4 Chemin du Clouzot 71310 Serrigny-en-Bresse,71519_0025_00004,G,4 CHEMIN DU CLOUZOT,
839365251,00017,83936525100017,O,2018-05-01,,,,2019-11-14T14:00:55,true,1,,,,LD,FUSSEY,71310,SERRIGNY-EN-BRESSE,,,71519,,,,,,,,,,,,,,,,,,,2018-05-01,A,LES ESCARGOTS DE L'ETANG,,,,01.49Z,NAFRev2,N,5.134592,46.824346,0.37,street,Chemin du Rothey 71310 Serrigny-en-Bresse,71519_0090,G,CHEMIN DU ROTHEY,
847537404,00018,84753740400018,O,2019-01-17,,,,2019-11-14T14:00:55,true,1,,9,,RUE,DU BOURG,71310,SERRIGNY-EN-BRESSE,,,71519,,,,,,,,,,,,,,,,,,,2019-01-17,A,,,,,68.20B,NAFRev2,N,5.121997,46.819472,0.94,housenumber,9 Rue du Bourg 71310 Serrigny-en-Bresse,71519_0005_00009,G,9 RUE DU BOURG,
882096621,00017,88209662100017,O,2019-08-01,,,,2020-03-04T04:23:46,true,1,,,,,,71310,SERRIGNY-EN-BRESSE,,,71519,,,,,,,,,,,,,,,,,,,2019-08-01,A,,,,,02.10Z,NAFRev2,N,,,0,,,,,,
883555401,00016,88355540100016,O,2020-01-01,,,,2020-05-21T03:56:52,true,1,,26,,RUE,DU BOURG,71310,SERRIGNY-EN-BRESSE,,,71519,,,,,,,,,,,,,,,,,,,2020-01-01,A,,,,,47.99A,NAFRev2,N,5.120763,46.818873,0.94,housenumber,26 Rue du Bourg 71310 Serrigny-en-Bresse,71519_0005_00026,G,26 RUE DU BOURG,
884976770,00013,88497677000013,O,2020-05-20,,,,2020-07-08T11:28:33,true,1,LE BOUCHAT,2,,CHE,DU CLOUZOT,71310,SERRIGNY-EN-BRESSE,,,71519,,,,,,,,,,,,,,,,,,,2020-05-20,A,,,,,47.99A,NAFRev2,N,5.111967,46.829795,0.83,housenumber,2 Chemin du Clouzot 71310 Serrigny-en-Bresse,71519_0025_00002,G,2 CHEMIN DU CLOUZOT,
885369249,00010,88536924900010,O,2019-07-30,,,,2020-07-22T14:28:09,true,1,,12,,RUE,DU BOURG,71310,SERRIGNY-EN-BRESSE,,,71519,,,,,,,,,,,,,,,,,,,2019-07-30,A,,,,,43.12B,NAFRev2,N,5.116786,46.816792,0.94,housenumber,12 Rue du Bourg 71310 Serrigny-en-Bresse,71519_0005_00012,G,12 RUE DU BOURG,
899177562,00019,89917756200019,O,2021-06-01,,,4322AZ,2022-10-07T04:06:36,true,2,,7,,RUE,DU BOURG,71310,SERRIGNY-EN-BRESSE,,,71519,,,,,,,,,,,,,,,,,,,2022-09-30,F,GRANDFERRY PLOMBERIE,,,GRANDFERRY PLOMBERIE,43.22A,NAFRev2,N,5.120919,46.818979,0.94,housenumber,7 Rue du Bourg 71310 Serrigny-en-Bresse,71519_0005_00007,G,7 RUE DU BOURG,
903730794,00018,90373079400018,O,2021-10-01,,,,2021-10-01T11:35:49,true,1,,1,,CHE,LE BOUCHAT,71310,SERRIGNY-EN-BRESSE,,,71519,,,,,,,,,,,,,,,,,,,2021-10-01,A,,,,ORM'AVENIR,85.60Z,NAFRev2,N,5.11137,46.830101,0.83,housenumber,1 Chemin le Bouchat 71310 Serrigny-en-Bresse,71519_0001_00001,G,1 CHEMIN LE BOUCHAT,
913372702,00013,91337270200013,O,2022-05-09,,,,2022-05-12T04:12:46,true,1,,4,,RTE,DE CHALON,71310,SERRIGNY-EN-BRESSE,,,71519,,,,,,,,,,,,,,,,,,,2022-05-09,A,,,,,01.49Z,NAFRev2,N,5.119481,46.810891,0.82,housenumber,4 Route de Chalon 71310 Serrigny-en-Bresse,71519_0015_00004,G,4 ROUTE DE CHALON,
921583738,00015,92158373800015,O,2022-09-03,,,,2022-11-23T04:10:37,true,1,,6,,CHE,DE VILLENEUVE ,71310,SERRIGNY-EN-BRESSE,,,71519,,,,,,,,,,,,,,,,,,,2022-09-03,A,,,,,68.20B,NAFRev2,N,5.119376,46.811821,0.85,housenumber,6 Chemin de Villeneuve 71310 Serrigny-en-Bresse,71519_0105_00006,G,6 CHEMIN DE VILLENEUVE,
922781711,00010,92278171100010,O,2023-01-02,,,,2023-01-11T10:24:05,true,1,CHEZ M RODRIGUES BRUNO,1,A,,DE POUILLY,71310,SERRIGNY-EN-BRESSE,,,71519,,,,,,,,,,,,,,,,,,,2023-01-02,A,,,,,93.12Z,NAFRev2,N,5.120284,46.825225,0.86,housenumber,1a Chemin de Pouilly 71310 Serrigny-en-Bresse,71519_0080_00001_a,G,1A CHEMIN DE POUILLY,
