siren,nic,siret,statutDiffusionEtablissement,dateCreationEtablissement,trancheEffectifsEtablissement,anneeEffectifsEtablissement,activitePrincipaleRegistreMetiersEtablissement,dateDernierTraitementEtablissement,etablissementSiege,nombrePeriodesEtablissement,complementAdresseEtablissement,numeroVoieEtablissement,indiceRepetitionEtablissement,typeVoieEtablissement,libelleVoieEtablissement,codePostalEtablissement,libelleCommuneEtablissement,libelleCommuneEtrangerEtablissement,distributionSpecialeEtablissement,codeCommuneEtablissement,codeCedexEtablissement,libelleCedexEtablissement,codePaysEtrangerEtablissement,libellePaysEtrangerEtablissement,complementAdresse2Etablissement,numeroVoie2Etablissement,indiceRepetition2Etablissement,typeVoie2Etablissement,libelleVoie2Etablissement,codePostal2Etablissement,libelleCommune2Etablissement,libelleCommuneEtranger2Etablissement,distributionSpeciale2Etablissement,codeCommune2Etablissement,codeCedex2Etablissement,libelleCedex2Etablissement,codePaysEtranger2Etablissement,libellePaysEtranger2Etablissement,dateDebut,etatAdministratifEtablissement,enseigne1Etablissement,enseigne2Etablissement,enseigne3Etablissement,denominationUsuelleEtablissement,activitePrincipaleEtablissement,nomenclatureActivitePrincipaleEtablissement,caractereEmployeurEtablissement,longitude,latitude,geo_score,geo_type,geo_adresse,geo_id,geo_ligne,geo_l4,geo_l5
210207437,00018,21020743700018,O,1983-03-01,03,2020,,2022-08-29T09:05:42,true,4,,232,,RUE,DE LA MAIRIE,02200,VAUXBUIN,,,02770,,,,,,,,,,,,,,,,,,,2008-01-01,A,MAIRIE,,,,84.11Z,NAFRev2,O,3.294724,49.358959,0.95,housenumber,232 Rue de la Mairie 02200 Vauxbuin,02770_0120_00232,G,232 RUE DE LA MAIRIE,
210207437,00026,21020743700026,O,1983-12-21,02,2020,,2022-08-29T09:05:42,false,4,,232,,RUE,DE LA MAIRIE,02200,VAUXBUIN,,,02770,,,,,,,,,,,,,,,,,,,2022-05-24,A,ECOLE PRIMAIRE LA FONTAINE DU DRAGON,,,,85.20Z,NAFRev2,N,3.294724,49.358959,0.95,housenumber,232 Rue de la Mairie 02200 Vauxbuin,02770_0120_00232,G,232 RUE DE LA MAIRIE,
260207535,00014,26020753500014,O,1983-03-01,NN,,,2010-06-26T03:03:00,true,3,MAIRIE,232,,RUE,DE LA MAIRIE,02200,VAUXBUIN,,,02770,,,,,,,,,,,,,,,,,,,2008-01-01,A,CCAS,,,,88.99B,NAFRev2,N,3.294724,49.358959,0.95,housenumber,232 Rue de la Mairie 02200 Vauxbuin,02770_0120_00232,G,232 RUE DE LA MAIRIE,
260208442,00012,26020844200012,O,1983-03-01,NN,,,,true,4,,,,,,02200,VAUXBUIN,,,02770,,,,,,,,,,,,,,,,,,,1991-12-31,F,CDE,,,,95.11,NAP,N,,,0,,,,,,
302022777,00023,30202277700023,O,,,,,,true,1,,,,PL,DE L'EGLISE,02200,VAUXBUIN,,,02770,,,,,,,,,,,,,,,,,,,1984-12-25,F,,,,,55.73,NAP,N,3.291385,49.35669,0.75,street,Rue de l’Eglise 02200 Vauxbuin,02770_0070,G,RUE DE L EGLISE,
305538225,00015,30553822500015,O,1900-01-01,NN,,,2009-06-27T03:43:38,true,3,,,,,,02200,VAUXBUIN,,,02770,,,,,,,,,,,,,,,,,,,2007-12-15,F,,,,,01.3Z,NAFRev1,N,,,0,,,,,,
306904707,01915,30690470701915,O,1987-05-22,,,,,false,4,,,,RUE,N 2,02200,VAUXBUIN,,,02770,,,,,,,,,,,,,,,,,,,2000-06-15,F,,,,,52.1A,NAF1993,N,3.299568,49.358262,0.47,street,Rue Alain Langlet 02200 Vauxbuin,02770_0010,G,RUE ALAIN LANGLET,
310657085,00018,31065708500018,O,,NN,,,,true,1,,,,RUE,DE LA MAIRIE,02200,VAUXBUIN,,,02770,,,,,,,,,,,,,,,,,,,1997-06-25,F,,,,,00.10,NAP,N,3.295663,49.358604,0.95,street,Rue de la Mairie 02200 Vauxbuin,02770_0120,G,RUE DE LA MAIRIE,
312682842,00025,31268284200025,O,2004-09-25,NN,,,2021-02-23T10:39:49,true,3,,271,,RUE,DES TREILLIS,02200,VAUXBUIN,,,02770,,,,,,,,,,,,,,,,,,,2008-01-01,A,,,,,90.01Z,NAFRev2,N,3.293524,49.3602,0.95,housenumber,271 Rue des Treillis 02200 Vauxbuin,02770_0270_00271,G,271 RUE DES TREILLIS,
312801434,00019,31280143400019,O,,NN,,,,true,1,,,,PL,DE L EGLISE,02200,VAUXBUIN,,,02770,,,,,,,,,,,,,,,,,,,,F,,,,,55.60,NAP,N,3.291385,49.35669,0.75,street,Rue de l’Eglise 02200 Vauxbuin,02770_0070,G,RUE DE L EGLISE,
313833790,00022,31383379000022,O,2006-01-01,,,,2021-02-23T10:40:19,true,2,,577,,RUE,DE LA VILLETTE,02200,VAUXBUIN,,,02770,,,,,,,,,,,,,,,,,,,2008-01-01,A,,,,,02.10Z,NAFRev2,N,3.300903,49.359667,0.95,housenumber,577 Rue de la Villette 02200 Vauxbuin,02770_0280_00577,G,577 RUE DE LA VILLETTE,
313887176,00029,31388717600029,O,1994-03-01,NN,,,2008-11-07T00:29:08,false,3,,286,,RTE,DE PARIS,02200,VAUXBUIN,,,02770,,,,,,,,,,,,,,,,,,,1996-02-14,F,AISNE DECOR,,,,45.4J,NAF1993,,3.303319,49.363975,0.84,housenumber,286 Route de Paris 02200 Vauxbuin,02770_0170_00286,G,286 ROUTE DE PARIS,
314201625,00014,31420162500014,O,,NN,,,,true,1,,,,PL,MALLET,02200,VAUXBUIN,,,02770,,,,,,,,,,,,,,,,,,,1987-10-10,F,,,,,67.06,NAP,N,3.293099,49.357048,0.83,street,Place Marcel Mallet 02200 Vauxbuin,02770_0150,G,PLACE MARCEL MALLET,
314438367,00018,31443836700018,O,,,,,,true,1,,,,RTE,DE PARIS,02200,VAUXBUIN,,,02770,,,,,,,,,,,,,,,,,,,1984-12-25,F,,,,,64.24,NAP,N,3.30444,49.364386,0.81,street,Route de Paris 02200 Vauxbuin,02770_0170,G,ROUTE DE PARIS,
315436121,00018,31543612100018,O,1979-01-01,NN,,,2008-01-04T20:38:54,true,3,,,,RTE,DE PARIS,02200,VAUXBUIN,,,02770,,,,,,,,,,,,,,,,,,,2008-01-01,A,,,,,56.30Z,NAFRev2,N,3.30444,49.364386,0.81,street,Route de Paris 02200 Vauxbuin,02770_0170,G,ROUTE DE PARIS,
317780062,01374,31778006201374,O,2019-05-06,11,2020,,2022-08-29T09:15:41,false,1,,,,,PARC COMMERCIAL PORTES SOISSONS,02200,VAUXBUIN,,,02770,,,,,,,,,,,,,,,,,,,2019-05-06,A,,,,,47.19B,NAFRev2,O,3.3198658,49.3621752,0.71,poi.retail,Parc commercial des Moulins (Zone commerciale) Soissons,https://osm.org/way/335370335,G,,
319713830,00010,31971383000010,O,,NN,,,,true,1,,128,,RUE,DE LA MAIRIE,02200,VAUXBUIN,,,02770,,,,,,,,,,,,,,,,,,,1989-01-13,F,,,,,45.3F,NAF1993,N,3.296127,49.358628,0.95,housenumber,128 Rue de la Mairie 02200 Vauxbuin,02770_0120_00128,G,128 RUE DE LA MAIRIE,
322938671,00011,32293867100011,O,1981-10-01,NN,,,2008-11-07T00:39:27,true,4,,234,,RTE,DE PARIS,02200,VAUXBUIN,,,02770,,,,,,,,,,,,,,,,,,,2005-10-21,F,,,,,45.4D,NAFRev1,O,3.304001,49.364239,0.84,housenumber,234 Route de Paris 02200 Vauxbuin,02770_0170_00234,G,234 ROUTE DE PARIS,
323057083,02604,32305708302604,O,2016-04-01,02,2020,,2022-08-29T09:17:46,false,1,,,,,PARC CIAL DES PORTES DE SOISSONS,02200,VAUXBUIN,,,02770,,,,,,,,,,,,,,,,,,,2016-04-01,A,SOCOO'C,,,,47.59A,NAFRev2,O,,,0,,,,,,
323181669,00033,32318166900033,O,1999-03-04,NN,,,2010-11-23T13:53:21,false,4,,513,,RUE,ALAIN LENGLET,02200,VAUXBUIN,,,02770,,,,,,,,,,,,,,,,,,,2004-08-31,F,,,,,45.2V,NAFRev1,N,3.297107,49.357924,0.83,housenumber,513 Rue Alain Langlet 02200 Vauxbuin,02770_0010_00513,G,513 RUE ALAIN LANGLET,
323181669,00058,32318166900058,O,2017-04-19,,,4399CZ,2021-07-19T09:18:41,true,2,,1,,,SENTE DERRIERE MONTIER,02200,VAUXBUIN,,,02770,,,,,,,,,,,,,,,,,,,2020-12-31,F,,,,,43.99C,NAFRev2,N,3.290181,49.356294,0.94,housenumber,1 Sente Derrière Montier 02200 Vauxbuin,02770_0050_00001,G,1 SENTE DERRIERE MONTIER,
323718726,00017,32371872600017,O,,,,,2007-01-18T09:16:21,true,1,,,,RTE,NATIONALE 2,02200,VAUXBUIN,,,02770,,,,,,,,,,,,,,,,,,,1986-12-25,F,,,,,01.4B,NAF1993,N,3.9032612,49.8508057,0.79,poi,Route Nationale 2 (Pont) Fontaine-lès-Vervins,https://osm.org/way/555245962,G,,
323874693,00035,32387469300035,O,2006-01-11,,,,2021-02-23T10:47:06,true,2,,577,,RUE,DE LA VILLETTE,02200,VAUXBUIN,,,02770,,,,,,,,,,,,,,,,,,,2008-01-01,A,,,,,68.20B,NAFRev2,N,3.300903,49.359667,0.95,housenumber,577 Rue de la Villette 02200 Vauxbuin,02770_0280_00577,G,577 RUE DE LA VILLETTE,
324182286,00033,32418228600033,O,1998-02-20,NN,,,2014-02-09T04:38:19,true,3,CHATEAU DE VAUXBUIN,807,,RUE,ALAIN LANGLET,02200,VAUXBUIN,,,02770,,,,,,,,,,,,,,,,,,,2008-01-01,A,,,,,68.20B,NAFRev2,N,3.293687,49.356927,0.95,housenumber,807 Rue Alain Langlet 02200 Vauxbuin,02770_0010_00807,G,807 RUE ALAIN LANGLET,
324275866,00022,32427586600022,O,1984-10-01,NN,,,2008-11-07T00:41:13,false,3,,122,,RUE,VILLETTE,02200,VAUXBUIN,,,02770,,,,,,,,,,,,,,,,,,,1994-09-20,F,,,,,45.4J,NAF1993,N,3.302976,49.36331,0.93,housenumber,122 Rue de la Villette 02200 Vauxbuin,02770_0280_00122,G,122 RUE DE LA VILLETTE,
324275866,00030,32427586600030,O,1994-09-20,01,2020,4334ZC,2022-08-29T09:18:19,true,5,,160,,RUE,A LANGLET,02200,VAUXBUIN,,,02770,,,,,,,,,,,,,,,,,,,2022-06-30,F,,,,,43.34Z,NAFRev2,O,3.301737,49.358673,0.85,housenumber,160 Rue Alain Langlet 02200 Vauxbuin,02770_0010_00160,G,160 RUE ALAIN LANGLET,
326769825,00018,32676982500018,O,,NN,,,,true,1,,296,,RUE,DE LA VILLETTE,02200,VAUXBUIN,,,02770,,,,,,,,,,,,,,,,,,,,F,,,,,77.14,NAP,N,3.302024,49.361913,0.95,housenumber,296 Rue de la Villette 02200 Vauxbuin,02770_0280_00296,G,296 RUE DE LA VILLETTE,
328213830,00016,32821383000016,O,,NN,,,,true,1,,354,,RUE,LANGLET,02200,VAUXBUIN,,,02770,,,,,,,,,,,,,,,,,,,,F,,,,,55.60,NAP,N,3.299343,49.358527,0.88,housenumber,354 Rue Alain Langlet 02200 Vauxbuin,02770_0010_00354,G,354 RUE ALAIN LANGLET,
328778097,00027,32877809700027,O,2013-12-23,03,2020,,2022-08-29T09:20:33,true,3,,259,,RTE,DE PARIS,02200,VAUXBUIN,,,02770,,,,,,,,,,,,,,,,,,,2020-12-31,A,,,,,33.11Z,NAFRev2,O,3.303582,49.363858,0.84,housenumber,259 Route de Paris 02200 Vauxbuin,02770_0170_00259,G,259 ROUTE DE PARIS,
328903265,00036,32890326500036,O,1999-01-01,NN,,,2019-02-19T14:59:25,false,4,,110,,RUE,DU MONCEL,02200,VAUXBUIN,,,02770,,,,,,,,,,,,,,,,,,,2017-07-01,F,,,,,68.20A,NAFRev2,N,3.294199,49.357902,0.95,housenumber,110 Rue du Moncel 02200 Vauxbuin,02770_0160_00110,G,110 RUE DU MONCEL,
329792196,00035,32979219600035,O,,,,,,true,1,,390,,RTE,DE PARIS,02200,VAUXBUIN,,,02770,,,,,,,,,,,,,,,,,,,1988-11-20,F,,,,,55.60,NAP,N,3.302124,49.363489,0.84,housenumber,390 Route de Paris 02200 Vauxbuin,02770_0170_00390,G,390 ROUTE DE PARIS,
330267691,03983,33026769103983,O,2013-12-01,03,2020,,2022-08-29T09:21:23,false,1,LES PORTES DE SOISSONS,,,RPT,DE L ARCHER,02200,VAUXBUIN,,,02770,,,,,,,,,,,,,,,,,,,2013-12-01,A,CHAUSSEA,,,CHAUSSEA,47.72A,NAFRev2,O,,,0,,,,,,
332289248,00012,33228924800012,O,1985-03-15,NN,,,,true,1,,,,RTE,DE PARIS,02200,VAUXBUIN,,,02770,,,,,,,,,,,,,,,,,,,1998-10-02,F,,,,,50.5Z,NAF1993,O,3.30444,49.364386,0.81,street,Route de Paris 02200 Vauxbuin,02770_0170,G,ROUTE DE PARIS,
333077063,00019,33307706300019,O,,,,,,true,1,,340,,RTE,DE PARIS,02200,VAUXBUIN,,,02770,,,,,,,,,,,,,,,,,,,1990-08-31,F,,,,,50.2Z,NAF1993,N,3.302546,49.363637,0.84,housenumber,340 Route de Paris 02200 Vauxbuin,02770_0170_00340,G,340 ROUTE DE PARIS,
333294916,00015,33329491600015,O,1985-03-01,,,,,true,1,,183,,RTE,DE PARIS,02200,VAUXBUIN,,,02770,,,,,,,,,,,,,,,,,,,1995-05-17,F,,,,,50.5Z,NAF1993,N,3.304388,49.364386,0.84,housenumber,183 Route de Paris 02200 Vauxbuin,02770_0170_00183,G,183 ROUTE DE PARIS,
333771574,00014,33377157400014,O,,NN,,,2022-01-22T03:54:41,true,1,,234,,RTE,DE PARIS,02200,VAUXBUIN,,,02770,,,,,,,,,,,,,,,,,,,1988-10-24,F,,,,,81.21,NAP,N,3.304001,49.364239,0.84,housenumber,234 Route de Paris 02200 Vauxbuin,02770_0170_00234,G,234 ROUTE DE PARIS,
338586571,00030,33858657100030,O,2001-10-31,NN,,,2009-07-23T20:21:56,true,5,,90,,RUE,DES TREILLIS,02200,VAUXBUIN,,,02770,,,,,,,,,,,,,,,,,,,2009-06-30,F,,,,,46.69B,NAFRev2,N,3.292596,49.358648,0.95,housenumber,90 Rue des Treillis 02200 Vauxbuin,02770_0270_00090,G,90 RUE DES TREILLIS,
338871973,00016,33887197300016,O,,,,,,true,1,,215,,RTE,DE PARIS,02200,VAUXBUIN,,,02770,,,,,,,,,,,,,,,,,,,,F,,,,,24.03,NAP,N,3.30444,49.364386,0.63,street,Route de Paris 02200 Vauxbuin,02770_0170,G,ROUTE DE PARIS,
339160475,00010,33916047500010,O,1900-01-01,NN,,,2021-02-24T09:54:07,false,3,,474,,RUE,ALAIN LANGLET,02200,VAUXBUIN,,,02770,,,,,,,,,,,,,,,,,,,1993-04-30,F,,,,,55.4B,NAF1993,N,3.29776,49.358013,0.95,housenumber,474 Rue Alain Langlet 02200 Vauxbuin,02770_0010_00474,G,474 RUE ALAIN LANGLET,
341034973,00014,34103497300014,O,1986-01-01,,,,,true,3,MAIRIE DE VAUXBUIN,,,,,02200,VAUXBUIN,,,02770,,,,,,,,,,,,,,,,,,,1995-01-05,F,,,,,91.3E,NAF1993,N,3.295663,49.358604,0.92,street,Rue de la Mairie 02200 Vauxbuin,02770_0120,D,RUE DE LA MAIRIE,
341372506,00020,34137250600020,O,2009-04-01,,,,2012-11-09T00:35:19,false,2,,129,,RTE,DE PARIS,02200,VAUXBUIN,,,02770,,,,,,,,,,,,,,,,,,,2011-11-06,F,,,,,47.89Z,NAFRev2,N,3.304127,49.364078,0.84,housenumber,129 Route de Paris 02200 Vauxbuin,02770_0170_00129,G,129 ROUTE DE PARIS,
343638342,00018,34363834200018,O,,NN,,,,true,1,,,,PL,MALLET,02200,VAUXBUIN,,,02770,,,,,,,,,,,,,,,,,,,1988-12-31,F,,,,,67.04,NAP,N,3.293099,49.357048,0.83,street,Place Marcel Mallet 02200 Vauxbuin,02770_0150,G,PLACE MARCEL MALLET,
343836896,00013,34383689600013,O,1987-01-01,NN,,,2014-12-17T08:51:34,true,3,,,,,,02200,VAUXBUIN,,,02770,,,,,,,,,,,,,,,,,,,2008-01-01,A,,,,,68.20B,NAFRev2,N,,,0,,,,,,
344845151,00010,34484515100010,O,1988-05-13,NN,,,,true,1,,61,,RUE,SAINT ANTOINE,02200,VAUXBUIN,,,02770,,,,,,,,,,,,,,,,,,,1998-03-31,F,,,,,45.3E,NAF1993,N,3.29095,49.357017,0.95,housenumber,61 Rue Saint-Antoine 02200 Vauxbuin,02770_0200_00061,G,61 RUE SAINT ANTOINE,
348787755,00019,34878775500019,O,,NN,,,,true,1,,396,,RUE,DE LA VILLETTE,02200,VAUXBUIN,,,02770,,,,,,,,,,,,,,,,,,,1990-06-14,F,,,,,84.10,NAP,N,3.301776,49.361181,0.95,housenumber,396 Rue de la Villette 02200 Vauxbuin,02770_0280_00396,G,396 RUE DE LA VILLETTE,
349020396,00025,34902039600025,O,2016-12-01,,,,2022-04-05T14:45:52,true,1,,50,,RUE,DE LA MAIRIE,02200,VAUXBUIN,,,02770,,,,,,,,,,,,,,,,,,,2016-12-01,A,,,,,68.20A,NAFRev2,N,3.296548,49.358301,0.95,housenumber,50 Rue de la Mairie 02200 Vauxbuin,02770_0120_00050,G,50 RUE DE LA MAIRIE,
349282681,00015,34928268100015,O,,NN,,,,true,1,,483,,PL,MALLET,02200,VAUXBUIN,,,02770,,,,,,,,,,,,,,,,,,,1993-01-15,F,,,,,92.3H,NAF1993,N,3.293099,49.357048,0.86,housenumber,483 Place Marcel Mallet 02200 Vauxbuin,02770_0150_00483,G,483 PLACE MARCEL MALLET,
351310370,00017,35131037000017,O,1989-07-04,NN,,,2022-04-26T03:43:33,true,4,,96,,RUE,DE L EGLISE,02200,VAUXBUIN,,,02770,,,,,,,,,,,,,,,,,,,2022-01-21,F,,,,,68.20B,NAFRev2,N,3.291704,49.356726,0.94,housenumber,96 Rue de l’Eglise 02200 Vauxbuin,02770_0070_00096,G,96 RUE DE L EGLISE,
352930051,00029,35293005100029,O,2001-07-01,NN,,,2017-05-04T01:29:26,false,5,,577,,RUE,DE LA VILLETTE,02200,VAUXBUIN,,,02770,,,,,,,,,,,,,,,,,,,2015-08-27,F,,,,,01.11Z,NAFRev2,O,3.300903,49.359667,0.95,housenumber,577 Rue de la Villette 02200 Vauxbuin,02770_0280_00577,G,577 RUE DE LA VILLETTE,
353207558,00035,35320755800035,O,1997-11-17,,,,2017-05-29T11:07:51,false,4,,340,,RTE,,02200,VAUXBUIN,,,02770,,,,,,,,,,,,,,,,,,,1999-12-25,F,,,,,51.6C,NAF1993,N,3.302546,49.363637,0.7,housenumber,340 Route de Paris 02200 Vauxbuin,02770_0170_00340,G,340 ROUTE DE PARIS,
353559131,00126,35355913100126,O,2022-01-01,,,,2022-01-28T16:13:19,false,1,PARC COMMERCIAL DES PORTES DE SOISSONS,,,,LIEUDIT LA PIECE DE LA BETE,02200,VAUXBUIN,,,02770,,,,,,,,,,,,,,,,,,,2022-01-01,A,LEON,,,,56.10A,NAFRev2,O,,,0,,,,,,
377627757,00018,37762775700018,O,1990-04-01,NN,,,2010-04-18T05:35:34,true,5,,259,,RTE,DE PARIS,02200,VAUXBUIN,,,02770,,,,,,,,,,,,,,,,,,,2008-08-01,F,,,,,49.41B,NAFRev2,O,3.303582,49.363858,0.84,housenumber,259 Route de Paris 02200 Vauxbuin,02770_0170_00259,G,259 ROUTE DE PARIS,
377916325,00014,37791632500014,O,,NN,,,,true,1,,343,,RUE,DE LA MAIRIE,02200,VAUXBUIN,,,02770,,,,,,,,,,,,,,,,,,,1991-12-20,F,,,,,45.2V,NAF1993,N,3.293768,49.358308,0.95,housenumber,343 Rue de la Mairie 02200 Vauxbuin,02770_0120_00343,G,343 RUE DE LA MAIRIE,
378907901,00011,37890790100011,O,1990-08-16,NN,,,2008-12-06T05:10:34,true,3,,37,,RUE,DE LA FABRIQUE,02200,VAUXBUIN,,,02770,,,,,,,,,,,,,,,,,,,2008-01-01,A,,,,,43.22A,NAFRev2,N,3.294943,49.358609,0.94,housenumber,37 Rue de la Fabrique 02200 Vauxbuin,02770_0080_00037,G,37 RUE DE LA FABRIQUE,
379138159,00015,37913815900015,O,1990-07-28,NN,,,2022-04-01T15:06:57,true,4,CLOS DES MOINES,317,,RUE,DE LA VILLETTE,02200,VAUXBUIN,,,02770,,,,,,,,,,,,,,,,,,,2020-01-01,F,,,,,68.20A,NAFRev2,N,3.301998,49.361741,0.95,housenumber,317 Rue de la Villette 02200 Vauxbuin,02770_0280_00317,G,317 RUE DE LA VILLETTE,
380123943,00025,38012394300025,O,2011-02-15,,,,2012-12-14T10:31:53,true,1,,1,,RUE,ALAIN LANGLET,02200,VAUXBUIN,,,02770,,,,,,,,,,,,,,,,,,,2011-02-15,A,,,,,01.11Z,NAFRev2,N,3.303995,49.359151,0.95,housenumber,1 Rue Alain Langlet 02200 Vauxbuin,02770_0010_00001,G,1 RUE ALAIN LANGLET,
387497779,00018,38749777900018,O,1992-04-20,NN,,,,false,3,,,,RTE,N 2,02200,VAUXBUIN,,,02770,,,,,,,,,,,,,,,,,,,1995-04-01,F,,,,,70.2C,NAF1993,N,,,0,,,,,,
388995458,00014,38899545800014,O,1993-01-10,NN,,,2013-01-04T04:31:50,false,4,,1,,RUE,ALAIN LANGLET,02200,VAUXBUIN,,,02770,,,,,,,,,,,,,,,,,,,2012-12-10,F,,,,,01.11Z,NAFRev2,N,3.303995,49.359151,0.95,housenumber,1 Rue Alain Langlet 02200 Vauxbuin,02770_0010_00001,G,1 RUE ALAIN LANGLET,
389435215,00782,38943521500782,O,2014-05-12,02,2020,,2022-08-29T09:14:03,false,1,PARC COMMERCIAL LES PORTES DE SOISSONS,,,,CELLULE 15 B,02200,VAUXBUIN,,,02770,,,,,,,,,,,,,,,,,,,2014-05-12,A,MAXI ZOO,,,,47.76Z,NAFRev2,O,,,0,,,,,,
393337977,00010,39333797700010,O,1992-06-01,NN,,,,true,4,,234,,RTE,DE PARIS,02200,VAUXBUIN,,,02770,,,,,,,,,,,,,,,,,,,1998-12-25,F,,,,,91.3E,NAF1993,O,3.304001,49.364239,0.84,housenumber,234 Route de Paris 02200 Vauxbuin,02770_0170_00234,G,234 ROUTE DE PARIS,
393387972,00010,39338797200010,O,,NN,,,,true,1,,1,,RUE,SAINT PIERRE,02200,VAUXBUIN,,,02770,,,,,,,,,,,,,,,,,,,1996-06-30,F,,,,,74.1G,NAF1993,N,3.30449,49.36146,0.95,housenumber,1 Rue Saint Pierre 02200 Vauxbuin,02770_0260_00001,G,1 RUE SAINT PIERRE,
394558944,00028,39455894400028,O,2000-05-26,NN,,,2020-02-12T04:05:43,true,3,,1,,RUE,ALAIN LANGLET,02200,VAUXBUIN,,,02770,,,,,,,,,,,,,,,,,,,2008-01-01,A,,,,,01.11Z,NAFRev2,N,3.303995,49.359151,0.95,housenumber,1 Rue Alain Langlet 02200 Vauxbuin,02770_0010_00001,G,1 RUE ALAIN LANGLET,
394559108,00029,39455910800029,O,2002-05-31,NN,,,2021-10-20T03:36:17,true,3,,1,,RUE,ALAIN LANGLET,02200,VAUXBUIN,,,02770,,,,,,,,,,,,,,,,,,,2008-01-01,A,,,,,01.11Z,NAFRev2,N,3.303995,49.359151,0.95,housenumber,1 Rue Alain Langlet 02200 Vauxbuin,02770_0010_00001,G,1 RUE ALAIN LANGLET,
394605745,00014,39460574500014,O,1994-03-12,NN,,,2006-11-25T12:24:11,false,4,,,,SEN,DES ECOLES,02200,VAUXBUIN,,,02770,,,,,,,,,,,,,,,,,,,1997-02-08,F,,,,,92.7C,NAF1993,O,3.295003,49.359525,0.81,street,Sente des Ecoles 02200 Vauxbuin,02770_0060,G,SENTE DES ECOLES,
394605745,00022,39460574500022,O,1997-02-08,,,,,false,3,MR DENYS CLAUDE,277,,RUE,DE LA MAIRIE,02200,VAUXBUIN,,,02770,,,,,,,,,,,,,,,,,,,1997-12-25,F,,,,,91.3E,NAF1993,N,3.294389,49.358716,0.95,housenumber,277 Rue de la Mairie 02200 Vauxbuin,02770_0120_00277,G,277 RUE DE LA MAIRIE,
394605745,00030,39460574500030,O,1997-11-10,NN,,,2018-09-29T12:22:37,false,5,MR ROBERT SYLVAIN,15,,RUE,ST BERNARD,02200,VAUXBUIN,,,02770,,,,,,,,,,,,,,,,,,,2017-04-13,F,,,,,94.99Z,NAFRev2,O,3.302877,49.360801,0.85,housenumber,15 Rue Saint Bernard 02200 Vauxbuin,02770_0230_00015,G,15 RUE SAINT BERNARD,
394605745,00048,39460574500048,O,2017-04-13,01,2020,,2022-08-29T09:18:17,true,1,,2,,RUE,SAINT BERNARD,02200,VAUXBUIN,,,02770,,,,,,,,,,,,,,,,,,,2017-04-13,A,,,,,94.99Z,NAFRev2,O,3.304956,49.36178,0.95,housenumber,2 Rue Saint Bernard 02200 Vauxbuin,02770_0230_00002,G,2 RUE SAINT BERNARD,
394606933,00023,39460693300023,O,2001-01-01,NN,,,2015-12-11T11:54:26,false,4,,577,,RUE,DE LA VILLETTE,02200,VAUXBUIN,,,02770,,,,,,,,,,,,,,,,,,,2015-12-03,F,,,,,01.61Z,NAFRev2,N,3.300903,49.359667,0.95,housenumber,577 Rue de la Villette 02200 Vauxbuin,02770_0280_00577,G,577 RUE DE LA VILLETTE,
395276975,00012,39527697500012,O,1994-05-15,NN,,,,true,1,,271,,RUE,DES TREILLIS,02200,VAUXBUIN,,,02770,,,,,,,,,,,,,,,,,,,1999-07-12,F,,,,,70.2A,NAF1993,N,3.293524,49.3602,0.95,housenumber,271 Rue des Treillis 02200 Vauxbuin,02770_0270_00271,G,271 RUE DES TREILLIS,
397837394,00014,39783739400014,O,,NN,,,,true,1,,483,,PL,MALLET,02200,VAUXBUIN,,,02770,,,,,,,,,,,,,,,,,,,1995-06-30,F,,,,,55.4B,NAF1993,O,3.293099,49.357048,0.86,housenumber,483 Place Marcel Mallet 02200 Vauxbuin,02770_0150_00483,G,483 PLACE MARCEL MALLET,
397871245,00023,39787124500023,O,2001-07-01,NN,,,2006-10-28T02:28:19,true,3,,577,,RUE,DE LA VILLETTE,02200,VAUXBUIN,,,02770,,,,,,,,,,,,,,,,,,,2005-12-31,F,,,,,02.0A,NAFRev1,N,3.300903,49.359667,0.95,housenumber,577 Rue de la Villette 02200 Vauxbuin,02770_0280_00577,G,577 RUE DE LA VILLETTE,
398335257,00182,39833525700182,O,2000-02-14,01,2020,,2022-08-29T09:19:39,false,3,,164,,RTE,DE PARIS,02200,VAUXBUIN,,,02770,,,,,,,,,,,,,,,,,,,2008-01-01,A,SYLVIE THIRIEZ,,,,47.51Z,NAFRev2,O,3.304883,49.36453,0.84,housenumber,164 Route de Paris 02200 Vauxbuin,02770_0170_00164,G,164 ROUTE DE PARIS,
398438648,00014,39843864800014,O,1994-07-18,NN,,,,false,4,,1,,RUE,LANGLET,02200,VAUXBUIN,,,02770,,,,,,,,,,,,,,,,,,,1999-02-01,F,,,,,93.0E,NAF1993,N,3.303995,49.359151,0.87,housenumber,1 Rue Alain Langlet 02200 Vauxbuin,02770_0010_00001,G,1 RUE ALAIN LANGLET,
398471565,02568,39847156502568,O,2015-05-01,00,2020,,2022-08-29T09:19:46,false,1,LIEUDIT LA BETE LA PIECE DE TOISY 9001,,,RPT,DE L ARCHER,02200,VAUXBUIN,,,02770,,,,,,,,,,,,,,,,,,,2015-05-01,A,,,,,47.71Z,NAFRev2,O,,,0,,,,,,
398558908,00016,39855890800016,O,1994-10-01,NN,,,,false,4,RN 2,164,,,LES MAISONS ROUGES,02200,VAUXBUIN,,,02770,,,,,,,,,,,,,,,,,,,2000-12-31,F,MAISON DU CARRELAGE,,,,51.5F,NAF1993,O,3.306696,49.363272,0.82,housenumber,164 Rue des Maisons Rouges 02200 Vauxbuin,02770_p7ihav_00164,G,164 RUE DES MAISONS ROUGES,
399360817,02748,39936081702748,O,2004-06-29,NN,,,2015-08-28T10:52:21,false,4,RN 2,183,,RTE,DE PARIS,02200,VAUXBUIN,,,02770,,,,,,,,,,,,,,,,,,,2015-06-24,F,ESSO SERVICE VAUXBUIN,,,,47.30Z,NAFRev2,N,3.304388,49.364386,0.84,housenumber,183 Route de Paris 02200 Vauxbuin,02770_0170_00183,G,183 ROUTE DE PARIS,
402050942,00018,40205094200018,O,1995-07-07,NN,,,,true,1,,483,,PL,MALLET,02200,VAUXBUIN,,,02770,,,,,,,,,,,,,,,,,,,1998-06-28,F,,,,,55.4B,NAF1993,N,3.293099,49.357048,0.86,housenumber,483 Place Marcel Mallet 02200 Vauxbuin,02770_0150_00483,G,483 PLACE MARCEL MALLET,
402999627,00019,40299962700019,O,1995-11-01,NN,,,,true,1,,15,,RUE,SAINT BERNARD,02200,VAUXBUIN,,,02770,,,,,,,,,,,,,,,,,,,1998-12-31,F,,,,,70.2C,NAF1993,N,3.302877,49.360801,0.95,housenumber,15 Rue Saint Bernard 02200 Vauxbuin,02770_0230_00015,G,15 RUE SAINT BERNARD,
404293318,00022,40429331800022,O,2001-12-30,NN,,,2013-08-25T03:55:04,true,3,,577,,RUE,DE LA VILLETTE,02200,VAUXBUIN,,,02770,,,,,,,,,,,,,,,,,,,2008-01-01,A,,,,,68.20B,NAFRev2,N,3.300903,49.359667,0.95,housenumber,577 Rue de la Villette 02200 Vauxbuin,02770_0280_00577,G,577 RUE DE LA VILLETTE,
404293441,00022,40429344100022,O,2001-12-29,NN,,,2013-03-22T04:38:39,true,3,,577,,RUE,DE LA VILLETTE,02200,VAUXBUIN,,,02770,,,,,,,,,,,,,,,,,,,2008-01-01,A,,,,,68.20B,NAFRev2,N,3.300903,49.359667,0.95,housenumber,577 Rue de la Villette 02200 Vauxbuin,02770_0280_00577,G,577 RUE DE LA VILLETTE,
404580011,00017,40458001100017,O,1900-01-01,NN,,,2016-12-15T09:17:37,true,5,,245,,RUE,DES TREILLIS,02200,VAUXBUIN,,,02770,,,,,,,,,,,,,,,,,,,2016-12-01,F,,,,,71.20B,NAFRev2,N,3.292646,49.360273,0.95,housenumber,245 Rue des Treillis 02200 Vauxbuin,02770_0270_00245,G,245 RUE DES TREILLIS,
410147888,00037,41014788800037,O,2000-06-01,NN,,,2021-10-09T08:42:34,true,6,,205,,RTE,DE PARIS,02200,VAUXBUIN,,,02770,,,,,,,,,,,,,,,,,,,2021-10-07,F,,,,,47.30Z,NAFRev2,N,3.304127,49.364078,0.84,housenumber,205 Route de Paris 02200 Vauxbuin,02770_0170_00205,G,205 ROUTE DE PARIS,
411615552,00014,41161555200014,O,1997-03-01,NN,,,2008-11-08T01:25:31,false,4,,340,,RTE,DE PARIS,02200,VAUXBUIN,,,02770,,,,,,,,,,,,,,,,,,,2002-06-18,F,,,,,71.3C,NAF1993,O,3.302546,49.363637,0.84,housenumber,340 Route de Paris 02200 Vauxbuin,02770_0170_00340,G,340 ROUTE DE PARIS,
413621236,00012,41362123600012,O,1997-08-31,NN,,,2021-10-12T15:58:13,true,7,RN 2,,,LD,LA PIECE DE LA BETE,02200,VAUXBUIN,,,02770,,,,,,,,,,,,,,,,,,,2021-10-01,A,,,,,68.10Z,NAFRev2,N,,,0,,,,,,
414139329,00018,41413932900018,O,1997-10-01,NN,,,,true,1,,317,,RUE,DE LA VILLETTE,02200,VAUXBUIN,,,02770,,,,,,,,,,,,,,,,,,,2000-03-17,F,,,,,45.2V,NAF1993,O,3.301998,49.361741,0.95,housenumber,317 Rue de la Villette 02200 Vauxbuin,02770_0280_00317,G,317 RUE DE LA VILLETTE,